Build #34

Build: #34 failed Changes by Stanislaw Osinski

Stages & jobs

  1. Compile and test

  2. Package

  3. Upload

Logs

The following logs have been generated by the jobs in this plan.
  • Expand all
  • Collapse all
Job Logs
Collapse JDK 1.7 Compile and test Download or View
27-Jul-2020 11:53:33 [INFO] Scanning for projects...
27-Jul-2020 11:53:33 [INFO]
27-Jul-2020 11:53:33 [INFO] -------------------< com.carrotsearch:smartsprites >--------------------
27-Jul-2020 11:53:33 [INFO] Building SmartSprites 0.2.14-SNAPSHOT
27-Jul-2020 11:53:33 [INFO] --------------------------------[ jar ]---------------------------------
27-Jul-2020 11:53:39 [INFO] Downloading from central: https://repo.maven.apache.org/maven2/org/apache/maven/plugins/maven-enforcer-plugin/1.2/maven-enforcer-plugin-1.2.pom
27-Jul-2020 11:53:39 [INFO] ------------------------------------------------------------------------
27-Jul-2020 11:53:39 [INFO] BUILD FAILURE
27-Jul-2020 11:53:39 [INFO] ------------------------------------------------------------------------
27-Jul-2020 11:53:39 [INFO] Total time:  5.511 s
27-Jul-2020 11:53:39 [INFO] Finished at: 2020-07-27T10:53:39+01:00
27-Jul-2020 11:53:39 [INFO] ------------------------------------------------------------------------
27-Jul-2020 11:53:39 [ERROR] Plugin org.apache.maven.plugins:maven-enforcer-plugin:1.2 or one of its dependencies could not be resolved: Failed to read artifact descriptor for org.apache.maven.plugins:maven-enforcer-plugin:jar:1.2: Could not transfer artifact org.apache.maven.plugins:maven-enforcer-plugin:pom:1.2 from/to central (https://repo.maven.apache.org/maven2): Received fatal alert: protocol_version -> [Help 1]
27-Jul-2020 11:53:39 [ERROR]
27-Jul-2020 11:53:39 [ERROR] To see the full stack trace of the errors, re-run Maven with the -e switch.
27-Jul-2020 11:53:39 [ERROR] Re-run Maven using the -X switch to enable full debug logging.
27-Jul-2020 11:53:39 [ERROR]
27-Jul-2020 11:53:39 [ERROR] For more information about the errors and possible solutions, please read the following articles:
27-Jul-2020 11:53:39 [ERROR] [Help 1] http://cwiki.apache.org/confluence/display/MAVEN/PluginResolutionException