Build #12

Build: #12 failed Manual run by Stanislaw Osinski

Stages & jobs

  1. Compile and test

  2. Package

  3. Upload

Build result summary

Details

Completed
Duration
12 seconds
Labels
None
Revision
3db49879fafe1149347f74db9dfb4ea5d51a96fe 3db49879fafe1149347f74db9dfb4ea5d51a96fe
Total tests
435
Fixed in
#14 (Manual run by Stanislaw Osinski)

Tests

Responsible

No one has taken responsibility for this failure

Configuration changes

Plan configuration has changed since the last successful build. See the plan audit log for more details.

Tests

Existing test failures 2
Status Test Failing since View job Duration
java.lang.AssertionError: file:<E:\xml-data\build-dir\SMARTSPRITES-SOFTWARE-JDK18\test\variable-substitution-in-sprite-image-path\css\style-sprite.css> and file:<E:\xml-data\build-dir\SMARTSPRITES-SOFTWARE-JDK18\test\variable-substitution-in-sprite-image-path\css\style-expected.css> do not have same contents: line:<7>, expected:<'  background-image: url('../img/sprite-4f597e065cfe89bf84fdb6594bd3b59a.png');'> but was:<'  background-image: url('../img/sprite-10eb4d8ef5d4b17c7e1173b2213ec6d1.png');'> line:<14>, expected:<'  background-image: url('../img/sprite-4f597e065cfe89bf84fdb6594bd3b59a.png');'> but was:<'  background-image: url('../img/sprite-10eb4d8ef5d4b17c7e1173b2213ec6d1.png');'>
java.lang.AssertionError: file:<E:\xml-data\build-dir\SMARTSPRITES-SOFTWARE-JDK18\test\variable-substitution-in-sprite-image-path\css\style-sprite.css> and file:<E:\xml-data\build-dir\SMARTSPRITES-SOFTWARE-JDK18\test\variable-substitution-in-sprite-image-path\css\style-expected.css> do not have same contents:
line:<7>, expected:<'  background-image: url('../img/sprite-4f597e065cfe89bf84fdb6594bd3b59a.png');'> but was:<'  background-image: url('../img/sprite-10eb4d8ef5d4b17c7e1173b2213ec6d1.png');'>
line:<14>, expected:<'  background-image: url('../img/sprite-4f597e065cfe89bf84fdb6594bd3b59a.png');'> but was:<'  background-image: url('../img/sprite-10eb4d8ef5d4b17c7e1173b2213ec6d1.png');'>
	at org.fest.assertions.Fail.failure(Fail.java:228)
	at org.fest.assertions.Assert.failure(Assert.java:149)
	at org.fest.assertions.Assert.fail(Assert.java:140)
	at org.fest.assertions.FileAssert.fail(FileAssert.java:152)
(33 more lines...)
java.lang.AssertionError: file:<E:\xml-data\build-dir\SMARTSPRITES-SOFTWARE-JDK18\test\sprite-image-uid-md5\css\style-sprite.css> and file:<E:\xml-data\build-dir\SMARTSPRITES-SOFTWARE-JDK18\test\sprite-image-uid-md5\css\style-expected.css> do not have same contents: line:<7>, expected:<'  background-image: url('../img/sprite.png?4f597e065cfe89bf84fdb6594bd3b59a');'> but was:<'  background-image: url('../img/sprite.png?10eb4d8ef5d4b17c7e1173b2213ec6d1');'> line:<14>, expected:<'  background-image: url('../img/sprite.png?4f597e065cfe89bf84fdb6594bd3b59a');'> but was:<'  background-image: url('../img/sprite.png?10eb4d8ef5d4b17c7e1173b2213ec6d1');'>
java.lang.AssertionError: file:<E:\xml-data\build-dir\SMARTSPRITES-SOFTWARE-JDK18\test\sprite-image-uid-md5\css\style-sprite.css> and file:<E:\xml-data\build-dir\SMARTSPRITES-SOFTWARE-JDK18\test\sprite-image-uid-md5\css\style-expected.css> do not have same contents:
line:<7>, expected:<'  background-image: url('../img/sprite.png?4f597e065cfe89bf84fdb6594bd3b59a');'> but was:<'  background-image: url('../img/sprite.png?10eb4d8ef5d4b17c7e1173b2213ec6d1');'>
line:<14>, expected:<'  background-image: url('../img/sprite.png?4f597e065cfe89bf84fdb6594bd3b59a');'> but was:<'  background-image: url('../img/sprite.png?10eb4d8ef5d4b17c7e1173b2213ec6d1');'>
	at org.fest.assertions.Fail.failure(Fail.java:228)
	at org.fest.assertions.Assert.failure(Assert.java:149)
	at org.fest.assertions.Assert.fail(Assert.java:140)
	at org.fest.assertions.FileAssert.fail(FileAssert.java:152)
(33 more lines...)