Build #1

Build: #1 failed Rebuilt by Stanislaw Osinski

Stages & jobs

  1. Compile and test

Build result summary

Details

Completed
Duration
53 seconds
Labels
None
Revision
bca07703174b39abc031b5746a52f9f1c2510e36 bca07703174b39abc031b5746a52f9f1c2510e36
Total tests
725
Fixed in
#2 (Manual run by Stanislaw Osinski)
Number of retries
2

Tests

Responsible

No one has taken responsibility for this failure

Tests

New test failures 2
Status Test View job Duration
Collapse Failed SpriteBuilderTest variableSubstitutionInSpriteImagePath History
JDK 1.8 < 1 sec
java.lang.AssertionError: file:<E:\bamboo-home-4\xml-data\build-dir\SMARTSPRITES-SOFTWARE-JDK18\test\variable-substitution-in-sprite-image-path\css\style-sprite.css> and file:<E:\bamboo-home-4\xml-data\build-dir\SMARTSPRITES-SOFTWARE-JDK18\test\variable-substitution-in-sprite-image-path\css\style-expected.css> do not have same contents: line:<7>, expected:<'  background-image: url('../img/sprite-4f597e065cfe89bf84fdb6594bd3b59a.png');'> but was:<'  background-image: url('../img/sprite-10eb4d8ef5d4b17c7e1173b2213ec6d1.png');'> line:<14>, expected:<'  background-image: url('../img/sprite-4f597e065cfe89bf84fdb6594bd3b59a.png');'> but was:<'  background-image: url('../img/sprite-10eb4d8ef5d4b17c7e1173b2213ec6d1.png');'>
java.lang.AssertionError: file:<E:\bamboo-home-4\xml-data\build-dir\SMARTSPRITES-SOFTWARE-JDK18\test\variable-substitution-in-sprite-image-path\css\style-sprite.css> and file:<E:\bamboo-home-4\xml-data\build-dir\SMARTSPRITES-SOFTWARE-JDK18\test\variable-substitution-in-sprite-image-path\css\style-expected.css> do not have same contents:
line:<7>, expected:<'  background-image: url('../img/sprite-4f597e065cfe89bf84fdb6594bd3b59a.png');'> but was:<'  background-image: url('../img/sprite-10eb4d8ef5d4b17c7e1173b2213ec6d1.png');'>
line:<14>, expected:<'  background-image: url('../img/sprite-4f597e065cfe89bf84fdb6594bd3b59a.png');'> but was:<'  background-image: url('../img/sprite-10eb4d8ef5d4b17c7e1173b2213ec6d1.png');'>
	at org.fest.assertions.Fail.failure(Fail.java:228)
	at org.fest.assertions.Assert.failure(Assert.java:149)
	at org.fest.assertions.Assert.fail(Assert.java:140)
	at org.fest.assertions.FileAssert.fail(FileAssert.java:152)
(33 more lines...)
Collapse Failed SpriteBuilderTest testSpriteImageUidMd5 History
JDK 1.8 < 1 sec
java.lang.AssertionError: file:<E:\bamboo-home-4\xml-data\build-dir\SMARTSPRITES-SOFTWARE-JDK18\test\sprite-image-uid-md5\css\style-sprite.css> and file:<E:\bamboo-home-4\xml-data\build-dir\SMARTSPRITES-SOFTWARE-JDK18\test\sprite-image-uid-md5\css\style-expected.css> do not have same contents: line:<7>, expected:<'  background-image: url('../img/sprite.png?4f597e065cfe89bf84fdb6594bd3b59a');'> but was:<'  background-image: url('../img/sprite.png?10eb4d8ef5d4b17c7e1173b2213ec6d1');'> line:<14>, expected:<'  background-image: url('../img/sprite.png?4f597e065cfe89bf84fdb6594bd3b59a');'> but was:<'  background-image: url('../img/sprite.png?10eb4d8ef5d4b17c7e1173b2213ec6d1');'>
java.lang.AssertionError: file:<E:\bamboo-home-4\xml-data\build-dir\SMARTSPRITES-SOFTWARE-JDK18\test\sprite-image-uid-md5\css\style-sprite.css> and file:<E:\bamboo-home-4\xml-data\build-dir\SMARTSPRITES-SOFTWARE-JDK18\test\sprite-image-uid-md5\css\style-expected.css> do not have same contents:
line:<7>, expected:<'  background-image: url('../img/sprite.png?4f597e065cfe89bf84fdb6594bd3b59a');'> but was:<'  background-image: url('../img/sprite.png?10eb4d8ef5d4b17c7e1173b2213ec6d1');'>
line:<14>, expected:<'  background-image: url('../img/sprite.png?4f597e065cfe89bf84fdb6594bd3b59a');'> but was:<'  background-image: url('../img/sprite.png?10eb4d8ef5d4b17c7e1173b2213ec6d1');'>
	at org.fest.assertions.Fail.failure(Fail.java:228)
	at org.fest.assertions.Assert.failure(Assert.java:149)
	at org.fest.assertions.Assert.fail(Assert.java:140)
	at org.fest.assertions.FileAssert.fail(FileAssert.java:152)
(33 more lines...)