Build #228

Build: #228 failed

Job: JDK 10 failed

Stages & jobs

  1. Compile and test

  2. Package

One error: Test case result

The below summarizes the result of the test "One error" in build 228 of RandomizedTesting - Software - JDK 10. View test case history
Description
One error
Test class
com.carrotsearch.ant.tasks.junit4.it.TestIfNoTestsOption
Method
oneError
Duration
< 1 sec
Status
Failed (New Failure)

Error Log

org.apache.tools.ant.BuildException: java.io.FileNotFoundException: C:\Users\bamboo\AppData\Local\Temp\RNDTEST-SOFTWARE-RRJ10\surefire12705780684809620788\..%5C..%5C..%5C..%5C..%5C..%5C..%5Cbamboo%5Cxml-data%5Cbuild-dir%5CRNDTEST-SOFTWARE-RRJ10%5Cjunit4-ant%5Ctarget%5Ctest-classes\junit4.xml (The system cannot find the path specified)
Caused by: java.io.FileNotFoundException: C:\Users\bamboo\AppData\Local\Temp\RNDTEST-SOFTWARE-RRJ10\surefire12705780684809620788\..%5C..%5C..%5C..%5C..%5C..%5C..%5Cbamboo%5Cxml-data%5Cbuild-dir%5CRNDTEST-SOFTWARE-RRJ10%5Cjunit4-ant%5Ctarget%5Ctest-classes\junit4.xml (The system cannot find the path specified)