Build #228

Build: #228 failed

Job: JDK 10 failed

Stages & jobs

  1. Compile and test

  2. Package

Test results

  • 2,663 tests in total
  • 89 tests failed
  • 89 failures are new
  • 9 tests were quarantined / skipped
  • 32 seconds taken in total.

Build 228 has the following 89 errors: 89 new failure(s) occurred since the previous build.

New test failures 89
Status Test Duration
Collapse Failed TestAltJavaVendors altVendors History
< 1 sec
org.apache.tools.ant.BuildException: java.io.FileNotFoundException: C:\Users\bamboo\AppData\Local\Temp\RNDTEST-SOFTWARE-RRJ10\surefire12705780684809620788\..%5C..%5C..%5C..%5C..%5C..%5C..%5Cbamboo%5Cxml-data%5Cbuild-dir%5CRNDTEST-SOFTWARE-RRJ10%5Cjunit4-ant%5Ctarget%5Ctest-classes\junit4.xml (The system cannot find the path specified)
Caused by: java.io.FileNotFoundException: C:\Users\bamboo\AppData\Local\Temp\RNDTEST-SOFTWARE-RRJ10\surefire12705780684809620788\..%5C..%5C..%5C..%5C..%5C..%5C..%5Cbamboo%5Cxml-data%5Cbuild-dir%5CRNDTEST-SOFTWARE-RRJ10%5Cjunit4-ant%5Ctarget%5Ctest-classes\junit4.xml (The system cannot find the path specified)
Collapse Failed TestAntXmlReport antxml History
< 1 sec
org.apache.tools.ant.BuildException: java.io.FileNotFoundException: C:\Users\bamboo\AppData\Local\Temp\RNDTEST-SOFTWARE-RRJ10\surefire12705780684809620788\..%5C..%5C..%5C..%5C..%5C..%5C..%5Cbamboo%5Cxml-data%5Cbuild-dir%5CRNDTEST-SOFTWARE-RRJ10%5Cjunit4-ant%5Ctarget%5Ctest-classes\junit4.xml (The system cannot find the path specified)
Caused by: java.io.FileNotFoundException: C:\Users\bamboo\AppData\Local\Temp\RNDTEST-SOFTWARE-RRJ10\surefire12705780684809620788\..%5C..%5C..%5C..%5C..%5C..%5C..%5Cbamboo%5Cxml-data%5Cbuild-dir%5CRNDTEST-SOFTWARE-RRJ10%5Cjunit4-ant%5Ctarget%5Ctest-classes\junit4.xml (The system cannot find the path specified)
Collapse Failed TestAntXmlReport summary History
< 1 sec
org.apache.tools.ant.BuildException: java.io.FileNotFoundException: C:\Users\bamboo\AppData\Local\Temp\RNDTEST-SOFTWARE-RRJ10\surefire12705780684809620788\..%5C..%5C..%5C..%5C..%5C..%5C..%5Cbamboo%5Cxml-data%5Cbuild-dir%5CRNDTEST-SOFTWARE-RRJ10%5Cjunit4-ant%5Ctarget%5Ctest-classes\junit4.xml (The system cannot find the path specified)
Caused by: java.io.FileNotFoundException: C:\Users\bamboo\AppData\Local\Temp\RNDTEST-SOFTWARE-RRJ10\surefire12705780684809620788\..%5C..%5C..%5C..%5C..%5C..%5C..%5Cbamboo%5Cxml-data%5Cbuild-dir%5CRNDTEST-SOFTWARE-RRJ10%5Cjunit4-ant%5Ctarget%5Ctest-classes\junit4.xml (The system cannot find the path specified)
Collapse Failed TestChildVmSysprops sysprops History
< 1 sec
org.apache.tools.ant.BuildException: java.io.FileNotFoundException: C:\Users\bamboo\AppData\Local\Temp\RNDTEST-SOFTWARE-RRJ10\surefire12705780684809620788\..%5C..%5C..%5C..%5C..%5C..%5C..%5Cbamboo%5Cxml-data%5Cbuild-dir%5CRNDTEST-SOFTWARE-RRJ10%5Cjunit4-ant%5Ctarget%5Ctest-classes\junit4.xml (The system cannot find the path specified)
Caused by: java.io.FileNotFoundException: C:\Users\bamboo\AppData\Local\Temp\RNDTEST-SOFTWARE-RRJ10\surefire12705780684809620788\..%5C..%5C..%5C..%5C..%5C..%5C..%5Cbamboo%5Cxml-data%5Cbuild-dir%5CRNDTEST-SOFTWARE-RRJ10%5Cjunit4-ant%5Ctarget%5Ctest-classes\junit4.xml (The system cannot find the path specified)
Collapse Failed TestCrashesAndExceptions jvmcrash History
< 1 sec
org.apache.tools.ant.BuildException: java.io.FileNotFoundException: C:\Users\bamboo\AppData\Local\Temp\RNDTEST-SOFTWARE-RRJ10\surefire12705780684809620788\..%5C..%5C..%5C..%5C..%5C..%5C..%5Cbamboo%5Cxml-data%5Cbuild-dir%5CRNDTEST-SOFTWARE-RRJ10%5Cjunit4-ant%5Ctarget%5Ctest-classes\junit4.xml (The system cannot find the path specified)
Caused by: java.io.FileNotFoundException: C:\Users\bamboo\AppData\Local\Temp\RNDTEST-SOFTWARE-RRJ10\surefire12705780684809620788\..%5C..%5C..%5C..%5C..%5C..%5C..%5Cbamboo%5Cxml-data%5Cbuild-dir%5CRNDTEST-SOFTWARE-RRJ10%5Cjunit4-ant%5Ctarget%5Ctest-classes\junit4.xml (The system cannot find the path specified)
Collapse Failed TestCrashesAndExceptions slavehanging History
< 1 sec
org.apache.tools.ant.BuildException: java.io.FileNotFoundException: C:\Users\bamboo\AppData\Local\Temp\RNDTEST-SOFTWARE-RRJ10\surefire12705780684809620788\..%5C..%5C..%5C..%5C..%5C..%5C..%5Cbamboo%5Cxml-data%5Cbuild-dir%5CRNDTEST-SOFTWARE-RRJ10%5Cjunit4-ant%5Ctarget%5Ctest-classes\junit4.xml (The system cannot find the path specified)
Caused by: java.io.FileNotFoundException: C:\Users\bamboo\AppData\Local\Temp\RNDTEST-SOFTWARE-RRJ10\surefire12705780684809620788\..%5C..%5C..%5C..%5C..%5C..%5C..%5Cbamboo%5Cxml-data%5Cbuild-dir%5CRNDTEST-SOFTWARE-RRJ10%5Cjunit4-ant%5Ctarget%5Ctest-classes\junit4.xml (The system cannot find the path specified)
Collapse Failed TestCwdConflict cwdconflict History
< 1 sec
org.apache.tools.ant.BuildException: java.io.FileNotFoundException: C:\Users\bamboo\AppData\Local\Temp\RNDTEST-SOFTWARE-RRJ10\surefire12705780684809620788\..%5C..%5C..%5C..%5C..%5C..%5C..%5Cbamboo%5Cxml-data%5Cbuild-dir%5CRNDTEST-SOFTWARE-RRJ10%5Cjunit4-ant%5Ctarget%5Ctest-classes\junit4.xml (The system cannot find the path specified)
Caused by: java.io.FileNotFoundException: C:\Users\bamboo\AppData\Local\Temp\RNDTEST-SOFTWARE-RRJ10\surefire12705780684809620788\..%5C..%5C..%5C..%5C..%5C..%5C..%5Cbamboo%5Cxml-data%5Cbuild-dir%5CRNDTEST-SOFTWARE-RRJ10%5Cjunit4-ant%5Ctarget%5Ctest-classes\junit4.xml (The system cannot find the path specified)
Collapse Failed TestDuplicateResourceCollections duplicateResourceCollectionEntries History
< 1 sec
org.apache.tools.ant.BuildException: java.io.FileNotFoundException: C:\Users\bamboo\AppData\Local\Temp\RNDTEST-SOFTWARE-RRJ10\surefire12705780684809620788\..%5C..%5C..%5C..%5C..%5C..%5C..%5Cbamboo%5Cxml-data%5Cbuild-dir%5CRNDTEST-SOFTWARE-RRJ10%5Cjunit4-ant%5Ctarget%5Ctest-classes\junit4.xml (The system cannot find the path specified)
Caused by: java.io.FileNotFoundException: C:\Users\bamboo\AppData\Local\Temp\RNDTEST-SOFTWARE-RRJ10\surefire12705780684809620788\..%5C..%5C..%5C..%5C..%5C..%5C..%5Cbamboo%5Cxml-data%5Cbuild-dir%5CRNDTEST-SOFTWARE-RRJ10%5Cjunit4-ant%5Ctarget%5Ctest-classes\junit4.xml (The system cannot find the path specified)
Collapse Failed TestFileEncodings checkTypicalEncodings History
< 1 sec
org.apache.tools.ant.BuildException: java.io.FileNotFoundException: C:\Users\bamboo\AppData\Local\Temp\RNDTEST-SOFTWARE-RRJ10\surefire12705780684809620788\..%5C..%5C..%5C..%5C..%5C..%5C..%5Cbamboo%5Cxml-data%5Cbuild-dir%5CRNDTEST-SOFTWARE-RRJ10%5Cjunit4-ant%5Ctarget%5Ctest-classes\junit4.xml (The system cannot find the path specified)
Caused by: java.io.FileNotFoundException: C:\Users\bamboo\AppData\Local\Temp\RNDTEST-SOFTWARE-RRJ10\surefire12705780684809620788\..%5C..%5C..%5C..%5C..%5C..%5C..%5Cbamboo%5Cxml-data%5Cbuild-dir%5CRNDTEST-SOFTWARE-RRJ10%5Cjunit4-ant%5Ctarget%5Ctest-classes\junit4.xml (The system cannot find the path specified)
Collapse Failed TestFiltering classfilter History
< 1 sec
org.apache.tools.ant.BuildException: java.io.FileNotFoundException: C:\Users\bamboo\AppData\Local\Temp\RNDTEST-SOFTWARE-RRJ10\surefire12705780684809620788\..%5C..%5C..%5C..%5C..%5C..%5C..%5Cbamboo%5Cxml-data%5Cbuild-dir%5CRNDTEST-SOFTWARE-RRJ10%5Cjunit4-ant%5Ctarget%5Ctest-classes\junit4.xml (The system cannot find the path specified)
Caused by: java.io.FileNotFoundException: C:\Users\bamboo\AppData\Local\Temp\RNDTEST-SOFTWARE-RRJ10\surefire12705780684809620788\..%5C..%5C..%5C..%5C..%5C..%5C..%5Cbamboo%5Cxml-data%5Cbuild-dir%5CRNDTEST-SOFTWARE-RRJ10%5Cjunit4-ant%5Ctarget%5Ctest-classes\junit4.xml (The system cannot find the path specified)
Collapse Failed TestFiltering filterexpression History
< 1 sec
org.apache.tools.ant.BuildException: java.io.FileNotFoundException: C:\Users\bamboo\AppData\Local\Temp\RNDTEST-SOFTWARE-RRJ10\surefire12705780684809620788\..%5C..%5C..%5C..%5C..%5C..%5C..%5Cbamboo%5Cxml-data%5Cbuild-dir%5CRNDTEST-SOFTWARE-RRJ10%5Cjunit4-ant%5Ctarget%5Ctest-classes\junit4.xml (The system cannot find the path specified)
Caused by: java.io.FileNotFoundException: C:\Users\bamboo\AppData\Local\Temp\RNDTEST-SOFTWARE-RRJ10\surefire12705780684809620788\..%5C..%5C..%5C..%5C..%5C..%5C..%5Cbamboo%5Cxml-data%5Cbuild-dir%5CRNDTEST-SOFTWARE-RRJ10%5Cjunit4-ant%5Ctarget%5Ctest-classes\junit4.xml (The system cannot find the path specified)
Collapse Failed TestFiltering methodfilter History
< 1 sec
org.apache.tools.ant.BuildException: java.io.FileNotFoundException: C:\Users\bamboo\AppData\Local\Temp\RNDTEST-SOFTWARE-RRJ10\surefire12705780684809620788\..%5C..%5C..%5C..%5C..%5C..%5C..%5Cbamboo%5Cxml-data%5Cbuild-dir%5CRNDTEST-SOFTWARE-RRJ10%5Cjunit4-ant%5Ctarget%5Ctest-classes\junit4.xml (The system cannot find the path specified)
Caused by: java.io.FileNotFoundException: C:\Users\bamboo\AppData\Local\Temp\RNDTEST-SOFTWARE-RRJ10\surefire12705780684809620788\..%5C..%5C..%5C..%5C..%5C..%5C..%5Cbamboo%5Cxml-data%5Cbuild-dir%5CRNDTEST-SOFTWARE-RRJ10%5Cjunit4-ant%5Ctarget%5Ctest-classes\junit4.xml (The system cannot find the path specified)
Collapse Failed TestHeartbeat testHeartbeat History
< 1 sec
org.apache.tools.ant.BuildException: java.io.FileNotFoundException: C:\Users\bamboo\AppData\Local\Temp\RNDTEST-SOFTWARE-RRJ10\surefire12705780684809620788\..%5C..%5C..%5C..%5C..%5C..%5C..%5Cbamboo%5Cxml-data%5Cbuild-dir%5CRNDTEST-SOFTWARE-RRJ10%5Cjunit4-ant%5Ctarget%5Ctest-classes\junit4.xml (The system cannot find the path specified)
Caused by: java.io.FileNotFoundException: C:\Users\bamboo\AppData\Local\Temp\RNDTEST-SOFTWARE-RRJ10\surefire12705780684809620788\..%5C..%5C..%5C..%5C..%5C..%5C..%5Cbamboo%5Cxml-data%5Cbuild-dir%5CRNDTEST-SOFTWARE-RRJ10%5Cjunit4-ant%5Ctarget%5Ctest-classes\junit4.xml (The system cannot find the path specified)
Collapse Failed TestIfNoTestsOption allFilteredOut History
< 1 sec
org.apache.tools.ant.BuildException: java.io.FileNotFoundException: C:\Users\bamboo\AppData\Local\Temp\RNDTEST-SOFTWARE-RRJ10\surefire12705780684809620788\..%5C..%5C..%5C..%5C..%5C..%5C..%5Cbamboo%5Cxml-data%5Cbuild-dir%5CRNDTEST-SOFTWARE-RRJ10%5Cjunit4-ant%5Ctarget%5Ctest-classes\junit4.xml (The system cannot find the path specified)
Caused by: java.io.FileNotFoundException: C:\Users\bamboo\AppData\Local\Temp\RNDTEST-SOFTWARE-RRJ10\surefire12705780684809620788\..%5C..%5C..%5C..%5C..%5C..%5C..%5Cbamboo%5Cxml-data%5Cbuild-dir%5CRNDTEST-SOFTWARE-RRJ10%5Cjunit4-ant%5Ctarget%5Ctest-classes\junit4.xml (The system cannot find the path specified)
Collapse Failed TestIfNoTestsOption oneAssumptionIgnored History
< 1 sec
org.apache.tools.ant.BuildException: java.io.FileNotFoundException: C:\Users\bamboo\AppData\Local\Temp\RNDTEST-SOFTWARE-RRJ10\surefire12705780684809620788\..%5C..%5C..%5C..%5C..%5C..%5C..%5Cbamboo%5Cxml-data%5Cbuild-dir%5CRNDTEST-SOFTWARE-RRJ10%5Cjunit4-ant%5Ctarget%5Ctest-classes\junit4.xml (The system cannot find the path specified)
Caused by: java.io.FileNotFoundException: C:\Users\bamboo\AppData\Local\Temp\RNDTEST-SOFTWARE-RRJ10\surefire12705780684809620788\..%5C..%5C..%5C..%5C..%5C..%5C..%5Cbamboo%5Cxml-data%5Cbuild-dir%5CRNDTEST-SOFTWARE-RRJ10%5Cjunit4-ant%5Ctarget%5Ctest-classes\junit4.xml (The system cannot find the path specified)
Collapse Failed TestIfNoTestsOption oneError History
< 1 sec
org.apache.tools.ant.BuildException: java.io.FileNotFoundException: C:\Users\bamboo\AppData\Local\Temp\RNDTEST-SOFTWARE-RRJ10\surefire12705780684809620788\..%5C..%5C..%5C..%5C..%5C..%5C..%5Cbamboo%5Cxml-data%5Cbuild-dir%5CRNDTEST-SOFTWARE-RRJ10%5Cjunit4-ant%5Ctarget%5Ctest-classes\junit4.xml (The system cannot find the path specified)
Caused by: java.io.FileNotFoundException: C:\Users\bamboo\AppData\Local\Temp\RNDTEST-SOFTWARE-RRJ10\surefire12705780684809620788\..%5C..%5C..%5C..%5C..%5C..%5C..%5Cbamboo%5Cxml-data%5Cbuild-dir%5CRNDTEST-SOFTWARE-RRJ10%5Cjunit4-ant%5Ctarget%5Ctest-classes\junit4.xml (The system cannot find the path specified)
Collapse Failed TestIfNoTestsOption oneFailure History
< 1 sec
org.apache.tools.ant.BuildException: java.io.FileNotFoundException: C:\Users\bamboo\AppData\Local\Temp\RNDTEST-SOFTWARE-RRJ10\surefire12705780684809620788\..%5C..%5C..%5C..%5C..%5C..%5C..%5Cbamboo%5Cxml-data%5Cbuild-dir%5CRNDTEST-SOFTWARE-RRJ10%5Cjunit4-ant%5Ctarget%5Ctest-classes\junit4.xml (The system cannot find the path specified)
Caused by: java.io.FileNotFoundException: C:\Users\bamboo\AppData\Local\Temp\RNDTEST-SOFTWARE-RRJ10\surefire12705780684809620788\..%5C..%5C..%5C..%5C..%5C..%5C..%5Cbamboo%5Cxml-data%5Cbuild-dir%5CRNDTEST-SOFTWARE-RRJ10%5Cjunit4-ant%5Ctarget%5Ctest-classes\junit4.xml (The system cannot find the path specified)
Collapse Failed TestIfNoTestsOption oneIgnored History
< 1 sec
org.apache.tools.ant.BuildException: java.io.FileNotFoundException: C:\Users\bamboo\AppData\Local\Temp\RNDTEST-SOFTWARE-RRJ10\surefire12705780684809620788\..%5C..%5C..%5C..%5C..%5C..%5C..%5Cbamboo%5Cxml-data%5Cbuild-dir%5CRNDTEST-SOFTWARE-RRJ10%5Cjunit4-ant%5Ctarget%5Ctest-classes\junit4.xml (The system cannot find the path specified)
Caused by: java.io.FileNotFoundException: C:\Users\bamboo\AppData\Local\Temp\RNDTEST-SOFTWARE-RRJ10\surefire12705780684809620788\..%5C..%5C..%5C..%5C..%5C..%5C..%5Cbamboo%5Cxml-data%5Cbuild-dir%5CRNDTEST-SOFTWARE-RRJ10%5Cjunit4-ant%5Ctarget%5Ctest-classes\junit4.xml (The system cannot find the path specified)
Collapse Failed TestIfNoTestsOption oneSuccessfull History
< 1 sec
org.apache.tools.ant.BuildException: java.io.FileNotFoundException: C:\Users\bamboo\AppData\Local\Temp\RNDTEST-SOFTWARE-RRJ10\surefire12705780684809620788\..%5C..%5C..%5C..%5C..%5C..%5C..%5Cbamboo%5Cxml-data%5Cbuild-dir%5CRNDTEST-SOFTWARE-RRJ10%5Cjunit4-ant%5Ctarget%5Ctest-classes\junit4.xml (The system cannot find the path specified)
Caused by: java.io.FileNotFoundException: C:\Users\bamboo\AppData\Local\Temp\RNDTEST-SOFTWARE-RRJ10\surefire12705780684809620788\..%5C..%5C..%5C..%5C..%5C..%5C..%5Cbamboo%5Cxml-data%5Cbuild-dir%5CRNDTEST-SOFTWARE-RRJ10%5Cjunit4-ant%5Ctarget%5Ctest-classes\junit4.xml (The system cannot find the path specified)
Collapse Failed TestJUnitCompat junitcompat1 History
< 1 sec
org.apache.tools.ant.BuildException: java.io.FileNotFoundException: C:\Users\bamboo\AppData\Local\Temp\RNDTEST-SOFTWARE-RRJ10\surefire12705780684809620788\..%5C..%5C..%5C..%5C..%5C..%5C..%5Cbamboo%5Cxml-data%5Cbuild-dir%5CRNDTEST-SOFTWARE-RRJ10%5Cjunit4-ant%5Ctarget%5Ctest-classes\junit4.xml (The system cannot find the path specified)
Caused by: java.io.FileNotFoundException: C:\Users\bamboo\AppData\Local\Temp\RNDTEST-SOFTWARE-RRJ10\surefire12705780684809620788\..%5C..%5C..%5C..%5C..%5C..%5C..%5Cbamboo%5Cxml-data%5Cbuild-dir%5CRNDTEST-SOFTWARE-RRJ10%5Cjunit4-ant%5Ctarget%5Ctest-classes\junit4.xml (The system cannot find the path specified)
Collapse Failed TestJUnitCompat junitcompat2 History
< 1 sec
org.apache.tools.ant.BuildException: java.io.FileNotFoundException: C:\Users\bamboo\AppData\Local\Temp\RNDTEST-SOFTWARE-RRJ10\surefire12705780684809620788\..%5C..%5C..%5C..%5C..%5C..%5C..%5Cbamboo%5Cxml-data%5Cbuild-dir%5CRNDTEST-SOFTWARE-RRJ10%5Cjunit4-ant%5Ctarget%5Ctest-classes\junit4.xml (The system cannot find the path specified)
Caused by: java.io.FileNotFoundException: C:\Users\bamboo\AppData\Local\Temp\RNDTEST-SOFTWARE-RRJ10\surefire12705780684809620788\..%5C..%5C..%5C..%5C..%5C..%5C..%5Cbamboo%5Cxml-data%5Cbuild-dir%5CRNDTEST-SOFTWARE-RRJ10%5Cjunit4-ant%5Ctarget%5Ctest-classes\junit4.xml (The system cannot find the path specified)
Collapse Failed TestJUnitCompat junitcompat3 History
< 1 sec
org.apache.tools.ant.BuildException: java.io.FileNotFoundException: C:\Users\bamboo\AppData\Local\Temp\RNDTEST-SOFTWARE-RRJ10\surefire12705780684809620788\..%5C..%5C..%5C..%5C..%5C..%5C..%5Cbamboo%5Cxml-data%5Cbuild-dir%5CRNDTEST-SOFTWARE-RRJ10%5Cjunit4-ant%5Ctarget%5Ctest-classes\junit4.xml (The system cannot find the path specified)
Caused by: java.io.FileNotFoundException: C:\Users\bamboo\AppData\Local\Temp\RNDTEST-SOFTWARE-RRJ10\surefire12705780684809620788\..%5C..%5C..%5C..%5C..%5C..%5C..%5Cbamboo%5Cxml-data%5Cbuild-dir%5CRNDTEST-SOFTWARE-RRJ10%5Cjunit4-ant%5Ctarget%5Ctest-classes\junit4.xml (The system cannot find the path specified)
Collapse Failed TestJsonReport antxml History
< 1 sec
org.apache.tools.ant.BuildException: java.io.FileNotFoundException: C:\Users\bamboo\AppData\Local\Temp\RNDTEST-SOFTWARE-RRJ10\surefire12705780684809620788\..%5C..%5C..%5C..%5C..%5C..%5C..%5Cbamboo%5Cxml-data%5Cbuild-dir%5CRNDTEST-SOFTWARE-RRJ10%5Cjunit4-ant%5Ctarget%5Ctest-classes\junit4.xml (The system cannot find the path specified)
Caused by: java.io.FileNotFoundException: C:\Users\bamboo\AppData\Local\Temp\RNDTEST-SOFTWARE-RRJ10\surefire12705780684809620788\..%5C..%5C..%5C..%5C..%5C..%5C..%5Cbamboo%5Cxml-data%5Cbuild-dir%5CRNDTEST-SOFTWARE-RRJ10%5Cjunit4-ant%5Ctarget%5Ctest-classes\junit4.xml (The system cannot find the path specified)
Collapse Failed TestJvmLogging jvmverbose History
< 1 sec
org.apache.tools.ant.BuildException: java.io.FileNotFoundException: C:\Users\bamboo\AppData\Local\Temp\RNDTEST-SOFTWARE-RRJ10\surefire12705780684809620788\..%5C..%5C..%5C..%5C..%5C..%5C..%5Cbamboo%5Cxml-data%5Cbuild-dir%5CRNDTEST-SOFTWARE-RRJ10%5Cjunit4-ant%5Ctarget%5Ctest-classes\junit4.xml (The system cannot find the path specified)
Caused by: java.io.FileNotFoundException: C:\Users\bamboo\AppData\Local\Temp\RNDTEST-SOFTWARE-RRJ10\surefire12705780684809620788\..%5C..%5C..%5C..%5C..%5C..%5C..%5Cbamboo%5Cxml-data%5Cbuild-dir%5CRNDTEST-SOFTWARE-RRJ10%5Cjunit4-ant%5Ctarget%5Ctest-classes\junit4.xml (The system cannot find the path specified)
Collapse Failed TestJvmLogging sysouts History
< 1 sec
org.apache.tools.ant.BuildException: java.io.FileNotFoundException: C:\Users\bamboo\AppData\Local\Temp\RNDTEST-SOFTWARE-RRJ10\surefire12705780684809620788\..%5C..%5C..%5C..%5C..%5C..%5C..%5Cbamboo%5Cxml-data%5Cbuild-dir%5CRNDTEST-SOFTWARE-RRJ10%5Cjunit4-ant%5Ctarget%5Ctest-classes\junit4.xml (The system cannot find the path specified)
Caused by: java.io.FileNotFoundException: C:\Users\bamboo\AppData\Local\Temp\RNDTEST-SOFTWARE-RRJ10\surefire12705780684809620788\..%5C..%5C..%5C..%5C..%5C..%5C..%5Cbamboo%5Cxml-data%5Cbuild-dir%5CRNDTEST-SOFTWARE-RRJ10%5Cjunit4-ant%5Ctarget%5Ctest-classes\junit4.xml (The system cannot find the path specified)
Collapse Failed TestMiscJUnit4Attributes afterClassError History
< 1 sec
org.apache.tools.ant.BuildException: java.io.FileNotFoundException: C:\Users\bamboo\AppData\Local\Temp\RNDTEST-SOFTWARE-RRJ10\surefire12705780684809620788\..%5C..%5C..%5C..%5C..%5C..%5C..%5Cbamboo%5Cxml-data%5Cbuild-dir%5CRNDTEST-SOFTWARE-RRJ10%5Cjunit4-ant%5Ctarget%5Ctest-classes\junit4.xml (The system cannot find the path specified)
Caused by: java.io.FileNotFoundException: C:\Users\bamboo\AppData\Local\Temp\RNDTEST-SOFTWARE-RRJ10\surefire12705780684809620788\..%5C..%5C..%5C..%5C..%5C..%5C..%5Cbamboo%5Cxml-data%5Cbuild-dir%5CRNDTEST-SOFTWARE-RRJ10%5Cjunit4-ant%5Ctarget%5Ctest-classes\junit4.xml (The system cannot find the path specified)
Collapse Failed TestMiscJUnit4Attributes assertions History
< 1 sec
org.apache.tools.ant.BuildException: java.io.FileNotFoundException: C:\Users\bamboo\AppData\Local\Temp\RNDTEST-SOFTWARE-RRJ10\surefire12705780684809620788\..%5C..%5C..%5C..%5C..%5C..%5C..%5Cbamboo%5Cxml-data%5Cbuild-dir%5CRNDTEST-SOFTWARE-RRJ10%5Cjunit4-ant%5Ctarget%5Ctest-classes\junit4.xml (The system cannot find the path specified)
Caused by: java.io.FileNotFoundException: C:\Users\bamboo\AppData\Local\Temp\RNDTEST-SOFTWARE-RRJ10\surefire12705780684809620788\..%5C..%5C..%5C..%5C..%5C..%5C..%5Cbamboo%5Cxml-data%5Cbuild-dir%5CRNDTEST-SOFTWARE-RRJ10%5Cjunit4-ant%5Ctarget%5Ctest-classes\junit4.xml (The system cannot find the path specified)
Collapse Failed TestMiscJUnit4Attributes balancing History
< 1 sec
org.apache.tools.ant.BuildException: java.io.FileNotFoundException: C:\Users\bamboo\AppData\Local\Temp\RNDTEST-SOFTWARE-RRJ10\surefire12705780684809620788\..%5C..%5C..%5C..%5C..%5C..%5C..%5Cbamboo%5Cxml-data%5Cbuild-dir%5CRNDTEST-SOFTWARE-RRJ10%5Cjunit4-ant%5Ctarget%5Ctest-classes\junit4.xml (The system cannot find the path specified)
Caused by: java.io.FileNotFoundException: C:\Users\bamboo\AppData\Local\Temp\RNDTEST-SOFTWARE-RRJ10\surefire12705780684809620788\..%5C..%5C..%5C..%5C..%5C..%5C..%5Cbamboo%5Cxml-data%5Cbuild-dir%5CRNDTEST-SOFTWARE-RRJ10%5Cjunit4-ant%5Ctarget%5Ctest-classes\junit4.xml (The system cannot find the path specified)
Collapse Failed TestMiscJUnit4Attributes balancing_nohints History
< 1 sec
org.apache.tools.ant.BuildException: java.io.FileNotFoundException: C:\Users\bamboo\AppData\Local\Temp\RNDTEST-SOFTWARE-RRJ10\surefire12705780684809620788\..%5C..%5C..%5C..%5C..%5C..%5C..%5Cbamboo%5Cxml-data%5Cbuild-dir%5CRNDTEST-SOFTWARE-RRJ10%5Cjunit4-ant%5Ctarget%5Ctest-classes\junit4.xml (The system cannot find the path specified)
Caused by: java.io.FileNotFoundException: C:\Users\bamboo\AppData\Local\Temp\RNDTEST-SOFTWARE-RRJ10\surefire12705780684809620788\..%5C..%5C..%5C..%5C..%5C..%5C..%5Cbamboo%5Cxml-data%5Cbuild-dir%5CRNDTEST-SOFTWARE-RRJ10%5Cjunit4-ant%5Ctarget%5Ctest-classes\junit4.xml (The system cannot find the path specified)
Collapse Failed TestMiscJUnit4Attributes beforeClassError History
< 1 sec
org.apache.tools.ant.BuildException: java.io.FileNotFoundException: C:\Users\bamboo\AppData\Local\Temp\RNDTEST-SOFTWARE-RRJ10\surefire12705780684809620788\..%5C..%5C..%5C..%5C..%5C..%5C..%5Cbamboo%5Cxml-data%5Cbuild-dir%5CRNDTEST-SOFTWARE-RRJ10%5Cjunit4-ant%5Ctarget%5Ctest-classes\junit4.xml (The system cannot find the path specified)
Caused by: java.io.FileNotFoundException: C:\Users\bamboo\AppData\Local\Temp\RNDTEST-SOFTWARE-RRJ10\surefire12705780684809620788\..%5C..%5C..%5C..%5C..%5C..%5C..%5Cbamboo%5Cxml-data%5Cbuild-dir%5CRNDTEST-SOFTWARE-RRJ10%5Cjunit4-ant%5Ctarget%5Ctest-classes\junit4.xml (The system cannot find the path specified)
Collapse Failed TestMiscJUnit4Attributes customprefix History
< 1 sec
org.apache.tools.ant.BuildException: java.io.FileNotFoundException: C:\Users\bamboo\AppData\Local\Temp\RNDTEST-SOFTWARE-RRJ10\surefire12705780684809620788\..%5C..%5C..%5C..%5C..%5C..%5C..%5Cbamboo%5Cxml-data%5Cbuild-dir%5CRNDTEST-SOFTWARE-RRJ10%5Cjunit4-ant%5Ctarget%5Ctest-classes\junit4.xml (The system cannot find the path specified)
Caused by: java.io.FileNotFoundException: C:\Users\bamboo\AppData\Local\Temp\RNDTEST-SOFTWARE-RRJ10\surefire12705780684809620788\..%5C..%5C..%5C..%5C..%5C..%5C..%5Cbamboo%5Cxml-data%5Cbuild-dir%5CRNDTEST-SOFTWARE-RRJ10%5Cjunit4-ant%5Ctarget%5Ctest-classes\junit4.xml (The system cannot find the path specified)
Collapse Failed TestMiscJUnit4Attributes dir History
< 1 sec
org.apache.tools.ant.BuildException: java.io.FileNotFoundException: C:\Users\bamboo\AppData\Local\Temp\RNDTEST-SOFTWARE-RRJ10\surefire12705780684809620788\..%5C..%5C..%5C..%5C..%5C..%5C..%5Cbamboo%5Cxml-data%5Cbuild-dir%5CRNDTEST-SOFTWARE-RRJ10%5Cjunit4-ant%5Ctarget%5Ctest-classes\junit4.xml (The system cannot find the path specified)
Caused by: java.io.FileNotFoundException: C:\Users\bamboo\AppData\Local\Temp\RNDTEST-SOFTWARE-RRJ10\surefire12705780684809620788\..%5C..%5C..%5C..%5C..%5C..%5C..%5Cbamboo%5Cxml-data%5Cbuild-dir%5CRNDTEST-SOFTWARE-RRJ10%5Cjunit4-ant%5Ctarget%5Ctest-classes\junit4.xml (The system cannot find the path specified)
Collapse Failed TestMiscJUnit4Attributes hierarchicalSuiteDescription History
< 1 sec
org.apache.tools.ant.BuildException: java.io.FileNotFoundException: C:\Users\bamboo\AppData\Local\Temp\RNDTEST-SOFTWARE-RRJ10\surefire12705780684809620788\..%5C..%5C..%5C..%5C..%5C..%5C..%5Cbamboo%5Cxml-data%5Cbuild-dir%5CRNDTEST-SOFTWARE-RRJ10%5Cjunit4-ant%5Ctarget%5Ctest-classes\junit4.xml (The system cannot find the path specified)
Caused by: java.io.FileNotFoundException: C:\Users\bamboo\AppData\Local\Temp\RNDTEST-SOFTWARE-RRJ10\surefire12705780684809620788\..%5C..%5C..%5C..%5C..%5C..%5C..%5Cbamboo%5Cxml-data%5Cbuild-dir%5CRNDTEST-SOFTWARE-RRJ10%5Cjunit4-ant%5Ctarget%5Ctest-classes\junit4.xml (The system cannot find the path specified)
Collapse Failed TestMiscJUnit4Attributes ignoredSuite History
< 1 sec
org.apache.tools.ant.BuildException: java.io.FileNotFoundException: C:\Users\bamboo\AppData\Local\Temp\RNDTEST-SOFTWARE-RRJ10\surefire12705780684809620788\..%5C..%5C..%5C..%5C..%5C..%5C..%5Cbamboo%5Cxml-data%5Cbuild-dir%5CRNDTEST-SOFTWARE-RRJ10%5Cjunit4-ant%5Ctarget%5Ctest-classes\junit4.xml (The system cannot find the path specified)
Caused by: java.io.FileNotFoundException: C:\Users\bamboo\AppData\Local\Temp\RNDTEST-SOFTWARE-RRJ10\surefire12705780684809620788\..%5C..%5C..%5C..%5C..%5C..%5C..%5Cbamboo%5Cxml-data%5Cbuild-dir%5CRNDTEST-SOFTWARE-RRJ10%5Cjunit4-ant%5Ctarget%5Ctest-classes\junit4.xml (The system cannot find the path specified)
Collapse Failed TestMiscJUnit4Attributes jvmarg History
< 1 sec
org.apache.tools.ant.BuildException: java.io.FileNotFoundException: C:\Users\bamboo\AppData\Local\Temp\RNDTEST-SOFTWARE-RRJ10\surefire12705780684809620788\..%5C..%5C..%5C..%5C..%5C..%5C..%5Cbamboo%5Cxml-data%5Cbuild-dir%5CRNDTEST-SOFTWARE-RRJ10%5Cjunit4-ant%5Ctarget%5Ctest-classes\junit4.xml (The system cannot find the path specified)
Caused by: java.io.FileNotFoundException: C:\Users\bamboo\AppData\Local\Temp\RNDTEST-SOFTWARE-RRJ10\surefire12705780684809620788\..%5C..%5C..%5C..%5C..%5C..%5C..%5Cbamboo%5Cxml-data%5Cbuild-dir%5CRNDTEST-SOFTWARE-RRJ10%5Cjunit4-ant%5Ctarget%5Ctest-classes\junit4.xml (The system cannot find the path specified)
Collapse Failed TestMiscJUnit4Attributes maxmem History
< 1 sec
org.apache.tools.ant.BuildException: java.io.FileNotFoundException: C:\Users\bamboo\AppData\Local\Temp\RNDTEST-SOFTWARE-RRJ10\surefire12705780684809620788\..%5C..%5C..%5C..%5C..%5C..%5C..%5Cbamboo%5Cxml-data%5Cbuild-dir%5CRNDTEST-SOFTWARE-RRJ10%5Cjunit4-ant%5Ctarget%5Ctest-classes\junit4.xml (The system cannot find the path specified)
Caused by: java.io.FileNotFoundException: C:\Users\bamboo\AppData\Local\Temp\RNDTEST-SOFTWARE-RRJ10\surefire12705780684809620788\..%5C..%5C..%5C..%5C..%5C..%5C..%5Cbamboo%5Cxml-data%5Cbuild-dir%5CRNDTEST-SOFTWARE-RRJ10%5Cjunit4-ant%5Ctarget%5Ctest-classes\junit4.xml (The system cannot find the path specified)
Collapse Failed TestMiscJUnit4Attributes mergehints History
< 1 sec
org.apache.tools.ant.BuildException: java.io.FileNotFoundException: C:\Users\bamboo\AppData\Local\Temp\RNDTEST-SOFTWARE-RRJ10\surefire12705780684809620788\..%5C..%5C..%5C..%5C..%5C..%5C..%5Cbamboo%5Cxml-data%5Cbuild-dir%5CRNDTEST-SOFTWARE-RRJ10%5Cjunit4-ant%5Ctarget%5Ctest-classes\junit4.xml (The system cannot find the path specified)
Caused by: java.io.FileNotFoundException: C:\Users\bamboo\AppData\Local\Temp\RNDTEST-SOFTWARE-RRJ10\surefire12705780684809620788\..%5C..%5C..%5C..%5C..%5C..%5C..%5Cbamboo%5Cxml-data%5Cbuild-dir%5CRNDTEST-SOFTWARE-RRJ10%5Cjunit4-ant%5Ctarget%5Ctest-classes\junit4.xml (The system cannot find the path specified)
Collapse Failed TestMiscJUnit4Attributes reproducestring History
< 1 sec
org.apache.tools.ant.BuildException: java.io.FileNotFoundException: C:\Users\bamboo\AppData\Local\Temp\RNDTEST-SOFTWARE-RRJ10\surefire12705780684809620788\..%5C..%5C..%5C..%5C..%5C..%5C..%5Cbamboo%5Cxml-data%5Cbuild-dir%5CRNDTEST-SOFTWARE-RRJ10%5Cjunit4-ant%5Ctarget%5Ctest-classes\junit4.xml (The system cannot find the path specified)
Caused by: java.io.FileNotFoundException: C:\Users\bamboo\AppData\Local\Temp\RNDTEST-SOFTWARE-RRJ10\surefire12705780684809620788\..%5C..%5C..%5C..%5C..%5C..%5C..%5Cbamboo%5Cxml-data%5Cbuild-dir%5CRNDTEST-SOFTWARE-RRJ10%5Cjunit4-ant%5Ctarget%5Ctest-classes\junit4.xml (The system cannot find the path specified)
Collapse Failed TestMiscJUnit4Attributes seedpassing History
< 1 sec
org.apache.tools.ant.BuildException: java.io.FileNotFoundException: C:\Users\bamboo\AppData\Local\Temp\RNDTEST-SOFTWARE-RRJ10\surefire12705780684809620788\..%5C..%5C..%5C..%5C..%5C..%5C..%5Cbamboo%5Cxml-data%5Cbuild-dir%5CRNDTEST-SOFTWARE-RRJ10%5Cjunit4-ant%5Ctarget%5Ctest-classes\junit4.xml (The system cannot find the path specified)
Caused by: java.io.FileNotFoundException: C:\Users\bamboo\AppData\Local\Temp\RNDTEST-SOFTWARE-RRJ10\surefire12705780684809620788\..%5C..%5C..%5C..%5C..%5C..%5C..%5Cbamboo%5Cxml-data%5Cbuild-dir%5CRNDTEST-SOFTWARE-RRJ10%5Cjunit4-ant%5Ctarget%5Ctest-classes\junit4.xml (The system cannot find the path specified)
Collapse Failed TestMiscJUnit4Attributes seedpassingInvalid History
< 1 sec
org.apache.tools.ant.BuildException: java.io.FileNotFoundException: C:\Users\bamboo\AppData\Local\Temp\RNDTEST-SOFTWARE-RRJ10\surefire12705780684809620788\..%5C..%5C..%5C..%5C..%5C..%5C..%5Cbamboo%5Cxml-data%5Cbuild-dir%5CRNDTEST-SOFTWARE-RRJ10%5Cjunit4-ant%5Ctarget%5Ctest-classes\junit4.xml (The system cannot find the path specified)
Caused by: java.io.FileNotFoundException: C:\Users\bamboo\AppData\Local\Temp\RNDTEST-SOFTWARE-RRJ10\surefire12705780684809620788\..%5C..%5C..%5C..%5C..%5C..%5C..%5Cbamboo%5Cxml-data%5Cbuild-dir%5CRNDTEST-SOFTWARE-RRJ10%5Cjunit4-ant%5Ctarget%5Ctest-classes\junit4.xml (The system cannot find the path specified)
Collapse Failed TestMiscJUnit4Attributes statuses History
< 1 sec
org.apache.tools.ant.BuildException: java.io.FileNotFoundException: C:\Users\bamboo\AppData\Local\Temp\RNDTEST-SOFTWARE-RRJ10\surefire12705780684809620788\..%5C..%5C..%5C..%5C..%5C..%5C..%5Cbamboo%5Cxml-data%5Cbuild-dir%5CRNDTEST-SOFTWARE-RRJ10%5Cjunit4-ant%5Ctarget%5Ctest-classes\junit4.xml (The system cannot find the path specified)
Caused by: java.io.FileNotFoundException: C:\Users\bamboo\AppData\Local\Temp\RNDTEST-SOFTWARE-RRJ10\surefire12705780684809620788\..%5C..%5C..%5C..%5C..%5C..%5C..%5Cbamboo%5Cxml-data%5Cbuild-dir%5CRNDTEST-SOFTWARE-RRJ10%5Cjunit4-ant%5Ctarget%5Ctest-classes\junit4.xml (The system cannot find the path specified)
Collapse Failed TestOnNonEmptyWorkDirectory actionFail History
< 1 sec
org.apache.tools.ant.BuildException: java.io.FileNotFoundException: C:\Users\bamboo\AppData\Local\Temp\RNDTEST-SOFTWARE-RRJ10\surefire12705780684809620788\..%5C..%5C..%5C..%5C..%5C..%5C..%5Cbamboo%5Cxml-data%5Cbuild-dir%5CRNDTEST-SOFTWARE-RRJ10%5Cjunit4-ant%5Ctarget%5Ctest-classes\junit4.xml (The system cannot find the path specified)
Caused by: java.io.FileNotFoundException: C:\Users\bamboo\AppData\Local\Temp\RNDTEST-SOFTWARE-RRJ10\surefire12705780684809620788\..%5C..%5C..%5C..%5C..%5C..%5C..%5Cbamboo%5Cxml-data%5Cbuild-dir%5CRNDTEST-SOFTWARE-RRJ10%5Cjunit4-ant%5Ctarget%5Ctest-classes\junit4.xml (The system cannot find the path specified)
Collapse Failed TestOnNonEmptyWorkDirectory actionIgnore History
< 1 sec
org.apache.tools.ant.BuildException: java.io.FileNotFoundException: C:\Users\bamboo\AppData\Local\Temp\RNDTEST-SOFTWARE-RRJ10\surefire12705780684809620788\..%5C..%5C..%5C..%5C..%5C..%5C..%5Cbamboo%5Cxml-data%5Cbuild-dir%5CRNDTEST-SOFTWARE-RRJ10%5Cjunit4-ant%5Ctarget%5Ctest-classes\junit4.xml (The system cannot find the path specified)
Caused by: java.io.FileNotFoundException: C:\Users\bamboo\AppData\Local\Temp\RNDTEST-SOFTWARE-RRJ10\surefire12705780684809620788\..%5C..%5C..%5C..%5C..%5C..%5C..%5Cbamboo%5Cxml-data%5Cbuild-dir%5CRNDTEST-SOFTWARE-RRJ10%5Cjunit4-ant%5Ctarget%5Ctest-classes\junit4.xml (The system cannot find the path specified)
Collapse Failed TestOnNonEmptyWorkDirectory actionWipe History
< 1 sec
org.apache.tools.ant.BuildException: java.io.FileNotFoundException: C:\Users\bamboo\AppData\Local\Temp\RNDTEST-SOFTWARE-RRJ10\surefire12705780684809620788\..%5C..%5C..%5C..%5C..%5C..%5C..%5Cbamboo%5Cxml-data%5Cbuild-dir%5CRNDTEST-SOFTWARE-RRJ10%5Cjunit4-ant%5Ctarget%5Ctest-classes\junit4.xml (The system cannot find the path specified)
Caused by: java.io.FileNotFoundException: C:\Users\bamboo\AppData\Local\Temp\RNDTEST-SOFTWARE-RRJ10\surefire12705780684809620788\..%5C..%5C..%5C..%5C..%5C..%5C..%5Cbamboo%5Cxml-data%5Cbuild-dir%5CRNDTEST-SOFTWARE-RRJ10%5Cjunit4-ant%5Ctarget%5Ctest-classes\junit4.xml (The system cannot find the path specified)
Collapse Failed TestOnNonEmptyWorkDirectory tmpDirUnderCwd History
< 1 sec
org.apache.tools.ant.BuildException: java.io.FileNotFoundException: C:\Users\bamboo\AppData\Local\Temp\RNDTEST-SOFTWARE-RRJ10\surefire12705780684809620788\..%5C..%5C..%5C..%5C..%5C..%5C..%5Cbamboo%5Cxml-data%5Cbuild-dir%5CRNDTEST-SOFTWARE-RRJ10%5Cjunit4-ant%5Ctarget%5Ctest-classes\junit4.xml (The system cannot find the path specified)
Caused by: java.io.FileNotFoundException: C:\Users\bamboo\AppData\Local\Temp\RNDTEST-SOFTWARE-RRJ10\surefire12705780684809620788\..%5C..%5C..%5C..%5C..%5C..%5C..%5Cbamboo%5Cxml-data%5Cbuild-dir%5CRNDTEST-SOFTWARE-RRJ10%5Cjunit4-ant%5Ctarget%5Ctest-classes\junit4.xml (The system cannot find the path specified)
Collapse Failed TestOutputCapture outofordersysouts History
< 1 sec
org.apache.tools.ant.BuildException: java.io.FileNotFoundException: C:\Users\bamboo\AppData\Local\Temp\RNDTEST-SOFTWARE-RRJ10\surefire12705780684809620788\..%5C..%5C..%5C..%5C..%5C..%5C..%5Cbamboo%5Cxml-data%5Cbuild-dir%5CRNDTEST-SOFTWARE-RRJ10%5Cjunit4-ant%5Ctarget%5Ctest-classes\junit4.xml (The system cannot find the path specified)
Caused by: java.io.FileNotFoundException: C:\Users\bamboo\AppData\Local\Temp\RNDTEST-SOFTWARE-RRJ10\surefire12705780684809620788\..%5C..%5C..%5C..%5C..%5C..%5C..%5Cbamboo%5Cxml-data%5Cbuild-dir%5CRNDTEST-SOFTWARE-RRJ10%5Cjunit4-ant%5Ctarget%5Ctest-classes\junit4.xml (The system cannot find the path specified)
Collapse Failed TestOutputCapture staticScopeOutput History
< 1 sec
org.apache.tools.ant.BuildException: java.io.FileNotFoundException: C:\Users\bamboo\AppData\Local\Temp\RNDTEST-SOFTWARE-RRJ10\surefire12705780684809620788\..%5C..%5C..%5C..%5C..%5C..%5C..%5Cbamboo%5Cxml-data%5Cbuild-dir%5CRNDTEST-SOFTWARE-RRJ10%5Cjunit4-ant%5Ctarget%5Ctest-classes\junit4.xml (The system cannot find the path specified)
Caused by: java.io.FileNotFoundException: C:\Users\bamboo\AppData\Local\Temp\RNDTEST-SOFTWARE-RRJ10\surefire12705780684809620788\..%5C..%5C..%5C..%5C..%5C..%5C..%5Cbamboo%5Cxml-data%5Cbuild-dir%5CRNDTEST-SOFTWARE-RRJ10%5Cjunit4-ant%5Ctarget%5Ctest-classes\junit4.xml (The system cannot find the path specified)
Collapse Failed TestOutputCapture sysstreams History
< 1 sec
org.apache.tools.ant.BuildException: java.io.FileNotFoundException: C:\Users\bamboo\AppData\Local\Temp\RNDTEST-SOFTWARE-RRJ10\surefire12705780684809620788\..%5C..%5C..%5C..%5C..%5C..%5C..%5Cbamboo%5Cxml-data%5Cbuild-dir%5CRNDTEST-SOFTWARE-RRJ10%5Cjunit4-ant%5Ctarget%5Ctest-classes\junit4.xml (The system cannot find the path specified)
Caused by: java.io.FileNotFoundException: C:\Users\bamboo\AppData\Local\Temp\RNDTEST-SOFTWARE-RRJ10\surefire12705780684809620788\..%5C..%5C..%5C..%5C..%5C..%5C..%5Cbamboo%5Cxml-data%5Cbuild-dir%5CRNDTEST-SOFTWARE-RRJ10%5Cjunit4-ant%5Ctarget%5Ctest-classes\junit4.xml (The system cannot find the path specified)
Collapse Failed TestPickSeed pickSeed History
< 1 sec
org.apache.tools.ant.BuildException: java.io.FileNotFoundException: C:\Users\bamboo\AppData\Local\Temp\RNDTEST-SOFTWARE-RRJ10\surefire12705780684809620788\..%5C..%5C..%5C..%5C..%5C..%5C..%5Cbamboo%5Cxml-data%5Cbuild-dir%5CRNDTEST-SOFTWARE-RRJ10%5Cjunit4-ant%5Ctarget%5Ctest-classes\junit4.xml (The system cannot find the path specified)
Caused by: java.io.FileNotFoundException: C:\Users\bamboo\AppData\Local\Temp\RNDTEST-SOFTWARE-RRJ10\surefire12705780684809620788\..%5C..%5C..%5C..%5C..%5C..%5C..%5Cbamboo%5Cxml-data%5Cbuild-dir%5CRNDTEST-SOFTWARE-RRJ10%5Cjunit4-ant%5Ctarget%5Ctest-classes\junit4.xml (The system cannot find the path specified)
Collapse Failed TestPreconditions nojunit History
< 1 sec
org.apache.tools.ant.BuildException: java.io.FileNotFoundException: C:\Users\bamboo\AppData\Local\Temp\RNDTEST-SOFTWARE-RRJ10\surefire12705780684809620788\..%5C..%5C..%5C..%5C..%5C..%5C..%5Cbamboo%5Cxml-data%5Cbuild-dir%5CRNDTEST-SOFTWARE-RRJ10%5Cjunit4-ant%5Ctarget%5Ctest-classes\junit4.xml (The system cannot find the path specified)
Caused by: java.io.FileNotFoundException: C:\Users\bamboo\AppData\Local\Temp\RNDTEST-SOFTWARE-RRJ10\surefire12705780684809620788\..%5C..%5C..%5C..%5C..%5C..%5C..%5Cbamboo%5Cxml-data%5Cbuild-dir%5CRNDTEST-SOFTWARE-RRJ10%5Cjunit4-ant%5Ctarget%5Ctest-classes\junit4.xml (The system cannot find the path specified)
Collapse Failed TestPreconditions nojunit_task History
< 1 sec
org.apache.tools.ant.BuildException: java.io.FileNotFoundException: C:\Users\bamboo\AppData\Local\Temp\RNDTEST-SOFTWARE-RRJ10\surefire12705780684809620788\..%5C..%5C..%5C..%5C..%5C..%5C..%5Cbamboo%5Cxml-data%5Cbuild-dir%5CRNDTEST-SOFTWARE-RRJ10%5Cjunit4-ant%5Ctarget%5Ctest-classes\junit4.xml (The system cannot find the path specified)
Caused by: java.io.FileNotFoundException: C:\Users\bamboo\AppData\Local\Temp\RNDTEST-SOFTWARE-RRJ10\surefire12705780684809620788\..%5C..%5C..%5C..%5C..%5C..%5C..%5Cbamboo%5Cxml-data%5Cbuild-dir%5CRNDTEST-SOFTWARE-RRJ10%5Cjunit4-ant%5Ctarget%5Ctest-classes\junit4.xml (The system cannot find the path specified)
Collapse Failed TestPreconditions oldjunit History
< 1 sec
org.apache.tools.ant.BuildException: java.io.FileNotFoundException: C:\Users\bamboo\AppData\Local\Temp\RNDTEST-SOFTWARE-RRJ10\surefire12705780684809620788\..%5C..%5C..%5C..%5C..%5C..%5C..%5Cbamboo%5Cxml-data%5Cbuild-dir%5CRNDTEST-SOFTWARE-RRJ10%5Cjunit4-ant%5Ctarget%5Ctest-classes\junit4.xml (The system cannot find the path specified)
Caused by: java.io.FileNotFoundException: C:\Users\bamboo\AppData\Local\Temp\RNDTEST-SOFTWARE-RRJ10\surefire12705780684809620788\..%5C..%5C..%5C..%5C..%5C..%5C..%5Cbamboo%5Cxml-data%5Cbuild-dir%5CRNDTEST-SOFTWARE-RRJ10%5Cjunit4-ant%5Ctarget%5Ctest-classes\junit4.xml (The system cannot find the path specified)
Collapse Failed TestPreconditions oldjunit_task History
< 1 sec
org.apache.tools.ant.BuildException: java.io.FileNotFoundException: C:\Users\bamboo\AppData\Local\Temp\RNDTEST-SOFTWARE-RRJ10\surefire12705780684809620788\..%5C..%5C..%5C..%5C..%5C..%5C..%5Cbamboo%5Cxml-data%5Cbuild-dir%5CRNDTEST-SOFTWARE-RRJ10%5Cjunit4-ant%5Ctarget%5Ctest-classes\junit4.xml (The system cannot find the path specified)
Caused by: java.io.FileNotFoundException: C:\Users\bamboo\AppData\Local\Temp\RNDTEST-SOFTWARE-RRJ10\surefire12705780684809620788\..%5C..%5C..%5C..%5C..%5C..%5C..%5Cbamboo%5Cxml-data%5Cbuild-dir%5CRNDTEST-SOFTWARE-RRJ10%5Cjunit4-ant%5Ctarget%5Ctest-classes\junit4.xml (The system cannot find the path specified)
Collapse Failed TestReplication pseudoBalancing History
< 1 sec
org.apache.tools.ant.BuildException: java.io.FileNotFoundException: C:\Users\bamboo\AppData\Local\Temp\RNDTEST-SOFTWARE-RRJ10\surefire12705780684809620788\..%5C..%5C..%5C..%5C..%5C..%5C..%5Cbamboo%5Cxml-data%5Cbuild-dir%5CRNDTEST-SOFTWARE-RRJ10%5Cjunit4-ant%5Ctarget%5Ctest-classes\junit4.xml (The system cannot find the path specified)
Caused by: java.io.FileNotFoundException: C:\Users\bamboo\AppData\Local\Temp\RNDTEST-SOFTWARE-RRJ10\surefire12705780684809620788\..%5C..%5C..%5C..%5C..%5C..%5C..%5Cbamboo%5Cxml-data%5Cbuild-dir%5CRNDTEST-SOFTWARE-RRJ10%5Cjunit4-ant%5Ctarget%5Ctest-classes\junit4.xml (The system cannot find the path specified)
Collapse Failed TestReplication replicationAndBalancing History
< 1 sec
org.apache.tools.ant.BuildException: java.io.FileNotFoundException: C:\Users\bamboo\AppData\Local\Temp\RNDTEST-SOFTWARE-RRJ10\surefire12705780684809620788\..%5C..%5C..%5C..%5C..%5C..%5C..%5Cbamboo%5Cxml-data%5Cbuild-dir%5CRNDTEST-SOFTWARE-RRJ10%5Cjunit4-ant%5Ctarget%5Ctest-classes\junit4.xml (The system cannot find the path specified)
Caused by: java.io.FileNotFoundException: C:\Users\bamboo\AppData\Local\Temp\RNDTEST-SOFTWARE-RRJ10\surefire12705780684809620788\..%5C..%5C..%5C..%5C..%5C..%5C..%5Cbamboo%5Cxml-data%5Cbuild-dir%5CRNDTEST-SOFTWARE-RRJ10%5Cjunit4-ant%5Ctarget%5Ctest-classes\junit4.xml (The system cannot find the path specified)
Collapse Failed TestReplication singleSuiteReplication History
< 1 sec
org.apache.tools.ant.BuildException: java.io.FileNotFoundException: C:\Users\bamboo\AppData\Local\Temp\RNDTEST-SOFTWARE-RRJ10\surefire12705780684809620788\..%5C..%5C..%5C..%5C..%5C..%5C..%5Cbamboo%5Cxml-data%5Cbuild-dir%5CRNDTEST-SOFTWARE-RRJ10%5Cjunit4-ant%5Ctarget%5Ctest-classes\junit4.xml (The system cannot find the path specified)
Caused by: java.io.FileNotFoundException: C:\Users\bamboo\AppData\Local\Temp\RNDTEST-SOFTWARE-RRJ10\surefire12705780684809620788\..%5C..%5C..%5C..%5C..%5C..%5C..%5Cbamboo%5Cxml-data%5Cbuild-dir%5CRNDTEST-SOFTWARE-RRJ10%5Cjunit4-ant%5Ctarget%5Ctest-classes\junit4.xml (The system cannot find the path specified)
Collapse Failed TestRunListeners multipleUserDefinedRunListeners History
< 1 sec
org.apache.tools.ant.BuildException: java.io.FileNotFoundException: C:\Users\bamboo\AppData\Local\Temp\RNDTEST-SOFTWARE-RRJ10\surefire12705780684809620788\..%5C..%5C..%5C..%5C..%5C..%5C..%5Cbamboo%5Cxml-data%5Cbuild-dir%5CRNDTEST-SOFTWARE-RRJ10%5Cjunit4-ant%5Ctarget%5Ctest-classes\junit4.xml (The system cannot find the path specified)
Caused by: java.io.FileNotFoundException: C:\Users\bamboo\AppData\Local\Temp\RNDTEST-SOFTWARE-RRJ10\surefire12705780684809620788\..%5C..%5C..%5C..%5C..%5C..%5C..%5Cbamboo%5Cxml-data%5Cbuild-dir%5CRNDTEST-SOFTWARE-RRJ10%5Cjunit4-ant%5Ctarget%5Ctest-classes\junit4.xml (The system cannot find the path specified)
Collapse Failed TestRunListeners singleUserDefinedRunListener History
< 1 sec
org.apache.tools.ant.BuildException: java.io.FileNotFoundException: C:\Users\bamboo\AppData\Local\Temp\RNDTEST-SOFTWARE-RRJ10\surefire12705780684809620788\..%5C..%5C..%5C..%5C..%5C..%5C..%5Cbamboo%5Cxml-data%5Cbuild-dir%5CRNDTEST-SOFTWARE-RRJ10%5Cjunit4-ant%5Ctarget%5Ctest-classes\junit4.xml (The system cannot find the path specified)
Caused by: java.io.FileNotFoundException: C:\Users\bamboo\AppData\Local\Temp\RNDTEST-SOFTWARE-RRJ10\surefire12705780684809620788\..%5C..%5C..%5C..%5C..%5C..%5C..%5Cbamboo%5Cxml-data%5Cbuild-dir%5CRNDTEST-SOFTWARE-RRJ10%5Cjunit4-ant%5Ctarget%5Ctest-classes\junit4.xml (The system cannot find the path specified)
Collapse Failed TestSecuritySandbox gh255 History
< 1 sec
org.apache.tools.ant.BuildException: java.io.FileNotFoundException: C:\Users\bamboo\AppData\Local\Temp\RNDTEST-SOFTWARE-RRJ10\surefire12705780684809620788\..%5C..%5C..%5C..%5C..%5C..%5C..%5Cbamboo%5Cxml-data%5Cbuild-dir%5CRNDTEST-SOFTWARE-RRJ10%5Cjunit4-ant%5Ctarget%5Ctest-classes\junit4.xml (The system cannot find the path specified)
Caused by: java.io.FileNotFoundException: C:\Users\bamboo\AppData\Local\Temp\RNDTEST-SOFTWARE-RRJ10\surefire12705780684809620788\..%5C..%5C..%5C..%5C..%5C..%5C..%5Cbamboo%5Cxml-data%5Cbuild-dir%5CRNDTEST-SOFTWARE-RRJ10%5Cjunit4-ant%5Ctarget%5Ctest-classes\junit4.xml (The system cannot find the path specified)
Collapse Failed TestShutdownHookDeadlock slavehanging History
< 1 sec
org.apache.tools.ant.BuildException: java.io.FileNotFoundException: C:\Users\bamboo\AppData\Local\Temp\RNDTEST-SOFTWARE-RRJ10\surefire12705780684809620788\..%5C..%5C..%5C..%5C..%5C..%5C..%5Cbamboo%5Cxml-data%5Cbuild-dir%5CRNDTEST-SOFTWARE-RRJ10%5Cjunit4-ant%5Ctarget%5Ctest-classes\junit4.xml (The system cannot find the path specified)
Caused by: java.io.FileNotFoundException: C:\Users\bamboo\AppData\Local\Temp\RNDTEST-SOFTWARE-RRJ10\surefire12705780684809620788\..%5C..%5C..%5C..%5C..%5C..%5C..%5Cbamboo%5Cxml-data%5Cbuild-dir%5CRNDTEST-SOFTWARE-RRJ10%5Cjunit4-ant%5Ctarget%5Ctest-classes\junit4.xml (The system cannot find the path specified)
Collapse Failed TestSourceSuitesAsInput sourcesuites History
< 1 sec
org.apache.tools.ant.BuildException: java.io.FileNotFoundException: C:\Users\bamboo\AppData\Local\Temp\RNDTEST-SOFTWARE-RRJ10\surefire12705780684809620788\..%5C..%5C..%5C..%5C..%5C..%5C..%5Cbamboo%5Cxml-data%5Cbuild-dir%5CRNDTEST-SOFTWARE-RRJ10%5Cjunit4-ant%5Ctarget%5Ctest-classes\junit4.xml (The system cannot find the path specified)
Caused by: java.io.FileNotFoundException: C:\Users\bamboo\AppData\Local\Temp\RNDTEST-SOFTWARE-RRJ10\surefire12705780684809620788\..%5C..%5C..%5C..%5C..%5C..%5C..%5Cbamboo%5Cxml-data%5Cbuild-dir%5CRNDTEST-SOFTWARE-RRJ10%5Cjunit4-ant%5Ctarget%5Ctest-classes\junit4.xml (The system cannot find the path specified)
Collapse Failed TestStackOverflowInEventEmitter stackoverflow History
< 1 sec
org.apache.tools.ant.BuildException: java.io.FileNotFoundException: C:\Users\bamboo\AppData\Local\Temp\RNDTEST-SOFTWARE-RRJ10\surefire12705780684809620788\..%5C..%5C..%5C..%5C..%5C..%5C..%5Cbamboo%5Cxml-data%5Cbuild-dir%5CRNDTEST-SOFTWARE-RRJ10%5Cjunit4-ant%5Ctarget%5Ctest-classes\junit4.xml (The system cannot find the path specified)
Caused by: java.io.FileNotFoundException: C:\Users\bamboo\AppData\Local\Temp\RNDTEST-SOFTWARE-RRJ10\surefire12705780684809620788\..%5C..%5C..%5C..%5C..%5C..%5C..%5Cbamboo%5Cxml-data%5Cbuild-dir%5CRNDTEST-SOFTWARE-RRJ10%5Cjunit4-ant%5Ctarget%5Ctest-classes\junit4.xml (The system cannot find the path specified)
Collapse Failed TestStatsProperties allFilteredOut History
< 1 sec
org.apache.tools.ant.BuildException: java.io.FileNotFoundException: C:\Users\bamboo\AppData\Local\Temp\RNDTEST-SOFTWARE-RRJ10\surefire12705780684809620788\..%5C..%5C..%5C..%5C..%5C..%5C..%5Cbamboo%5Cxml-data%5Cbuild-dir%5CRNDTEST-SOFTWARE-RRJ10%5Cjunit4-ant%5Ctarget%5Ctest-classes\junit4.xml (The system cannot find the path specified)
Caused by: java.io.FileNotFoundException: C:\Users\bamboo\AppData\Local\Temp\RNDTEST-SOFTWARE-RRJ10\surefire12705780684809620788\..%5C..%5C..%5C..%5C..%5C..%5C..%5Cbamboo%5Cxml-data%5Cbuild-dir%5CRNDTEST-SOFTWARE-RRJ10%5Cjunit4-ant%5Ctarget%5Ctest-classes\junit4.xml (The system cannot find the path specified)
Collapse Failed TestSuiteClassesBad notaclass History
< 1 sec
org.apache.tools.ant.BuildException: java.io.FileNotFoundException: C:\Users\bamboo\AppData\Local\Temp\RNDTEST-SOFTWARE-RRJ10\surefire12705780684809620788\..%5C..%5C..%5C..%5C..%5C..%5C..%5Cbamboo%5Cxml-data%5Cbuild-dir%5CRNDTEST-SOFTWARE-RRJ10%5Cjunit4-ant%5Ctarget%5Ctest-classes\junit4.xml (The system cannot find the path specified)
Caused by: java.io.FileNotFoundException: C:\Users\bamboo\AppData\Local\Temp\RNDTEST-SOFTWARE-RRJ10\surefire12705780684809620788\..%5C..%5C..%5C..%5C..%5C..%5C..%5Cbamboo%5Cxml-data%5Cbuild-dir%5CRNDTEST-SOFTWARE-RRJ10%5Cjunit4-ant%5Ctarget%5Ctest-classes\junit4.xml (The system cannot find the path specified)
Collapse Failed TestSuiteClassesBad notinstantiable History
< 1 sec
org.apache.tools.ant.BuildException: java.io.FileNotFoundException: C:\Users\bamboo\AppData\Local\Temp\RNDTEST-SOFTWARE-RRJ10\surefire12705780684809620788\..%5C..%5C..%5C..%5C..%5C..%5C..%5Cbamboo%5Cxml-data%5Cbuild-dir%5CRNDTEST-SOFTWARE-RRJ10%5Cjunit4-ant%5Ctarget%5Ctest-classes\junit4.xml (The system cannot find the path specified)
Caused by: java.io.FileNotFoundException: C:\Users\bamboo\AppData\Local\Temp\RNDTEST-SOFTWARE-RRJ10\surefire12705780684809620788\..%5C..%5C..%5C..%5C..%5C..%5C..%5Cbamboo%5Cxml-data%5Cbuild-dir%5CRNDTEST-SOFTWARE-RRJ10%5Cjunit4-ant%5Ctarget%5Ctest-classes\junit4.xml (The system cannot find the path specified)
Collapse Failed TestSuiteDuplicates suiteduplicate History
< 1 sec
org.apache.tools.ant.BuildException: java.io.FileNotFoundException: C:\Users\bamboo\AppData\Local\Temp\RNDTEST-SOFTWARE-RRJ10\surefire12705780684809620788\..%5C..%5C..%5C..%5C..%5C..%5C..%5Cbamboo%5Cxml-data%5Cbuild-dir%5CRNDTEST-SOFTWARE-RRJ10%5Cjunit4-ant%5Ctarget%5Ctest-classes\junit4.xml (The system cannot find the path specified)
Caused by: java.io.FileNotFoundException: C:\Users\bamboo\AppData\Local\Temp\RNDTEST-SOFTWARE-RRJ10\surefire12705780684809620788\..%5C..%5C..%5C..%5C..%5C..%5C..%5Cbamboo%5Cxml-data%5Cbuild-dir%5CRNDTEST-SOFTWARE-RRJ10%5Cjunit4-ant%5Ctarget%5Ctest-classes\junit4.xml (The system cannot find the path specified)
Collapse Failed TestSysProperties env History
< 1 sec
org.apache.tools.ant.BuildException: java.io.FileNotFoundException: C:\Users\bamboo\AppData\Local\Temp\RNDTEST-SOFTWARE-RRJ10\surefire12705780684809620788\..%5C..%5C..%5C..%5C..%5C..%5C..%5Cbamboo%5Cxml-data%5Cbuild-dir%5CRNDTEST-SOFTWARE-RRJ10%5Cjunit4-ant%5Ctarget%5Ctest-classes\junit4.xml (The system cannot find the path specified)
Caused by: java.io.FileNotFoundException: C:\Users\bamboo\AppData\Local\Temp\RNDTEST-SOFTWARE-RRJ10\surefire12705780684809620788\..%5C..%5C..%5C..%5C..%5C..%5C..%5Cbamboo%5Cxml-data%5Cbuild-dir%5CRNDTEST-SOFTWARE-RRJ10%5Cjunit4-ant%5Ctarget%5Ctest-classes\junit4.xml (The system cannot find the path specified)
Collapse Failed TestSysProperties escaping History
< 1 sec
org.apache.tools.ant.BuildException: java.io.FileNotFoundException: C:\Users\bamboo\AppData\Local\Temp\RNDTEST-SOFTWARE-RRJ10\surefire12705780684809620788\..%5C..%5C..%5C..%5C..%5C..%5C..%5Cbamboo%5Cxml-data%5Cbuild-dir%5CRNDTEST-SOFTWARE-RRJ10%5Cjunit4-ant%5Ctarget%5Ctest-classes\junit4.xml (The system cannot find the path specified)
Caused by: java.io.FileNotFoundException: C:\Users\bamboo\AppData\Local\Temp\RNDTEST-SOFTWARE-RRJ10\surefire12705780684809620788\..%5C..%5C..%5C..%5C..%5C..%5C..%5Cbamboo%5Cxml-data%5Cbuild-dir%5CRNDTEST-SOFTWARE-RRJ10%5Cjunit4-ant%5Ctarget%5Ctest-classes\junit4.xml (The system cannot find the path specified)
Collapse Failed TestSysProperties failureProperty History
< 1 sec
org.apache.tools.ant.BuildException: java.io.FileNotFoundException: C:\Users\bamboo\AppData\Local\Temp\RNDTEST-SOFTWARE-RRJ10\surefire12705780684809620788\..%5C..%5C..%5C..%5C..%5C..%5C..%5Cbamboo%5Cxml-data%5Cbuild-dir%5CRNDTEST-SOFTWARE-RRJ10%5Cjunit4-ant%5Ctarget%5Ctest-classes\junit4.xml (The system cannot find the path specified)
Caused by: java.io.FileNotFoundException: C:\Users\bamboo\AppData\Local\Temp\RNDTEST-SOFTWARE-RRJ10\surefire12705780684809620788\..%5C..%5C..%5C..%5C..%5C..%5C..%5Cbamboo%5Cxml-data%5Cbuild-dir%5CRNDTEST-SOFTWARE-RRJ10%5Cjunit4-ant%5Ctarget%5Ctest-classes\junit4.xml (The system cannot find the path specified)
Collapse Failed TestSysProperties failureTypePassing History
< 1 sec
org.apache.tools.ant.BuildException: java.io.FileNotFoundException: C:\Users\bamboo\AppData\Local\Temp\RNDTEST-SOFTWARE-RRJ10\surefire12705780684809620788\..%5C..%5C..%5C..%5C..%5C..%5C..%5Cbamboo%5Cxml-data%5Cbuild-dir%5CRNDTEST-SOFTWARE-RRJ10%5Cjunit4-ant%5Ctarget%5Ctest-classes\junit4.xml (The system cannot find the path specified)
Caused by: java.io.FileNotFoundException: C:\Users\bamboo\AppData\Local\Temp\RNDTEST-SOFTWARE-RRJ10\surefire12705780684809620788\..%5C..%5C..%5C..%5C..%5C..%5C..%5Cbamboo%5Cxml-data%5Cbuild-dir%5CRNDTEST-SOFTWARE-RRJ10%5Cjunit4-ant%5Ctarget%5Ctest-classes\junit4.xml (The system cannot find the path specified)
Collapse Failed TestSysProperties iters History
< 1 sec
org.apache.tools.ant.BuildException: java.io.FileNotFoundException: C:\Users\bamboo\AppData\Local\Temp\RNDTEST-SOFTWARE-RRJ10\surefire12705780684809620788\..%5C..%5C..%5C..%5C..%5C..%5C..%5Cbamboo%5Cxml-data%5Cbuild-dir%5CRNDTEST-SOFTWARE-RRJ10%5Cjunit4-ant%5Ctarget%5Ctest-classes\junit4.xml (The system cannot find the path specified)
Caused by: java.io.FileNotFoundException: C:\Users\bamboo\AppData\Local\Temp\RNDTEST-SOFTWARE-RRJ10\surefire12705780684809620788\..%5C..%5C..%5C..%5C..%5C..%5C..%5Cbamboo%5Cxml-data%5Cbuild-dir%5CRNDTEST-SOFTWARE-RRJ10%5Cjunit4-ant%5Ctarget%5Ctest-classes\junit4.xml (The system cannot find the path specified)
Collapse Failed TestSysProperties sysproperty History
< 1 sec
org.apache.tools.ant.BuildException: java.io.FileNotFoundException: C:\Users\bamboo\AppData\Local\Temp\RNDTEST-SOFTWARE-RRJ10\surefire12705780684809620788\..%5C..%5C..%5C..%5C..%5C..%5C..%5Cbamboo%5Cxml-data%5Cbuild-dir%5CRNDTEST-SOFTWARE-RRJ10%5Cjunit4-ant%5Ctarget%5Ctest-classes\junit4.xml (The system cannot find the path specified)
Caused by: java.io.FileNotFoundException: C:\Users\bamboo\AppData\Local\Temp\RNDTEST-SOFTWARE-RRJ10\surefire12705780684809620788\..%5C..%5C..%5C..%5C..%5C..%5C..%5Cbamboo%5Cxml-data%5Cbuild-dir%5CRNDTEST-SOFTWARE-RRJ10%5Cjunit4-ant%5Ctarget%5Ctest-classes\junit4.xml (The system cannot find the path specified)
Collapse Failed TestSysPropertySet altVendors History
< 1 sec
org.apache.tools.ant.BuildException: java.io.FileNotFoundException: C:\Users\bamboo\AppData\Local\Temp\RNDTEST-SOFTWARE-RRJ10\surefire12705780684809620788\..%5C..%5C..%5C..%5C..%5C..%5C..%5Cbamboo%5Cxml-data%5Cbuild-dir%5CRNDTEST-SOFTWARE-RRJ10%5Cjunit4-ant%5Ctarget%5Ctest-classes\junit4.xml (The system cannot find the path specified)
Caused by: java.io.FileNotFoundException: C:\Users\bamboo\AppData\Local\Temp\RNDTEST-SOFTWARE-RRJ10\surefire12705780684809620788\..%5C..%5C..%5C..%5C..%5C..%5C..%5Cbamboo%5Cxml-data%5Cbuild-dir%5CRNDTEST-SOFTWARE-RRJ10%5Cjunit4-ant%5Ctarget%5Ctest-classes\junit4.xml (The system cannot find the path specified)
Collapse Failed TestSysoutOOM sysoutoom History
< 1 sec
org.apache.tools.ant.BuildException: java.io.FileNotFoundException: C:\Users\bamboo\AppData\Local\Temp\RNDTEST-SOFTWARE-RRJ10\surefire12705780684809620788\..%5C..%5C..%5C..%5C..%5C..%5C..%5Cbamboo%5Cxml-data%5Cbuild-dir%5CRNDTEST-SOFTWARE-RRJ10%5Cjunit4-ant%5Ctarget%5Ctest-classes\junit4.xml (The system cannot find the path specified)
Caused by: java.io.FileNotFoundException: C:\Users\bamboo\AppData\Local\Temp\RNDTEST-SOFTWARE-RRJ10\surefire12705780684809620788\..%5C..%5C..%5C..%5C..%5C..%5C..%5Cbamboo%5Cxml-data%5Cbuild-dir%5CRNDTEST-SOFTWARE-RRJ10%5Cjunit4-ant%5Ctarget%5Ctest-classes\junit4.xml (The system cannot find the path specified)
Collapse Failed TestTextReport errorsSoFarIndicator History
< 1 sec
org.apache.tools.ant.BuildException: java.io.FileNotFoundException: C:\Users\bamboo\AppData\Local\Temp\RNDTEST-SOFTWARE-RRJ10\surefire12705780684809620788\..%5C..%5C..%5C..%5C..%5C..%5C..%5Cbamboo%5Cxml-data%5Cbuild-dir%5CRNDTEST-SOFTWARE-RRJ10%5Cjunit4-ant%5Ctarget%5Ctest-classes\junit4.xml (The system cannot find the path specified)
Caused by: java.io.FileNotFoundException: C:\Users\bamboo\AppData\Local\Temp\RNDTEST-SOFTWARE-RRJ10\surefire12705780684809620788\..%5C..%5C..%5C..%5C..%5C..%5C..%5Cbamboo%5Cxml-data%5Cbuild-dir%5CRNDTEST-SOFTWARE-RRJ10%5Cjunit4-ant%5Ctarget%5Ctest-classes\junit4.xml (The system cannot find the path specified)
Collapse Failed TestTextReport failureslist History
< 1 sec
org.apache.tools.ant.BuildException: java.io.FileNotFoundException: C:\Users\bamboo\AppData\Local\Temp\RNDTEST-SOFTWARE-RRJ10\surefire12705780684809620788\..%5C..%5C..%5C..%5C..%5C..%5C..%5Cbamboo%5Cxml-data%5Cbuild-dir%5CRNDTEST-SOFTWARE-RRJ10%5Cjunit4-ant%5Ctarget%5Ctest-classes\junit4.xml (The system cannot find the path specified)
Caused by: java.io.FileNotFoundException: C:\Users\bamboo\AppData\Local\Temp\RNDTEST-SOFTWARE-RRJ10\surefire12705780684809620788\..%5C..%5C..%5C..%5C..%5C..%5C..%5Cbamboo%5Cxml-data%5Cbuild-dir%5CRNDTEST-SOFTWARE-RRJ10%5Cjunit4-ant%5Ctarget%5Ctest-classes\junit4.xml (The system cannot find the path specified)
Collapse Failed TestTextReport filtertrace_custom History
< 1 sec
org.apache.tools.ant.BuildException: java.io.FileNotFoundException: C:\Users\bamboo\AppData\Local\Temp\RNDTEST-SOFTWARE-RRJ10\surefire12705780684809620788\..%5C..%5C..%5C..%5C..%5C..%5C..%5Cbamboo%5Cxml-data%5Cbuild-dir%5CRNDTEST-SOFTWARE-RRJ10%5Cjunit4-ant%5Ctarget%5Ctest-classes\junit4.xml (The system cannot find the path specified)
Caused by: java.io.FileNotFoundException: C:\Users\bamboo\AppData\Local\Temp\RNDTEST-SOFTWARE-RRJ10\surefire12705780684809620788\..%5C..%5C..%5C..%5C..%5C..%5C..%5Cbamboo%5Cxml-data%5Cbuild-dir%5CRNDTEST-SOFTWARE-RRJ10%5Cjunit4-ant%5Ctarget%5Ctest-classes\junit4.xml (The system cannot find the path specified)
Collapse Failed TestTextReport filtertrace_default History
< 1 sec
org.apache.tools.ant.BuildException: java.io.FileNotFoundException: C:\Users\bamboo\AppData\Local\Temp\RNDTEST-SOFTWARE-RRJ10\surefire12705780684809620788\..%5C..%5C..%5C..%5C..%5C..%5C..%5Cbamboo%5Cxml-data%5Cbuild-dir%5CRNDTEST-SOFTWARE-RRJ10%5Cjunit4-ant%5Ctarget%5Ctest-classes\junit4.xml (The system cannot find the path specified)
Caused by: java.io.FileNotFoundException: C:\Users\bamboo\AppData\Local\Temp\RNDTEST-SOFTWARE-RRJ10\surefire12705780684809620788\..%5C..%5C..%5C..%5C..%5C..%5C..%5Cbamboo%5Cxml-data%5Cbuild-dir%5CRNDTEST-SOFTWARE-RRJ10%5Cjunit4-ant%5Ctarget%5Ctest-classes\junit4.xml (The system cannot find the path specified)
Collapse Failed TestTextReport listeners History
< 1 sec
org.apache.tools.ant.BuildException: java.io.FileNotFoundException: C:\Users\bamboo\AppData\Local\Temp\RNDTEST-SOFTWARE-RRJ10\surefire12705780684809620788\..%5C..%5C..%5C..%5C..%5C..%5C..%5Cbamboo%5Cxml-data%5Cbuild-dir%5CRNDTEST-SOFTWARE-RRJ10%5Cjunit4-ant%5Ctarget%5Ctest-classes\junit4.xml (The system cannot find the path specified)
Caused by: java.io.FileNotFoundException: C:\Users\bamboo\AppData\Local\Temp\RNDTEST-SOFTWARE-RRJ10\surefire12705780684809620788\..%5C..%5C..%5C..%5C..%5C..%5C..%5Cbamboo%5Cxml-data%5Cbuild-dir%5CRNDTEST-SOFTWARE-RRJ10%5Cjunit4-ant%5Ctarget%5Ctest-classes\junit4.xml (The system cannot find the path specified)
Collapse Failed TestTextReport reasonForIgnored History
< 1 sec
org.apache.tools.ant.BuildException: java.io.FileNotFoundException: C:\Users\bamboo\AppData\Local\Temp\RNDTEST-SOFTWARE-RRJ10\surefire12705780684809620788\..%5C..%5C..%5C..%5C..%5C..%5C..%5Cbamboo%5Cxml-data%5Cbuild-dir%5CRNDTEST-SOFTWARE-RRJ10%5Cjunit4-ant%5Ctarget%5Ctest-classes\junit4.xml (The system cannot find the path specified)
Caused by: java.io.FileNotFoundException: C:\Users\bamboo\AppData\Local\Temp\RNDTEST-SOFTWARE-RRJ10\surefire12705780684809620788\..%5C..%5C..%5C..%5C..%5C..%5C..%5Cbamboo%5Cxml-data%5Cbuild-dir%5CRNDTEST-SOFTWARE-RRJ10%5Cjunit4-ant%5Ctarget%5Ctest-classes\junit4.xml (The system cannot find the path specified)
Collapse Failed TestTextReport reasonForIgnoredByDisabledGroup History
< 1 sec
org.apache.tools.ant.BuildException: java.io.FileNotFoundException: C:\Users\bamboo\AppData\Local\Temp\RNDTEST-SOFTWARE-RRJ10\surefire12705780684809620788\..%5C..%5C..%5C..%5C..%5C..%5C..%5Cbamboo%5Cxml-data%5Cbuild-dir%5CRNDTEST-SOFTWARE-RRJ10%5Cjunit4-ant%5Ctarget%5Ctest-classes\junit4.xml (The system cannot find the path specified)
Caused by: java.io.FileNotFoundException: C:\Users\bamboo\AppData\Local\Temp\RNDTEST-SOFTWARE-RRJ10\surefire12705780684809620788\..%5C..%5C..%5C..%5C..%5C..%5C..%5Cbamboo%5Cxml-data%5Cbuild-dir%5CRNDTEST-SOFTWARE-RRJ10%5Cjunit4-ant%5Ctarget%5Ctest-classes\junit4.xml (The system cannot find the path specified)
Collapse Failed TestTextReport reasonForSuiteAssumptionIgnored History
< 1 sec
org.apache.tools.ant.BuildException: java.io.FileNotFoundException: C:\Users\bamboo\AppData\Local\Temp\RNDTEST-SOFTWARE-RRJ10\surefire12705780684809620788\..%5C..%5C..%5C..%5C..%5C..%5C..%5Cbamboo%5Cxml-data%5Cbuild-dir%5CRNDTEST-SOFTWARE-RRJ10%5Cjunit4-ant%5Ctarget%5Ctest-classes\junit4.xml (The system cannot find the path specified)
Caused by: java.io.FileNotFoundException: C:\Users\bamboo\AppData\Local\Temp\RNDTEST-SOFTWARE-RRJ10\surefire12705780684809620788\..%5C..%5C..%5C..%5C..%5C..%5C..%5Cbamboo%5Cxml-data%5Cbuild-dir%5CRNDTEST-SOFTWARE-RRJ10%5Cjunit4-ant%5Ctarget%5Ctest-classes\junit4.xml (The system cannot find the path specified)
Collapse Failed TestTextReport suiteerror History
< 1 sec
org.apache.tools.ant.BuildException: java.io.FileNotFoundException: C:\Users\bamboo\AppData\Local\Temp\RNDTEST-SOFTWARE-RRJ10\surefire12705780684809620788\..%5C..%5C..%5C..%5C..%5C..%5C..%5Cbamboo%5Cxml-data%5Cbuild-dir%5CRNDTEST-SOFTWARE-RRJ10%5Cjunit4-ant%5Ctarget%5Ctest-classes\junit4.xml (The system cannot find the path specified)
Caused by: java.io.FileNotFoundException: C:\Users\bamboo\AppData\Local\Temp\RNDTEST-SOFTWARE-RRJ10\surefire12705780684809620788\..%5C..%5C..%5C..%5C..%5C..%5C..%5Cbamboo%5Cxml-data%5Cbuild-dir%5CRNDTEST-SOFTWARE-RRJ10%5Cjunit4-ant%5Ctarget%5Ctest-classes\junit4.xml (The system cannot find the path specified)
Collapse Failed TestTextReport sysoutsOnSuiteFailure History
< 1 sec
org.apache.tools.ant.BuildException: java.io.FileNotFoundException: C:\Users\bamboo\AppData\Local\Temp\RNDTEST-SOFTWARE-RRJ10\surefire12705780684809620788\..%5C..%5C..%5C..%5C..%5C..%5C..%5Cbamboo%5Cxml-data%5Cbuild-dir%5CRNDTEST-SOFTWARE-RRJ10%5Cjunit4-ant%5Ctarget%5Ctest-classes\junit4.xml (The system cannot find the path specified)
Caused by: java.io.FileNotFoundException: C:\Users\bamboo\AppData\Local\Temp\RNDTEST-SOFTWARE-RRJ10\surefire12705780684809620788\..%5C..%5C..%5C..%5C..%5C..%5C..%5Cbamboo%5Cxml-data%5Cbuild-dir%5CRNDTEST-SOFTWARE-RRJ10%5Cjunit4-ant%5Ctarget%5Ctest-classes\junit4.xml (The system cannot find the path specified)
Collapse Failed TestTextReport sysoutsOnSuiteTimeout History
< 1 sec
org.apache.tools.ant.BuildException: java.io.FileNotFoundException: C:\Users\bamboo\AppData\Local\Temp\RNDTEST-SOFTWARE-RRJ10\surefire12705780684809620788\..%5C..%5C..%5C..%5C..%5C..%5C..%5Cbamboo%5Cxml-data%5Cbuild-dir%5CRNDTEST-SOFTWARE-RRJ10%5Cjunit4-ant%5Ctarget%5Ctest-classes\junit4.xml (The system cannot find the path specified)
Caused by: java.io.FileNotFoundException: C:\Users\bamboo\AppData\Local\Temp\RNDTEST-SOFTWARE-RRJ10\surefire12705780684809620788\..%5C..%5C..%5C..%5C..%5C..%5C..%5Cbamboo%5Cxml-data%5Cbuild-dir%5CRNDTEST-SOFTWARE-RRJ10%5Cjunit4-ant%5Ctarget%5Ctest-classes\junit4.xml (The system cannot find the path specified)
Collapse Failed TestTextReport sysoutsPassthrough History
< 1 sec
org.apache.tools.ant.BuildException: java.io.FileNotFoundException: C:\Users\bamboo\AppData\Local\Temp\RNDTEST-SOFTWARE-RRJ10\surefire12705780684809620788\..%5C..%5C..%5C..%5C..%5C..%5C..%5Cbamboo%5Cxml-data%5Cbuild-dir%5CRNDTEST-SOFTWARE-RRJ10%5Cjunit4-ant%5Ctarget%5Ctest-classes\junit4.xml (The system cannot find the path specified)
Caused by: java.io.FileNotFoundException: C:\Users\bamboo\AppData\Local\Temp\RNDTEST-SOFTWARE-RRJ10\surefire12705780684809620788\..%5C..%5C..%5C..%5C..%5C..%5C..%5Cbamboo%5Cxml-data%5Cbuild-dir%5CRNDTEST-SOFTWARE-RRJ10%5Cjunit4-ant%5Ctarget%5Ctest-classes\junit4.xml (The system cannot find the path specified)
Collapse Failed TestTextReport timestamps History
< 1 sec
org.apache.tools.ant.BuildException: java.io.FileNotFoundException: C:\Users\bamboo\AppData\Local\Temp\RNDTEST-SOFTWARE-RRJ10\surefire12705780684809620788\..%5C..%5C..%5C..%5C..%5C..%5C..%5Cbamboo%5Cxml-data%5Cbuild-dir%5CRNDTEST-SOFTWARE-RRJ10%5Cjunit4-ant%5Ctarget%5Ctest-classes\junit4.xml (The system cannot find the path specified)
Caused by: java.io.FileNotFoundException: C:\Users\bamboo\AppData\Local\Temp\RNDTEST-SOFTWARE-RRJ10\surefire12705780684809620788\..%5C..%5C..%5C..%5C..%5C..%5C..%5Cbamboo%5Cxml-data%5Cbuild-dir%5CRNDTEST-SOFTWARE-RRJ10%5Cjunit4-ant%5Ctarget%5Ctest-classes\junit4.xml (The system cannot find the path specified)
Collapse Failed TestUnhandledSlaveFailure checkSlaveMainFailure History
< 1 sec
org.apache.tools.ant.BuildException: java.io.FileNotFoundException: C:\Users\bamboo\AppData\Local\Temp\RNDTEST-SOFTWARE-RRJ10\surefire12705780684809620788\..%5C..%5C..%5C..%5C..%5C..%5C..%5Cbamboo%5Cxml-data%5Cbuild-dir%5CRNDTEST-SOFTWARE-RRJ10%5Cjunit4-ant%5Ctarget%5Ctest-classes\junit4.xml (The system cannot find the path specified)
Caused by: java.io.FileNotFoundException: C:\Users\bamboo\AppData\Local\Temp\RNDTEST-SOFTWARE-RRJ10\surefire12705780684809620788\..%5C..%5C..%5C..%5C..%5C..%5C..%5Cbamboo%5Cxml-data%5Cbuild-dir%5CRNDTEST-SOFTWARE-RRJ10%5Cjunit4-ant%5Ctarget%5Ctest-classes\junit4.xml (The system cannot find the path specified)
Collapse Failed TestWeirdClasses antxml History
< 1 sec
org.apache.tools.ant.BuildException: java.io.FileNotFoundException: C:\Users\bamboo\AppData\Local\Temp\RNDTEST-SOFTWARE-RRJ10\surefire12705780684809620788\..%5C..%5C..%5C..%5C..%5C..%5C..%5Cbamboo%5Cxml-data%5Cbuild-dir%5CRNDTEST-SOFTWARE-RRJ10%5Cjunit4-ant%5Ctarget%5Ctest-classes\junit4.xml (The system cannot find the path specified)
Caused by: java.io.FileNotFoundException: C:\Users\bamboo\AppData\Local\Temp\RNDTEST-SOFTWARE-RRJ10\surefire12705780684809620788\..%5C..%5C..%5C..%5C..%5C..%5C..%5Cbamboo%5Cxml-data%5Cbuild-dir%5CRNDTEST-SOFTWARE-RRJ10%5Cjunit4-ant%5Ctarget%5Ctest-classes\junit4.xml (The system cannot find the path specified)