Build #225

Build: #225 failed

Job: JDK 10 failed

Stages & jobs

  1. Compile and test

  2. Package

Build log

The build generated 3,417 lines of output.The output is too long and has been truncated to the last 1,000 lines. Download or view full build log

20-Nov-2018 10:01:01   41) Thread[id=5784, name=stubborn-48, state=TIMED_WAITING, group=TGRP-Test012RunawayThreadsKilledAtOnce$NestedClass]
20-Nov-2018 10:01:01         at java.base@10/java.lang.Thread.sleep(Native Method)
20-Nov-2018 10:01:01         at app//com.carrotsearch.randomizedtesting.timeouts.Test012RunawayThreadsKilledAtOnce$NestedClass$1.run(Test012RunawayThreadsKilledAtOnce.java:29)
20-Nov-2018 10:01:01   42) Thread[id=5740, name=stubborn-4, state=TIMED_WAITING, group=TGRP-Test012RunawayThreadsKilledAtOnce$NestedClass]
20-Nov-2018 10:01:01         at java.base@10/java.lang.Thread.sleep(Native Method)
20-Nov-2018 10:01:01         at app//com.carrotsearch.randomizedtesting.timeouts.Test012RunawayThreadsKilledAtOnce$NestedClass$1.run(Test012RunawayThreadsKilledAtOnce.java:29)
20-Nov-2018 10:01:01   43) Thread[id=5764, name=stubborn-28, state=TIMED_WAITING, group=TGRP-Test012RunawayThreadsKilledAtOnce$NestedClass]
20-Nov-2018 10:01:01         at java.base@10/java.lang.Thread.sleep(Native Method)
20-Nov-2018 10:01:01         at app//com.carrotsearch.randomizedtesting.timeouts.Test012RunawayThreadsKilledAtOnce$NestedClass$1.run(Test012RunawayThreadsKilledAtOnce.java:29)
20-Nov-2018 10:01:01   44) Thread[id=5770, name=stubborn-34, state=TIMED_WAITING, group=TGRP-Test012RunawayThreadsKilledAtOnce$NestedClass]
20-Nov-2018 10:01:01         at java.base@10/java.lang.Thread.sleep(Native Method)
20-Nov-2018 10:01:01         at app//com.carrotsearch.randomizedtesting.timeouts.Test012RunawayThreadsKilledAtOnce$NestedClass$1.run(Test012RunawayThreadsKilledAtOnce.java:29)
20-Nov-2018 10:01:01   45) Thread[id=5737, name=stubborn-1, state=TIMED_WAITING, group=TGRP-Test012RunawayThreadsKilledAtOnce$NestedClass]
20-Nov-2018 10:01:01         at java.base@10/java.lang.Thread.sleep(Native Method)
20-Nov-2018 10:01:01         at app//com.carrotsearch.randomizedtesting.timeouts.Test012RunawayThreadsKilledAtOnce$NestedClass$1.run(Test012RunawayThreadsKilledAtOnce.java:29)
20-Nov-2018 10:01:01   46) Thread[id=5749, name=stubborn-13, state=TIMED_WAITING, group=TGRP-Test012RunawayThreadsKilledAtOnce$NestedClass]
20-Nov-2018 10:01:01         at java.base@10/java.lang.Thread.sleep(Native Method)
20-Nov-2018 10:01:01         at app//com.carrotsearch.randomizedtesting.timeouts.Test012RunawayThreadsKilledAtOnce$NestedClass$1.run(Test012RunawayThreadsKilledAtOnce.java:29)
20-Nov-2018 10:01:01   47) Thread[id=5782, name=stubborn-46, state=TIMED_WAITING, group=TGRP-Test012RunawayThreadsKilledAtOnce$NestedClass]
20-Nov-2018 10:01:01         at java.base@10/java.lang.Thread.sleep(Native Method)
20-Nov-2018 10:01:01         at app//com.carrotsearch.randomizedtesting.timeouts.Test012RunawayThreadsKilledAtOnce$NestedClass$1.run(Test012RunawayThreadsKilledAtOnce.java:29)
20-Nov-2018 10:01:01   48) Thread[id=5760, name=stubborn-24, state=TIMED_WAITING, group=TGRP-Test012RunawayThreadsKilledAtOnce$NestedClass]
20-Nov-2018 10:01:01         at java.base@10/java.lang.Thread.sleep(Native Method)
20-Nov-2018 10:01:01         at app//com.carrotsearch.randomizedtesting.timeouts.Test012RunawayThreadsKilledAtOnce$NestedClass$1.run(Test012RunawayThreadsKilledAtOnce.java:29)
20-Nov-2018 10:01:01   49) Thread[id=5771, name=stubborn-35, state=TIMED_WAITING, group=TGRP-Test012RunawayThreadsKilledAtOnce$NestedClass]
20-Nov-2018 10:01:01         at java.base@10/java.lang.Thread.sleep(Native Method)
20-Nov-2018 10:01:01         at app//com.carrotsearch.randomizedtesting.timeouts.Test012RunawayThreadsKilledAtOnce$NestedClass$1.run(Test012RunawayThreadsKilledAtOnce.java:29)
20-Nov-2018 10:01:01   50) Thread[id=5757, name=stubborn-21, state=TIMED_WAITING, group=TGRP-Test012RunawayThreadsKilledAtOnce$NestedClass]
20-Nov-2018 10:01:01         at java.base@10/java.lang.Thread.sleep(Native Method)
20-Nov-2018 10:01:01         at app//com.carrotsearch.randomizedtesting.timeouts.Test012RunawayThreadsKilledAtOnce$NestedClass$1.run(Test012RunawayThreadsKilledAtOnce.java:29)
20-Nov-2018 10:01:01 Finished: lotsOfStubbornThreads
20-Nov-2018 10:01:01 Run finished: run=1, ignored=0, failures=1, assumptions=0
20-Nov-2018 10:01:01
20-Nov-2018 10:01:01 Tests run: 1, Failures: 0, Errors: 0, Skipped: 0, Time elapsed: 0.039 sec - in com.carrotsearch.randomizedtesting.timeouts.Test012RunawayThreadsKilledAtOnce
20-Nov-2018 10:01:01 Running com.carrotsearch.randomizedtesting.timeouts.Test008SeedsAnnotation
20-Nov-2018 10:01:01 Run started.
20-Nov-2018 10:01:01 Started : testMe {seed=[69481B3E526385CD:CAFEBABE]}
20-Nov-2018 10:01:01 Finished: testMe {seed=[69481B3E526385CD:CAFEBABE]}
20-Nov-2018 10:01:01 Started : testMe {seed=[69481B3E526385CD:CAFEBABE] #2}
20-Nov-2018 10:01:01 Finished: testMe {seed=[69481B3E526385CD:CAFEBABE] #2}
20-Nov-2018 10:01:01 Started : testMe {seed=[69481B3E526385CD:DEADBEEF]}
20-Nov-2018 10:01:01 Finished: testMe {seed=[69481B3E526385CD:DEADBEEF]}
20-Nov-2018 10:01:01 Started : testMe {seed=[69481B3E526385CD:DEADBEEF] #2}
20-Nov-2018 10:01:01 Finished: testMe {seed=[69481B3E526385CD:DEADBEEF] #2}
20-Nov-2018 10:01:01 Started : testMe {seed=[69481B3E526385CD:7BE08358AE141713]}
20-Nov-2018 10:01:01 Finished: testMe {seed=[69481B3E526385CD:7BE08358AE141713]}
20-Nov-2018 10:01:01 Started : testMe {seed=[69481B3E526385CD:7BE08358AE141713] #2}
20-Nov-2018 10:01:01 Finished: testMe {seed=[69481B3E526385CD:7BE08358AE141713] #2}
20-Nov-2018 10:01:01 Run finished: run=6, ignored=0, failures=0, assumptions=0
20-Nov-2018 10:01:01
20-Nov-2018 10:01:01 Run started.
20-Nov-2018 10:01:01 Started : testMe {seed=[CF2C56FE8B246F61:CAFEBABE]}
20-Nov-2018 10:01:01 Finished: testMe {seed=[CF2C56FE8B246F61:CAFEBABE]}
20-Nov-2018 10:01:01 Started : testMe {seed=[CF2C56FE8B246F61:CAFEBABE] #2}
20-Nov-2018 10:01:01 Finished: testMe {seed=[CF2C56FE8B246F61:CAFEBABE] #2}
20-Nov-2018 10:01:01 Started : testMe {seed=[CF2C56FE8B246F61:DD84CE987753FDBF]}
20-Nov-2018 10:01:01 Finished: testMe {seed=[CF2C56FE8B246F61:DD84CE987753FDBF]}
20-Nov-2018 10:01:01 Started : testMe {seed=[CF2C56FE8B246F61:DD84CE987753FDBF] #2}
20-Nov-2018 10:01:01 Finished: testMe {seed=[CF2C56FE8B246F61:DD84CE987753FDBF] #2}
20-Nov-2018 10:01:01 Started : testMe {seed=[CF2C56FE8B246F61:DEADBEEF]}
20-Nov-2018 10:01:01 Finished: testMe {seed=[CF2C56FE8B246F61:DEADBEEF]}
20-Nov-2018 10:01:01 Started : testMe {seed=[CF2C56FE8B246F61:DEADBEEF] #2}
20-Nov-2018 10:01:01 Finished: testMe {seed=[CF2C56FE8B246F61:DEADBEEF] #2}
20-Nov-2018 10:01:01 Run finished: run=6, ignored=0, failures=0, assumptions=0
20-Nov-2018 10:01:01
20-Nov-2018 10:01:01 Run started.
20-Nov-2018 10:01:01 Started : testMe {seed=[15CF2A49BD487B9B:CAFEBABE]}
20-Nov-2018 10:01:01 Finished: testMe {seed=[15CF2A49BD487B9B:CAFEBABE]}
20-Nov-2018 10:01:01 Started : testMe {seed=[15CF2A49BD487B9B:CAFEBABE] #2}
20-Nov-2018 10:01:01 Finished: testMe {seed=[15CF2A49BD487B9B:CAFEBABE] #2}
20-Nov-2018 10:01:01 Started : testMe {seed=[15CF2A49BD487B9B:DEADBEEF]}
20-Nov-2018 10:01:01 Finished: testMe {seed=[15CF2A49BD487B9B:DEADBEEF]}
20-Nov-2018 10:01:01 Started : testMe {seed=[15CF2A49BD487B9B:DEADBEEF] #2}
20-Nov-2018 10:01:01 Finished: testMe {seed=[15CF2A49BD487B9B:DEADBEEF] #2}
20-Nov-2018 10:01:01 Started : testMe {seed=[15CF2A49BD487B9B:767B22F413FE945]}
20-Nov-2018 10:01:01 Finished: testMe {seed=[15CF2A49BD487B9B:767B22F413FE945]}
20-Nov-2018 10:01:01 Started : testMe {seed=[15CF2A49BD487B9B:767B22F413FE945] #2}
20-Nov-2018 10:01:01 Finished: testMe {seed=[15CF2A49BD487B9B:767B22F413FE945] #2}
20-Nov-2018 10:01:01 Run finished: run=6, ignored=0, failures=0, assumptions=0
20-Nov-2018 10:01:01
20-Nov-2018 10:01:01 Run started.
20-Nov-2018 10:01:01 Started : testMe {seed=[B95E9B26EDB36198:CAFEBABE]}
20-Nov-2018 10:01:01 Finished: testMe {seed=[B95E9B26EDB36198:CAFEBABE]}
20-Nov-2018 10:01:01 Started : testMe {seed=[B95E9B26EDB36198:CAFEBABE] #2}
20-Nov-2018 10:01:01 Finished: testMe {seed=[B95E9B26EDB36198:CAFEBABE] #2}
20-Nov-2018 10:01:01 Started : testMe {seed=[B95E9B26EDB36198:DEADBEEF]}
20-Nov-2018 10:01:01 Finished: testMe {seed=[B95E9B26EDB36198:DEADBEEF]}
20-Nov-2018 10:01:01 Started : testMe {seed=[B95E9B26EDB36198:DEADBEEF] #2}
20-Nov-2018 10:01:01 Finished: testMe {seed=[B95E9B26EDB36198:DEADBEEF] #2}
20-Nov-2018 10:01:01 Started : testMe {seed=[B95E9B26EDB36198:ABF6034011C4F346]}
20-Nov-2018 10:01:01 Finished: testMe {seed=[B95E9B26EDB36198:ABF6034011C4F346]}
20-Nov-2018 10:01:01 Started : testMe {seed=[B95E9B26EDB36198:ABF6034011C4F346] #2}
20-Nov-2018 10:01:01 Finished: testMe {seed=[B95E9B26EDB36198:ABF6034011C4F346] #2}
20-Nov-2018 10:01:01 Run finished: run=6, ignored=0, failures=0, assumptions=0
20-Nov-2018 10:01:01
20-Nov-2018 10:01:01 Tests run: 1, Failures: 0, Errors: 0, Skipped: 0, Time elapsed: 0.012 sec - in com.carrotsearch.randomizedtesting.timeouts.Test008SeedsAnnotation
20-Nov-2018 10:01:01 Running com.carrotsearch.randomizedtesting.timeouts.Test020SuiteTimeoutStopsTests
20-Nov-2018 10:01:01 Run started.
20-Nov-2018 10:01:01 Started : test001
20-Nov-2018 10:01:01 before timeout(1)
20-Nov-2018 10:01:01 Failure : test001(com.carrotsearch.randomizedtesting.timeouts.Test020SuiteTimeoutStopsTests$Nested1): Test abandoned because suite timeout was reached.
20-Nov-2018 10:01:01 Finished: test001
20-Nov-2018 10:01:01 suite timeout(1)
20-Nov-2018 10:01:01 Failure : com.carrotsearch.randomizedtesting.timeouts.Test020SuiteTimeoutStopsTests$Nested1: Suite timeout exceeded (>= 500 msec).
20-Nov-2018 10:01:01 Run finished: run=1, ignored=0, failures=2, assumptions=0
20-Nov-2018 10:01:01
20-Nov-2018 10:01:01 Nov 20, 2018 10:01:01 AM com.carrotsearch.randomizedtesting.ThreadLeakControl$2 evaluate
20-Nov-2018 10:01:01 WARNING: Suite execution timed out: com.carrotsearch.randomizedtesting.timeouts.Test020SuiteTimeoutStopsTests$Nested1
20-Nov-2018 10:01:01 ==== jstack at approximately timeout time ====
20-Nov-2018 10:01:01 "main" ID=1 WAITING on com.carrotsearch.randomizedtesting.WithNestedTestClass$5@53fa77cc
20-Nov-2018 10:01:01         at java.base@10/java.lang.Object.wait(Native Method)
20-Nov-2018 10:01:01         - waiting on com.carrotsearch.randomizedtesting.WithNestedTestClass$5@53fa77cc
20-Nov-2018 10:01:01         at java.base@10/java.lang.Thread.join(Thread.java:1353)
20-Nov-2018 10:01:01         at java.base@10/java.lang.Thread.join(Thread.java:1427)
20-Nov-2018 10:01:01         at app//com.carrotsearch.randomizedtesting.WithNestedTestClass.runTests(WithNestedTestClass.java:341)
20-Nov-2018 10:01:01         at app//com.carrotsearch.randomizedtesting.timeouts.Test020SuiteTimeoutStopsTests.testExceptionInFilter(Test020SuiteTimeoutStopsTests.java:63)
20-Nov-2018 10:01:01         at java.base@10/jdk.internal.reflect.NativeMethodAccessorImpl.invoke0(Native Method)
20-Nov-2018 10:01:01         at java.base@10/jdk.internal.reflect.NativeMethodAccessorImpl.invoke(NativeMethodAccessorImpl.java:62)
20-Nov-2018 10:01:01         at java.base@10/jdk.internal.reflect.DelegatingMethodAccessorImpl.invoke(DelegatingMethodAccessorImpl.java:43)
20-Nov-2018 10:01:01         at java.base@10/java.lang.reflect.Method.invoke(Method.java:564)
20-Nov-2018 10:01:01         at app//org.junit.runners.model.FrameworkMethod$1.runReflectiveCall(FrameworkMethod.java:50)
20-Nov-2018 10:01:01         at app//org.junit.internal.runners.model.ReflectiveCallable.run(ReflectiveCallable.java:12)
20-Nov-2018 10:01:01         at app//org.junit.runners.model.FrameworkMethod.invokeExplosively(FrameworkMethod.java:47)
20-Nov-2018 10:01:01         at app//org.junit.internal.runners.statements.InvokeMethod.evaluate(InvokeMethod.java:17)
20-Nov-2018 10:01:01         at app//org.junit.internal.runners.statements.RunBefores.evaluate(RunBefores.java:26)
20-Nov-2018 10:01:01         at app//org.junit.internal.runners.statements.RunAfters.evaluate(RunAfters.java:27)
20-Nov-2018 10:01:01         at app//org.junit.runners.ParentRunner.runLeaf(ParentRunner.java:325)
20-Nov-2018 10:01:01         at app//org.junit.runners.BlockJUnit4ClassRunner.runChild(BlockJUnit4ClassRunner.java:78)
20-Nov-2018 10:01:01         at app//org.junit.runners.BlockJUnit4ClassRunner.runChild(BlockJUnit4ClassRunner.java:57)
20-Nov-2018 10:01:01         at app//org.junit.runners.ParentRunner$3.run(ParentRunner.java:290)
20-Nov-2018 10:01:01         at app//org.junit.runners.ParentRunner$1.schedule(ParentRunner.java:71)
20-Nov-2018 10:01:01         at app//org.junit.runners.ParentRunner.runChildren(ParentRunner.java:288)
20-Nov-2018 10:01:01         at app//org.junit.runners.ParentRunner.access$000(ParentRunner.java:58)
20-Nov-2018 10:01:01         at app//org.junit.runners.ParentRunner$2.evaluate(ParentRunner.java:268)
20-Nov-2018 10:01:01         at app//org.junit.internal.runners.statements.RunBefores.evaluate(RunBefores.java:26)
20-Nov-2018 10:01:01         at app//org.junit.internal.runners.statements.RunAfters.evaluate(RunAfters.java:27)
20-Nov-2018 10:01:01         at app//com.carrotsearch.randomizedtesting.rules.StatementAdapter.evaluate(StatementAdapter.java:36)
20-Nov-2018 10:01:01         at app//com.carrotsearch.randomizedtesting.rules.SystemPropertiesInvariantRule$1.evaluate(SystemPropertiesInvariantRule.java:59)
20-Nov-2018 10:01:01         at app//org.junit.rules.RunRules.evaluate(RunRules.java:20)
20-Nov-2018 10:01:01         at app//org.junit.runners.ParentRunner.run(ParentRunner.java:363)
20-Nov-2018 10:01:01         at app//org.apache.maven.surefire.junit4.JUnit4Provider.execute(JUnit4Provider.java:367)
20-Nov-2018 10:01:01         at app//org.apache.maven.surefire.junit4.JUnit4Provider.executeWithRerun(JUnit4Provider.java:274)
20-Nov-2018 10:01:01         at app//org.apache.maven.surefire.junit4.JUnit4Provider.executeTestSet(JUnit4Provider.java:238)
20-Nov-2018 10:01:01         at app//org.apache.maven.surefire.junit4.JUnit4Provider.invoke(JUnit4Provider.java:161)
20-Nov-2018 10:01:01         at app//org.apache.maven.surefire.booter.ForkedBooter.invokeProviderInSameClassLoader(ForkedBooter.java:290)
20-Nov-2018 10:01:01         at app//org.apache.maven.surefire.booter.ForkedBooter.runSuitesInProcess(ForkedBooter.java:242)
20-Nov-2018 10:01:01         at app//org.apache.maven.surefire.booter.ForkedBooter.main(ForkedBooter.java:121)
20-Nov-2018 10:01:01
20-Nov-2018 10:01:01 "Reference Handler" ID=2 RUNNABLE
20-Nov-2018 10:01:01         at java.base@10/java.lang.ref.Reference.waitForReferencePendingList(Native Method)
20-Nov-2018 10:01:01         at java.base@10/java.lang.ref.Reference.processPendingReferences(Reference.java:174)
20-Nov-2018 10:01:01         at java.base@10/java.lang.ref.Reference.access$000(Reference.java:44)
20-Nov-2018 10:01:01         at java.base@10/java.lang.ref.Reference$ReferenceHandler.run(Reference.java:138)
20-Nov-2018 10:01:01
20-Nov-2018 10:01:01 "Finalizer" ID=3 WAITING on java.lang.ref.ReferenceQueue$Lock@6721745f
20-Nov-2018 10:01:01         at java.base@10/java.lang.Object.wait(Native Method)
20-Nov-2018 10:01:01         - waiting on java.lang.ref.ReferenceQueue$Lock@6721745f
20-Nov-2018 10:01:01         at java.base@10/java.lang.ref.ReferenceQueue.remove(ReferenceQueue.java:151)
20-Nov-2018 10:01:01         at java.base@10/java.lang.ref.ReferenceQueue.remove(ReferenceQueue.java:172)
20-Nov-2018 10:01:01         at java.base@10/java.lang.ref.Finalizer$FinalizerThread.run(Finalizer.java:216)
20-Nov-2018 10:01:01
20-Nov-2018 10:01:01 "Signal Dispatcher" ID=4 RUNNABLE
20-Nov-2018 10:01:01
20-Nov-2018 10:01:01 "Common-Cleaner" ID=11 TIMED_WAITING on java.lang.ref.ReferenceQueue$Lock@1326e659
20-Nov-2018 10:01:01         at java.base@10/java.lang.Object.wait(Native Method)
20-Nov-2018 10:01:01         - timed waiting on java.lang.ref.ReferenceQueue$Lock@1326e659
20-Nov-2018 10:01:01         at java.base@10/java.lang.ref.ReferenceQueue.remove(ReferenceQueue.java:151)
20-Nov-2018 10:01:01         at java.base@10/jdk.internal.ref.CleanerImpl.run(CleanerImpl.java:148)
20-Nov-2018 10:01:01         at java.base@10/java.lang.Thread.run(Thread.java:844)
20-Nov-2018 10:01:01         at java.base@10/jdk.internal.misc.InnocuousThread.run(InnocuousThread.java:134)
20-Nov-2018 10:01:01
20-Nov-2018 10:01:01 "last-ditch-daemon-shutdown-thread-30sec" ID=12 TIMED_WAITING on java.util.concurrent.locks.AbstractQueuedSynchronizer$ConditionObject@560c5507
20-Nov-2018 10:01:01         at java.base@10/jdk.internal.misc.Unsafe.park(Native Method)
20-Nov-2018 10:01:01         - timed waiting on java.util.concurrent.locks.AbstractQueuedSynchronizer$ConditionObject@560c5507
20-Nov-2018 10:01:01         at java.base@10/java.util.concurrent.locks.LockSupport.parkNanos(LockSupport.java:234)
20-Nov-2018 10:01:01         at java.base@10/java.util.concurrent.locks.AbstractQueuedSynchronizer$ConditionObject.awaitNanos(AbstractQueuedSynchronizer.java:2117)
20-Nov-2018 10:01:01         at java.base@10/java.util.concurrent.ScheduledThreadPoolExecutor$DelayedWorkQueue.take(ScheduledThreadPoolExecutor.java:1182)
20-Nov-2018 10:01:01         at java.base@10/java.util.concurrent.ScheduledThreadPoolExecutor$DelayedWorkQueue.take(ScheduledThreadPoolExecutor.java:899)
20-Nov-2018 10:01:01         at java.base@10/java.util.concurrent.ThreadPoolExecutor.getTask(ThreadPoolExecutor.java:1061)
20-Nov-2018 10:01:01         at java.base@10/java.util.concurrent.ThreadPoolExecutor.runWorker(ThreadPoolExecutor.java:1121)
20-Nov-2018 10:01:01         at java.base@10/java.util.concurrent.ThreadPoolExecutor$Worker.run(ThreadPoolExecutor.java:635)
20-Nov-2018 10:01:01         at java.base@10/java.lang.Thread.run(Thread.java:844)
20-Nov-2018 10:01:01
20-Nov-2018 10:01:01 "surefire-forkedjvm-command-thread" ID=13 RUNNABLE (in native code)
20-Nov-2018 10:01:01         at java.base@10/java.io.FileInputStream.readBytes(Native Method)
20-Nov-2018 10:01:01         at java.base@10/java.io.FileInputStream.read(FileInputStream.java:280)
20-Nov-2018 10:01:01         at java.base@10/java.io.BufferedInputStream.fill(BufferedInputStream.java:252)
20-Nov-2018 10:01:01         at java.base@10/java.io.BufferedInputStream.read(BufferedInputStream.java:271)
20-Nov-2018 10:01:01         - locked java.io.BufferedInputStream@6be199bf
20-Nov-2018 10:01:01         at java.base@10/java.io.DataInputStream.readInt(DataInputStream.java:392)
20-Nov-2018 10:01:01         at app//org.apache.maven.surefire.booter.MasterProcessCommand.decode(MasterProcessCommand.java:117)
20-Nov-2018 10:01:01         at app//org.apache.maven.surefire.booter.CommandReader$CommandRunnable.run(CommandReader.java:360)
20-Nov-2018 10:01:01         at java.base@10/java.lang.Thread.run(Thread.java:844)
20-Nov-2018 10:01:01
20-Nov-2018 10:01:01 "Thread-5258" ID=5794 WAITING on com.carrotsearch.randomizedtesting.RandomizedRunner$2@57c5f9ec
20-Nov-2018 10:01:01         at java.base@10/java.lang.Object.wait(Native Method)
20-Nov-2018 10:01:01         - waiting on com.carrotsearch.randomizedtesting.RandomizedRunner$2@57c5f9ec
20-Nov-2018 10:01:01         at java.base@10/java.lang.Thread.join(Thread.java:1353)
20-Nov-2018 10:01:01         at java.base@10/java.lang.Thread.join(Thread.java:1427)
20-Nov-2018 10:01:01         at app//com.carrotsearch.randomizedtesting.RandomizedRunner.runSuite(RandomizedRunner.java:639)
20-Nov-2018 10:01:01         at app//com.carrotsearch.randomizedtesting.RandomizedRunner.run(RandomizedRunner.java:496)
20-Nov-2018 10:01:01         at app//org.junit.runners.Suite.runChild(Suite.java:128)
20-Nov-2018 10:01:01         at app//org.junit.runners.Suite.runChild(Suite.java:27)
20-Nov-2018 10:01:01         at app//org.junit.runners.ParentRunner$3.run(ParentRunner.java:290)
20-Nov-2018 10:01:01         at app//org.junit.runners.ParentRunner$1.schedule(ParentRunner.java:71)
20-Nov-2018 10:01:01         at app//org.junit.runners.ParentRunner.runChildren(ParentRunner.java:288)
20-Nov-2018 10:01:01         at app//org.junit.runners.ParentRunner.access$000(ParentRunner.java:58)
20-Nov-2018 10:01:01         at app//org.junit.runners.ParentRunner$2.evaluate(ParentRunner.java:268)
20-Nov-2018 10:01:01         at app//org.junit.runners.ParentRunner.run(ParentRunner.java:363)
20-Nov-2018 10:01:01         at app//org.junit.runner.JUnitCore.run(JUnitCore.java:137)
20-Nov-2018 10:01:01         at app//org.junit.runner.JUnitCore.run(JUnitCore.java:115)
20-Nov-2018 10:01:01         at app//org.junit.runner.JUnitCore.run(JUnitCore.java:105)
20-Nov-2018 10:01:01         at app//org.junit.runner.JUnitCore.run(JUnitCore.java:94)
20-Nov-2018 10:01:01         at app//com.carrotsearch.randomizedtesting.WithNestedTestClass$5.run(WithNestedTestClass.java:336)
20-Nov-2018 10:01:01
20-Nov-2018 10:01:01 "SUITE-Test020SuiteTimeoutStopsTests$Nested1-seed#[4C9D58089CE86D92]" ID=5795 RUNNABLE
20-Nov-2018 10:01:01         at java.management@10/sun.management.ThreadImpl.dumpThreads0(Native Method)
20-Nov-2018 10:01:01         at java.management@10/sun.management.ThreadImpl.dumpAllThreads(ThreadImpl.java:502)
20-Nov-2018 10:01:01         at java.management@10/sun.management.ThreadImpl.dumpAllThreads(ThreadImpl.java:490)
20-Nov-2018 10:01:01         at app//com.carrotsearch.randomizedtesting.ThreadLeakControl.formatThreadStacksFull(ThreadLeakControl.java:681)
20-Nov-2018 10:01:01         at app//com.carrotsearch.randomizedtesting.ThreadLeakControl.access$1000(ThreadLeakControl.java:65)
20-Nov-2018 10:01:01         at app//com.carrotsearch.randomizedtesting.ThreadLeakControl$2.evaluate(ThreadLeakControl.java:415)
20-Nov-2018 10:01:01         - locked java.lang.Object@5fd6ea48
20-Nov-2018 10:01:01         at app//com.carrotsearch.randomizedtesting.RandomizedRunner.runSuite(RandomizedRunner.java:708)
20-Nov-2018 10:01:01         at app//com.carrotsearch.randomizedtesting.RandomizedRunner.access$200(RandomizedRunner.java:138)
20-Nov-2018 10:01:01         at app//com.carrotsearch.randomizedtesting.RandomizedRunner$2.run(RandomizedRunner.java:629)
20-Nov-2018 10:01:01
20-Nov-2018 10:01:01 "TEST-Test020SuiteTimeoutStopsTests$Nested1.test001-seed#[4C9D58089CE86D92]" ID=5796 TIMED_WAITING
20-Nov-2018 10:01:01         at java.base@10/java.lang.Thread.sleep(Native Method)
20-Nov-2018 10:01:01         at app//com.carrotsearch.randomizedtesting.timeouts.Test020SuiteTimeoutStopsTests$Nested1.idle(Test020SuiteTimeoutStopsTests.java:49)
20-Nov-2018 10:01:01         at app//com.carrotsearch.randomizedtesting.timeouts.Test020SuiteTimeoutStopsTests$Nested1.test001(Test020SuiteTimeoutStopsTests.java:25)
20-Nov-2018 10:01:01         at java.base@10/jdk.internal.reflect.NativeMethodAccessorImpl.invoke0(Native Method)
20-Nov-2018 10:01:01         at java.base@10/jdk.internal.reflect.NativeMethodAccessorImpl.invoke(NativeMethodAccessorImpl.java:62)
20-Nov-2018 10:01:01         at java.base@10/jdk.internal.reflect.DelegatingMethodAccessorImpl.invoke(DelegatingMethodAccessorImpl.java:43)
20-Nov-2018 10:01:01         at java.base@10/java.lang.reflect.Method.invoke(Method.java:564)
20-Nov-2018 10:01:01         at app//com.carrotsearch.randomizedtesting.RandomizedRunner.invoke(RandomizedRunner.java:1750)
20-Nov-2018 10:01:01         at app//com.carrotsearch.randomizedtesting.RandomizedRunner$8.evaluate(RandomizedRunner.java:938)
20-Nov-2018 10:01:01         at app//com.carrotsearch.randomizedtesting.rules.StatementAdapter.evaluate(StatementAdapter.java:36)
20-Nov-2018 10:01:01         at app//com.carrotsearch.randomizedtesting.ThreadLeakControl$StatementRunner.run(ThreadLeakControl.java:368)
20-Nov-2018 10:01:01         at app//com.carrotsearch.randomizedtesting.ThreadLeakControl.forkTimeoutingTask(ThreadLeakControl.java:817)
20-Nov-2018 10:01:01         at app//com.carrotsearch.randomizedtesting.ThreadLeakControl$3.evaluate(ThreadLeakControl.java:468)
20-Nov-2018 10:01:01         at app//com.carrotsearch.randomizedtesting.RandomizedRunner.runSingleTest(RandomizedRunner.java:947)
20-Nov-2018 10:01:01         at app//com.carrotsearch.randomizedtesting.RandomizedRunner$5.evaluate(RandomizedRunner.java:832)
20-Nov-2018 10:01:01         at app//com.carrotsearch.randomizedtesting.RandomizedRunner$6.evaluate(RandomizedRunner.java:883)
20-Nov-2018 10:01:01         at app//com.carrotsearch.randomizedtesting.RandomizedRunner$7.evaluate(RandomizedRunner.java:894)
20-Nov-2018 10:01:01         at app//com.carrotsearch.randomizedtesting.rules.StatementAdapter.evaluate(StatementAdapter.java:36)
20-Nov-2018 10:01:01         at app//com.carrotsearch.randomizedtesting.ThreadLeakControl$StatementRunner.run(ThreadLeakControl.java:368)
20-Nov-2018 10:01:01         at java.base@10/java.lang.Thread.run(Thread.java:844)
20-Nov-2018 10:01:01
20-Nov-2018 10:01:01 ^^==============================================
20-Nov-2018 10:01:01
20-Nov-2018 10:01:01
20-Nov-2018 10:01:01 Nov 20, 2018 10:01:01 AM com.carrotsearch.randomizedtesting.ThreadLeakControl checkThreadLeaks
20-Nov-2018 10:01:01 SEVERE: 1 thread leaked from SUITE scope at com.carrotsearch.randomizedtesting.timeouts.Test020SuiteTimeoutStopsTests$Nested1:
20-Nov-2018 10:01:01    1) Thread[id=5796, name=TEST-Test020SuiteTimeoutStopsTests$Nested1.test001-seed#[4C9D58089CE86D92], state=TIMED_WAITING, group=TGRP-Test020SuiteTimeoutStopsTests$Nested1]
20-Nov-2018 10:01:01         at java.base@10/java.lang.Thread.sleep(Native Method)
20-Nov-2018 10:01:01         at app//com.carrotsearch.randomizedtesting.timeouts.Test020SuiteTimeoutStopsTests$Nested1.idle(Test020SuiteTimeoutStopsTests.java:49)
20-Nov-2018 10:01:01         at app//com.carrotsearch.randomizedtesting.timeouts.Test020SuiteTimeoutStopsTests$Nested1.test001(Test020SuiteTimeoutStopsTests.java:25)
20-Nov-2018 10:01:01         at java.base@10/jdk.internal.reflect.NativeMethodAccessorImpl.invoke0(Native Method)
20-Nov-2018 10:01:01         at java.base@10/jdk.internal.reflect.NativeMethodAccessorImpl.invoke(NativeMethodAccessorImpl.java:62)
20-Nov-2018 10:01:01         at java.base@10/jdk.internal.reflect.DelegatingMethodAccessorImpl.invoke(DelegatingMethodAccessorImpl.java:43)
20-Nov-2018 10:01:01         at java.base@10/java.lang.reflect.Method.invoke(Method.java:564)
20-Nov-2018 10:01:01         at app//com.carrotsearch.randomizedtesting.RandomizedRunner.invoke(RandomizedRunner.java:1750)
20-Nov-2018 10:01:01         at app//com.carrotsearch.randomizedtesting.RandomizedRunner$8.evaluate(RandomizedRunner.java:938)
20-Nov-2018 10:01:01         at app//com.carrotsearch.randomizedtesting.rules.StatementAdapter.evaluate(StatementAdapter.java:36)
20-Nov-2018 10:01:01         at app//com.carrotsearch.randomizedtesting.ThreadLeakControl$StatementRunner.run(ThreadLeakControl.java:368)
20-Nov-2018 10:01:01         at app//com.carrotsearch.randomizedtesting.ThreadLeakControl.forkTimeoutingTask(ThreadLeakControl.java:817)
20-Nov-2018 10:01:01         at app//com.carrotsearch.randomizedtesting.ThreadLeakControl$3.evaluate(ThreadLeakControl.java:468)
20-Nov-2018 10:01:01         at app//com.carrotsearch.randomizedtesting.RandomizedRunner.runSingleTest(RandomizedRunner.java:947)
20-Nov-2018 10:01:01         at app//com.carrotsearch.randomizedtesting.RandomizedRunner$5.evaluate(RandomizedRunner.java:832)
20-Nov-2018 10:01:01         at app//com.carrotsearch.randomizedtesting.RandomizedRunner$6.evaluate(RandomizedRunner.java:883)
20-Nov-2018 10:01:01         at app//com.carrotsearch.randomizedtesting.RandomizedRunner$7.evaluate(RandomizedRunner.java:894)
20-Nov-2018 10:01:01         at app//com.carrotsearch.randomizedtesting.rules.StatementAdapter.evaluate(StatementAdapter.java:36)
20-Nov-2018 10:01:01         at app//com.carrotsearch.randomizedtesting.ThreadLeakControl$StatementRunner.run(ThreadLeakControl.java:368)
20-Nov-2018 10:01:01         at java.base@10/java.lang.Thread.run(Thread.java:844)
20-Nov-2018 10:01:01
20-Nov-2018 10:01:01 Nov 20, 2018 10:01:01 AM com.carrotsearch.randomizedtesting.ThreadLeakControl tryToInterruptAll
20-Nov-2018 10:01:01 INFO: Starting to interrupt leaked threads:
20-Nov-2018 10:01:01    1) Thread[id=5796, name=TEST-Test020SuiteTimeoutStopsTests$Nested1.test001-seed#[4C9D58089CE86D92], state=TIMED_WAITING, group=TGRP-Test020SuiteTimeoutStopsTests$Nested1]
20-Nov-2018 10:01:01
20-Nov-2018 10:01:01 Nov 20, 2018 10:01:01 AM com.carrotsearch.randomizedtesting.ThreadLeakControl tryToInterruptAll
20-Nov-2018 10:01:01 INFO: All leaked threads terminated.
20-Nov-2018 10:01:01
20-Nov-2018 10:01:01
20-Nov-2018 10:01:01 Tests run: 1, Failures: 0, Errors: 0, Skipped: 0, Time elapsed: 0.596 sec - in com.carrotsearch.randomizedtesting.timeouts.Test020SuiteTimeoutStopsTests
20-Nov-2018 10:01:01 Running com.carrotsearch.randomizedtesting.timeouts.Test019ThreadLeakGroup
20-Nov-2018 10:01:01 Run started.
20-Nov-2018 10:01:01 Started : testLeakOutsideOfGroup
20-Nov-2018 10:01:01 Failure : testLeakOutsideOfGroup(com.carrotsearch.randomizedtesting.timeouts.Test019ThreadLeakGroup$Nested3): 1 thread leaked from TEST scope at testLeakOutsideOfGroup(com.carrotsearch.randomizedtesting.timeouts.Test019ThreadLeakGroup$Nested3):
20-Nov-2018 10:01:01    1) Thread[id=5799, name=foobar, state=TIMED_WAITING, group=foobar-group]
20-Nov-2018 10:01:01         at java.base@10/java.lang.Thread.sleep(Native Method)
20-Nov-2018 10:01:01         at app//com.carrotsearch.randomizedtesting.timeouts.Test019ThreadLeakGroup$Nested1$1.run(Test019ThreadLeakGroup.java:37)
20-Nov-2018 10:01:01 Finished: testLeakOutsideOfGroup
20-Nov-2018 10:01:01 Run finished: run=1, ignored=0, failures=1, assumptions=0
20-Nov-2018 10:01:01
20-Nov-2018 10:01:01 Run started.
20-Nov-2018 10:01:01 Started : testLeakOutsideOfGroup
20-Nov-2018 10:01:01 Finished: testLeakOutsideOfGroup
20-Nov-2018 10:01:01 Run finished: run=1, ignored=0, failures=0, assumptions=0
20-Nov-2018 10:01:01
20-Nov-2018 10:01:01 Run started.
20-Nov-2018 10:01:01 Started : testLeakOutsideOfGroup
20-Nov-2018 10:01:01 Finished: testLeakOutsideOfGroup
20-Nov-2018 10:01:01 Run finished: run=1, ignored=0, failures=0, assumptions=0
20-Nov-2018 10:01:01
20-Nov-2018 10:01:01 Tests run: 3, Failures: 0, Errors: 0, Skipped: 0, Time elapsed: 0.009 sec - in com.carrotsearch.randomizedtesting.timeouts.Test019ThreadLeakGroup
20-Nov-2018 10:01:01 Running com.carrotsearch.randomizedtesting.timeouts.Test001TimeoutSuite
20-Nov-2018 10:01:01 Run started.
20-Nov-2018 10:01:02 Failure : com.carrotsearch.randomizedtesting.timeouts.Test001TimeoutSuite$Nested: Suite timeout exceeded (>= 500 msec).
20-Nov-2018 10:01:02 Run finished: run=0, ignored=0, failures=1, assumptions=0
20-Nov-2018 10:01:02
20-Nov-2018 10:01:02 Run started.
20-Nov-2018 10:01:02 Started : testMethod
20-Nov-2018 10:01:03 Failure : testMethod(com.carrotsearch.randomizedtesting.timeouts.Test001TimeoutSuite$Nested): Test abandoned because suite timeout was reached.
20-Nov-2018 10:01:03 Finished: testMethod
20-Nov-2018 10:01:03 Failure : com.carrotsearch.randomizedtesting.timeouts.Test001TimeoutSuite$Nested: Suite timeout exceeded (>= 500 msec).
20-Nov-2018 10:01:03 Run finished: run=1, ignored=0, failures=2, assumptions=0
20-Nov-2018 10:01:03
20-Nov-2018 10:01:03 Run started.
20-Nov-2018 10:01:03 Started : testMethod
20-Nov-2018 10:01:03 Failure : testMethod(com.carrotsearch.randomizedtesting.timeouts.Test001TimeoutSuite$Nested): Test abandoned because suite timeout was reached.
20-Nov-2018 10:01:03 Finished: testMethod
20-Nov-2018 10:01:03 Failure : com.carrotsearch.randomizedtesting.timeouts.Test001TimeoutSuite$Nested: Suite timeout exceeded (>= 500 msec).
20-Nov-2018 10:01:03 Run finished: run=1, ignored=0, failures=2, assumptions=0
20-Nov-2018 10:01:03
20-Nov-2018 10:01:03 Run started.
20-Nov-2018 10:01:03 Started : testMethod
20-Nov-2018 10:01:04 Failure : testMethod(com.carrotsearch.randomizedtesting.timeouts.Test001TimeoutSuite$Nested): Test abandoned because suite timeout was reached.
20-Nov-2018 10:01:04 Finished: testMethod
20-Nov-2018 10:01:04 Failure : com.carrotsearch.randomizedtesting.timeouts.Test001TimeoutSuite$Nested: Suite timeout exceeded (>= 500 msec).
20-Nov-2018 10:01:04 Run finished: run=1, ignored=0, failures=2, assumptions=0
20-Nov-2018 10:01:04
20-Nov-2018 10:01:04 Run started.
20-Nov-2018 10:01:04 Failure : com.carrotsearch.randomizedtesting.timeouts.Test001TimeoutSuite$Nested: Suite timeout exceeded (>= 500 msec).
20-Nov-2018 10:01:04 Run finished: run=0, ignored=0, failures=1, assumptions=0
20-Nov-2018 10:01:04
20-Nov-2018 10:01:04 Run started.
20-Nov-2018 10:01:04 Started : testMethod
20-Nov-2018 10:01:04 Finished: testMethod
20-Nov-2018 10:01:05 Failure : com.carrotsearch.randomizedtesting.timeouts.Test001TimeoutSuite$Nested: Suite timeout exceeded (>= 500 msec).
20-Nov-2018 10:01:05 Run finished: run=1, ignored=0, failures=1, assumptions=0
20-Nov-2018 10:01:05
20-Nov-2018 10:01:05 Run started.
20-Nov-2018 10:01:05 Started : testMethod
20-Nov-2018 10:01:05 Failure : testMethod(com.carrotsearch.randomizedtesting.timeouts.Test001TimeoutSuite$Nested): Test abandoned because suite timeout was reached.
20-Nov-2018 10:01:05 Finished: testMethod
20-Nov-2018 10:01:05 Failure : com.carrotsearch.randomizedtesting.timeouts.Test001TimeoutSuite$Nested: Suite timeout exceeded (>= 500 msec).
20-Nov-2018 10:01:05 Run finished: run=1, ignored=0, failures=2, assumptions=0
20-Nov-2018 10:01:05
20-Nov-2018 10:01:05 Run started.
20-Nov-2018 10:01:05 Started : testMethod
20-Nov-2018 10:01:06 Failure : testMethod(com.carrotsearch.randomizedtesting.timeouts.Test001TimeoutSuite$Nested): Test abandoned because suite timeout was reached.
20-Nov-2018 10:01:06 Finished: testMethod
20-Nov-2018 10:01:06 Failure : com.carrotsearch.randomizedtesting.timeouts.Test001TimeoutSuite$Nested: Suite timeout exceeded (>= 500 msec).
20-Nov-2018 10:01:06 Run finished: run=1, ignored=0, failures=2, assumptions=0
20-Nov-2018 10:01:06
20-Nov-2018 10:01:06 Tests run: 8, Failures: 0, Errors: 0, Skipped: 0, Time elapsed: 4.651 sec - in com.carrotsearch.randomizedtesting.timeouts.Test001TimeoutSuite
20-Nov-2018 10:01:06 Running com.carrotsearch.randomizedtesting.timeouts.Test007UncaughtExceptions
20-Nov-2018 10:01:06 Run started.
20-Nov-2018 10:01:06 Started : checkGlobal
20-Nov-2018 10:01:06 Failure : checkGlobal(com.carrotsearch.randomizedtesting.timeouts.Test007UncaughtExceptions$Nested): Captured an uncaught exception in thread: Thread[id=5837, name=XYZ, state=RUNNABLE, group=system]
20-Nov-2018 10:01:06 Finished: checkGlobal
20-Nov-2018 10:01:06 Run finished: run=1, ignored=0, failures=1, assumptions=0
20-Nov-2018 10:01:06
20-Nov-2018 10:01:06 Run started.
20-Nov-2018 10:01:06 Started : checkGlobal
20-Nov-2018 10:01:06 Failure : checkGlobal(com.carrotsearch.randomizedtesting.timeouts.Test007UncaughtExceptions$Nested): Captured an uncaught exception in thread: Thread[id=5840, name=XYZ, state=RUNNABLE, group=TGRP-Test007UncaughtExceptions$Nested]
20-Nov-2018 10:01:06 Finished: checkGlobal
20-Nov-2018 10:01:06 Run finished: run=1, ignored=0, failures=1, assumptions=0
20-Nov-2018 10:01:06
20-Nov-2018 10:01:06 Tests run: 2, Failures: 0, Errors: 0, Skipped: 0, Time elapsed: 0.012 sec - in com.carrotsearch.randomizedtesting.timeouts.Test007UncaughtExceptions
20-Nov-2018 10:01:06 Running com.carrotsearch.randomizedtesting.timeouts.Test003ThreadLeaksMethod
20-Nov-2018 10:01:06 Run started.
20-Nov-2018 10:01:06 Started : testMethod
20-Nov-2018 10:01:06 Finished: testMethod
20-Nov-2018 10:01:06 Failure : com.carrotsearch.randomizedtesting.timeouts.Test003ThreadLeaksMethod$Nested: 1 thread leaked from SUITE scope at com.carrotsearch.randomizedtesting.timeouts.Test003ThreadLeaksMethod$Nested:
20-Nov-2018 10:01:06    1) Thread[id=5843, name=foobar, state=TIMED_WAITING, group=TGRP-Test003ThreadLeaksMethod$Nested]
20-Nov-2018 10:01:06         at java.base@10/java.lang.Thread.sleep(Native Method)
20-Nov-2018 10:01:06         at app//com.carrotsearch.randomizedtesting.RandomizedTest.sleep(RandomizedTest.java:681)
20-Nov-2018 10:01:06         at app//com.carrotsearch.randomizedtesting.WithNestedTestClass$4.sleepForever(WithNestedTestClass.java:278)
20-Nov-2018 10:01:06         at app//com.carrotsearch.randomizedtesting.WithNestedTestClass$4.run(WithNestedTestClass.java:274)
20-Nov-2018 10:01:06 Run finished: run=1, ignored=0, failures=1, assumptions=0
20-Nov-2018 10:01:06
20-Nov-2018 10:01:06 Run started.
20-Nov-2018 10:01:06 Started : testMethod
20-Nov-2018 10:01:06 Failure : testMethod(com.carrotsearch.randomizedtesting.timeouts.Test003ThreadLeaksMethod$Nested): 1 thread leaked from TEST scope at testMethod(com.carrotsearch.randomizedtesting.timeouts.Test003ThreadLeaksMethod$Nested):
20-Nov-2018 10:01:06    1) Thread[id=5846, name=foobar, state=TIMED_WAITING, group=TGRP-Test003ThreadLeaksMethod$Nested]
20-Nov-2018 10:01:06         at java.base@10/java.lang.Thread.sleep(Native Method)
20-Nov-2018 10:01:06         at app//com.carrotsearch.randomizedtesting.RandomizedTest.sleep(RandomizedTest.java:681)
20-Nov-2018 10:01:06         at app//com.carrotsearch.randomizedtesting.WithNestedTestClass$4.sleepForever(WithNestedTestClass.java:278)
20-Nov-2018 10:01:06         at app//com.carrotsearch.randomizedtesting.WithNestedTestClass$4.run(WithNestedTestClass.java:274)
20-Nov-2018 10:01:06 Finished: testMethod
20-Nov-2018 10:01:06 Run finished: run=1, ignored=0, failures=1, assumptions=0
20-Nov-2018 10:01:06
20-Nov-2018 10:01:06 Run started.
20-Nov-2018 10:01:06 Started : testMethod
20-Nov-2018 10:01:06 Failure : testMethod(com.carrotsearch.randomizedtesting.timeouts.Test003ThreadLeaksMethod$Nested): 1 thread leaked from TEST scope at testMethod(com.carrotsearch.randomizedtesting.timeouts.Test003ThreadLeaksMethod$Nested):
20-Nov-2018 10:01:06    1) Thread[id=5849, name=foobar, state=TIMED_WAITING, group=TGRP-Test003ThreadLeaksMethod$Nested]
20-Nov-2018 10:01:06         at java.base@10/java.lang.Thread.sleep(Native Method)
20-Nov-2018 10:01:06         at app//com.carrotsearch.randomizedtesting.RandomizedTest.sleep(RandomizedTest.java:681)
20-Nov-2018 10:01:06         at app//com.carrotsearch.randomizedtesting.WithNestedTestClass$4.sleepForever(WithNestedTestClass.java:278)
20-Nov-2018 10:01:06         at app//com.carrotsearch.randomizedtesting.WithNestedTestClass$4.run(WithNestedTestClass.java:274)
20-Nov-2018 10:01:06 Finished: testMethod
20-Nov-2018 10:01:06 Run finished: run=1, ignored=0, failures=1, assumptions=0
20-Nov-2018 10:01:06
20-Nov-2018 10:01:06 Run started.
20-Nov-2018 10:01:06 Started : testMethod
20-Nov-2018 10:01:06 Failure : testMethod(com.carrotsearch.randomizedtesting.timeouts.Test003ThreadLeaksMethod$Nested): 1 thread leaked from TEST scope at testMethod(com.carrotsearch.randomizedtesting.timeouts.Test003ThreadLeaksMethod$Nested):
20-Nov-2018 10:01:06    1) Thread[id=5852, name=foobar, state=TIMED_WAITING, group=TGRP-Test003ThreadLeaksMethod$Nested]
20-Nov-2018 10:01:06         at java.base@10/java.lang.Thread.sleep(Native Method)
20-Nov-2018 10:01:06         at app//com.carrotsearch.randomizedtesting.RandomizedTest.sleep(RandomizedTest.java:681)
20-Nov-2018 10:01:06         at app//com.carrotsearch.randomizedtesting.WithNestedTestClass$4.sleepForever(WithNestedTestClass.java:278)
20-Nov-2018 10:01:06         at app//com.carrotsearch.randomizedtesting.WithNestedTestClass$4.run(WithNestedTestClass.java:274)
20-Nov-2018 10:01:06 Finished: testMethod
20-Nov-2018 10:01:06 Run finished: run=1, ignored=0, failures=1, assumptions=0
20-Nov-2018 10:01:06
20-Nov-2018 10:01:06 Run started.
20-Nov-2018 10:01:06 Started : testMethod
20-Nov-2018 10:01:06 Finished: testMethod
20-Nov-2018 10:01:06 Failure : com.carrotsearch.randomizedtesting.timeouts.Test003ThreadLeaksMethod$Nested: 1 thread leaked from SUITE scope at com.carrotsearch.randomizedtesting.timeouts.Test003ThreadLeaksMethod$Nested:
20-Nov-2018 10:01:06    1) Thread[id=5855, name=foobar, state=TIMED_WAITING, group=TGRP-Test003ThreadLeaksMethod$Nested]
20-Nov-2018 10:01:06         at java.base@10/java.lang.Thread.sleep(Native Method)
20-Nov-2018 10:01:06         at app//com.carrotsearch.randomizedtesting.RandomizedTest.sleep(RandomizedTest.java:681)
20-Nov-2018 10:01:06         at app//com.carrotsearch.randomizedtesting.WithNestedTestClass$4.sleepForever(WithNestedTestClass.java:278)
20-Nov-2018 10:01:06         at app//com.carrotsearch.randomizedtesting.WithNestedTestClass$4.run(WithNestedTestClass.java:274)
20-Nov-2018 10:01:06 Run finished: run=1, ignored=0, failures=1, assumptions=0
20-Nov-2018 10:01:06
20-Nov-2018 10:01:06 Run started.
20-Nov-2018 10:01:06 Started : testMethod
20-Nov-2018 10:01:06 Finished: testMethod
20-Nov-2018 10:01:06 Failure : com.carrotsearch.randomizedtesting.timeouts.Test003ThreadLeaksMethod$Nested: 1 thread leaked from SUITE scope at com.carrotsearch.randomizedtesting.timeouts.Test003ThreadLeaksMethod$Nested:
20-Nov-2018 10:01:06    1) Thread[id=5858, name=foobar, state=TIMED_WAITING, group=TGRP-Test003ThreadLeaksMethod$Nested]
20-Nov-2018 10:01:06         at java.base@10/java.lang.Thread.sleep(Native Method)
20-Nov-2018 10:01:06         at app//com.carrotsearch.randomizedtesting.RandomizedTest.sleep(RandomizedTest.java:681)
20-Nov-2018 10:01:06         at app//com.carrotsearch.randomizedtesting.WithNestedTestClass$4.sleepForever(WithNestedTestClass.java:278)
20-Nov-2018 10:01:06         at app//com.carrotsearch.randomizedtesting.WithNestedTestClass$4.run(WithNestedTestClass.java:274)
20-Nov-2018 10:01:06 Run finished: run=1, ignored=0, failures=1, assumptions=0
20-Nov-2018 10:01:06
20-Nov-2018 10:01:06 Run started.
20-Nov-2018 10:01:06 Started : testMethod
20-Nov-2018 10:01:06 Failure : testMethod(com.carrotsearch.randomizedtesting.timeouts.Test003ThreadLeaksMethod$Nested): 1 thread leaked from TEST scope at testMethod(com.carrotsearch.randomizedtesting.timeouts.Test003ThreadLeaksMethod$Nested):
20-Nov-2018 10:01:06    1) Thread[id=5861, name=foobar, state=TIMED_WAITING, group=TGRP-Test003ThreadLeaksMethod$Nested]
20-Nov-2018 10:01:06         at java.base@10/java.lang.Thread.sleep(Native Method)
20-Nov-2018 10:01:06         at app//com.carrotsearch.randomizedtesting.RandomizedTest.sleep(RandomizedTest.java:681)
20-Nov-2018 10:01:06         at app//com.carrotsearch.randomizedtesting.WithNestedTestClass$4.sleepForever(WithNestedTestClass.java:278)
20-Nov-2018 10:01:06         at app//com.carrotsearch.randomizedtesting.WithNestedTestClass$4.run(WithNestedTestClass.java:274)
20-Nov-2018 10:01:06 Finished: testMethod
20-Nov-2018 10:01:06 Run finished: run=1, ignored=0, failures=1, assumptions=0
20-Nov-2018 10:01:06
20-Nov-2018 10:01:06 Run started.
20-Nov-2018 10:01:06 Started : testMethod
20-Nov-2018 10:01:06 Finished: testMethod
20-Nov-2018 10:01:06 Failure : com.carrotsearch.randomizedtesting.timeouts.Test003ThreadLeaksMethod$Nested: 1 thread leaked from SUITE scope at com.carrotsearch.randomizedtesting.timeouts.Test003ThreadLeaksMethod$Nested:
20-Nov-2018 10:01:06    1) Thread[id=5864, name=foobar, state=TIMED_WAITING, group=TGRP-Test003ThreadLeaksMethod$Nested]
20-Nov-2018 10:01:06         at java.base@10/java.lang.Thread.sleep(Native Method)
20-Nov-2018 10:01:06         at app//com.carrotsearch.randomizedtesting.RandomizedTest.sleep(RandomizedTest.java:681)
20-Nov-2018 10:01:06         at app//com.carrotsearch.randomizedtesting.WithNestedTestClass$4.sleepForever(WithNestedTestClass.java:278)
20-Nov-2018 10:01:06         at app//com.carrotsearch.randomizedtesting.WithNestedTestClass$4.run(WithNestedTestClass.java:274)
20-Nov-2018 10:01:06 Run finished: run=1, ignored=0, failures=1, assumptions=0
20-Nov-2018 10:01:06
20-Nov-2018 10:01:06 Tests run: 8, Failures: 0, Errors: 0, Skipped: 0, Time elapsed: 0.056 sec - in com.carrotsearch.randomizedtesting.timeouts.Test003ThreadLeaksMethod
20-Nov-2018 10:01:06 Running com.carrotsearch.randomizedtesting.TestRandomizedContext
20-Nov-2018 10:01:06 Tests run: 1, Failures: 0, Errors: 0, Skipped: 0, Time elapsed: 0.006 sec - in com.carrotsearch.randomizedtesting.TestRandomizedContext
20-Nov-2018 10:01:06 Running com.carrotsearch.randomizedtesting.TestExpected
20-Nov-2018 10:01:06 Run started.
20-Nov-2018 10:01:06 Started : testMethod1
20-Nov-2018 10:01:06 Failure : testMethod1(com.carrotsearch.randomizedtesting.TestExpected$Nested2): Expected an exception but the test passed: java.lang.RuntimeException
20-Nov-2018 10:01:06 Finished: testMethod1
20-Nov-2018 10:01:06 Run finished: run=1, ignored=0, failures=1, assumptions=0
20-Nov-2018 10:01:06
20-Nov-2018 10:01:06 Run started.
20-Nov-2018 10:01:06 Started : testMethod1
20-Nov-2018 10:01:06 Finished: testMethod1
20-Nov-2018 10:01:06 Started : testMethod2
20-Nov-2018 10:01:06 Failure : testMethod2(com.carrotsearch.randomizedtesting.TestExpected$Nested1): null
20-Nov-2018 10:01:06 Finished: testMethod2
20-Nov-2018 10:01:06 Run finished: run=2, ignored=0, failures=1, assumptions=0
20-Nov-2018 10:01:06
20-Nov-2018 10:01:06 Tests run: 2, Failures: 0, Errors: 0, Skipped: 0, Time elapsed: 0.015 sec - in com.carrotsearch.randomizedtesting.TestExpected
20-Nov-2018 10:01:06 Running com.carrotsearch.randomizedtesting.TestValidation
20-Nov-2018 10:01:06 Tests run: 1, Failures: 0, Errors: 0, Skipped: 0, Time elapsed: 0.001 sec - in com.carrotsearch.randomizedtesting.TestValidation
20-Nov-2018 10:01:06 Running com.carrotsearch.randomizedtesting.TestBiasedNumbers
20-Nov-2018 10:01:06       6061        519        524        521        550       8092        575        535        566        525       5909
20-Nov-2018 10:01:06        522         46         48         44         51        703         37         38         46         51        495
20-Nov-2018 10:01:06        533         46         42         52         48        749         51         55         42         45        574
20-Nov-2018 10:01:06        543         42         39         42         42        693         49         51         44         56        542
20-Nov-2018 10:01:06        596         50         42         42         57        762         45         43         58         50        563
20-Nov-2018 10:01:06       8256        759        757        738        768      11178        792        717        677        718       8137
20-Nov-2018 10:01:06        556         43         38         46         45        736         50         54         52         50        567
20-Nov-2018 10:01:06        502         61         56         47         48        689         49         49         45         44        537
20-Nov-2018 10:01:06        546         48         53         43         56        738         39         54         46         55        525
20-Nov-2018 10:01:06        523         39         44         38         53        721         50         58         54         53        578
20-Nov-2018 10:01:06       6016        522        559        536        572       8167        512        488        549        556       6102
20-Nov-2018 10:01:06 Tests run: 201, Failures: 0, Errors: 0, Skipped: 0, Time elapsed: 0.284 sec - in com.carrotsearch.randomizedtesting.TestBiasedNumbers
20-Nov-2018 10:01:06 Running com.carrotsearch.randomizedtesting.TestSetSeedLocked
20-Nov-2018 10:01:06 Tests run: 1, Failures: 0, Errors: 0, Skipped: 0, Time elapsed: 0 sec - in com.carrotsearch.randomizedtesting.TestSetSeedLocked
20-Nov-2018 10:01:06 Running com.carrotsearch.randomizedtesting.TestTestCaseOrdering
20-Nov-2018 10:01:06 Run started.
20-Nov-2018 10:01:06 Started : a {seed=[15929603CFF7D355:7DCD49532AE87A22]}
20-Nov-2018 10:01:06 Finished: a {seed=[15929603CFF7D355:7DCD49532AE87A22]}
20-Nov-2018 10:01:06 Started : a {seed=[15929603CFF7D355:C99BF5AF1E2AB10E]}
20-Nov-2018 10:01:06 Finished: a {seed=[15929603CFF7D355:C99BF5AF1E2AB10E]}
20-Nov-2018 10:01:06 Started : a {seed=[15929603CFF7D355:477263734FEEF9C5]}
20-Nov-2018 10:01:06 Finished: a {seed=[15929603CFF7D355:477263734FEEF9C5]}
20-Nov-2018 10:01:06 Started : b {seed=[15929603CFF7D355:B9F07B3FBABE6521]}
20-Nov-2018 10:01:06 Finished: b {seed=[15929603CFF7D355:B9F07B3FBABE6521]}
20-Nov-2018 10:01:06 Started : b {seed=[15929603CFF7D355:DA6C7C38E7CAE0D]}
20-Nov-2018 10:01:06 Finished: b {seed=[15929603CFF7D355:DA6C7C38E7CAE0D]}
20-Nov-2018 10:01:06 Started : b {seed=[15929603CFF7D355:834F511FDFB8E6C6]}
20-Nov-2018 10:01:06 Finished: b {seed=[15929603CFF7D355:834F511FDFB8E6C6]}
20-Nov-2018 10:01:06 Started : c {seed=[15929603CFF7D355:73643E46BDFAB832]}
20-Nov-2018 10:01:06 Finished: c {seed=[15929603CFF7D355:73643E46BDFAB832]}
20-Nov-2018 10:01:06 Started : c {seed=[15929603CFF7D355:C73282BA8938731E]}
20-Nov-2018 10:01:06 Finished: c {seed=[15929603CFF7D355:C73282BA8938731E]}
20-Nov-2018 10:01:06 Started : c {seed=[15929603CFF7D355:49DB1466D8FC3BD5]}
20-Nov-2018 10:01:06 Finished: c {seed=[15929603CFF7D355:49DB1466D8FC3BD5]}
20-Nov-2018 10:01:06 Started : d {seed=[15929603CFF7D355:F32CBA976ABDFF37]}
20-Nov-2018 10:01:06 Finished: d {seed=[15929603CFF7D355:F32CBA976ABDFF37]}
20-Nov-2018 10:01:06 Started : d {seed=[15929603CFF7D355:477A066B5E7F341B]}
20-Nov-2018 10:01:06 Finished: d {seed=[15929603CFF7D355:477A066B5E7F341B]}
20-Nov-2018 10:01:06 Started : d {seed=[15929603CFF7D355:C99390B70FBB7CD0]}
20-Nov-2018 10:01:06 Finished: d {seed=[15929603CFF7D355:C99390B70FBB7CD0]}
20-Nov-2018 10:01:06 Run finished: run=12, ignored=0, failures=0, assumptions=0
20-Nov-2018 10:01:06
20-Nov-2018 10:01:06 Run started.
20-Nov-2018 10:01:06 Started : a {p0=1}
20-Nov-2018 10:01:06 Finished: a {p0=1}
20-Nov-2018 10:01:06 Started : a {p0=2}
20-Nov-2018 10:01:06 Finished: a {p0=2}
20-Nov-2018 10:01:06 Started : a {p0=3}
20-Nov-2018 10:01:06 Finished: a {p0=3}
20-Nov-2018 10:01:06 Started : b {p0=1}
20-Nov-2018 10:01:06 Finished: b {p0=1}
20-Nov-2018 10:01:06 Started : b {p0=2}
20-Nov-2018 10:01:06 Finished: b {p0=2}
20-Nov-2018 10:01:06 Started : b {p0=3}
20-Nov-2018 10:01:06 Finished: b {p0=3}
20-Nov-2018 10:01:06 Started : c {p0=1}
20-Nov-2018 10:01:06 Finished: c {p0=1}
20-Nov-2018 10:01:06 Started : c {p0=2}
20-Nov-2018 10:01:06 Finished: c {p0=2}
20-Nov-2018 10:01:06 Started : c {p0=3}
20-Nov-2018 10:01:06 Finished: c {p0=3}
20-Nov-2018 10:01:06 Started : d {p0=1}
20-Nov-2018 10:01:06 Finished: d {p0=1}
20-Nov-2018 10:01:06 Started : d {p0=2}
20-Nov-2018 10:01:06 Finished: d {p0=2}
20-Nov-2018 10:01:06 Started : d {p0=3}
20-Nov-2018 10:01:06 Finished: d {p0=3}
20-Nov-2018 10:01:06 Run finished: run=12, ignored=0, failures=0, assumptions=0
20-Nov-2018 10:01:06
20-Nov-2018 10:01:06 Run started.
20-Nov-2018 10:01:06 Started : a
20-Nov-2018 10:01:06 Finished: a
20-Nov-2018 10:01:06 Started : b
20-Nov-2018 10:01:06 Finished: b
20-Nov-2018 10:01:06 Started : c
20-Nov-2018 10:01:06 Finished: c
20-Nov-2018 10:01:06 Started : d
20-Nov-2018 10:01:06 Finished: d
20-Nov-2018 10:01:06 Run finished: run=4, ignored=0, failures=0, assumptions=0
20-Nov-2018 10:01:06
20-Nov-2018 10:01:06 Tests run: 3, Failures: 0, Errors: 0, Skipped: 0, Time elapsed: 0.034 sec - in com.carrotsearch.randomizedtesting.TestTestCaseOrdering
20-Nov-2018 10:01:06 Running com.carrotsearch.randomizedtesting.TestTargetMethod
20-Nov-2018 10:01:06 Run started.
20-Nov-2018 10:01:06 Started : testTwo
20-Nov-2018 10:01:06 Finished: testTwo
20-Nov-2018 10:01:06 Started : testOne {seed=[4E819B260139CAAD:9A83B3E5D840183D]}
20-Nov-2018 10:01:06 Finished: testOne {seed=[4E819B260139CAAD:9A83B3E5D840183D]}
20-Nov-2018 10:01:06 Started : testOne {seed=[4E819B260139CAAD:2ED50F19EC82D311]}
20-Nov-2018 10:01:06 Finished: testOne {seed=[4E819B260139CAAD:2ED50F19EC82D311]}
20-Nov-2018 10:01:06 Started : testOne {seed=[4E819B260139CAAD:A03C99C5BD469BDA]}
20-Nov-2018 10:01:06 Finished: testOne {seed=[4E819B260139CAAD:A03C99C5BD469BDA]}
20-Nov-2018 10:01:06 Run finished: run=4, ignored=0, failures=0, assumptions=0
20-Nov-2018 10:01:06
20-Nov-2018 10:01:06 Tests run: 1, Failures: 0, Errors: 0, Skipped: 0, Time elapsed: 0.008 sec - in com.carrotsearch.randomizedtesting.TestTargetMethod
20-Nov-2018 10:01:06 Running com.carrotsearch.randomizedtesting.TestRules
20-Nov-2018 10:01:06 Run started.
20-Nov-2018 10:01:07 Started : passing
20-Nov-2018 10:01:07 Finished: passing
20-Nov-2018 10:01:07 Run finished: run=1, ignored=0, failures=0, assumptions=0
20-Nov-2018 10:01:07
20-Nov-2018 10:01:07 Run started.
20-Nov-2018 10:01:07 Started : passing
20-Nov-2018 10:01:07 Finished: passing
20-Nov-2018 10:01:07 Run finished: run=1, ignored=0, failures=0, assumptions=0
20-Nov-2018 10:01:07
20-Nov-2018 10:01:07 Run started.
20-Nov-2018 10:01:07 Started : failing
20-Nov-2018 10:01:07 Failure : failing(com.carrotsearch.randomizedtesting.TestRules$NewRuleSupportFailing): null
20-Nov-2018 10:01:07 Finished: failing
20-Nov-2018 10:01:07 Run finished: run=1, ignored=0, failures=1, assumptions=0
20-Nov-2018 10:01:07
20-Nov-2018 10:01:07 Run started.
20-Nov-2018 10:01:07 Ignored : ignored
20-Nov-2018 10:01:07 Run finished: run=0, ignored=1, failures=0, assumptions=0
20-Nov-2018 10:01:07
20-Nov-2018 10:01:07 Tests run: 2, Failures: 0, Errors: 0, Skipped: 0, Time elapsed: 0.008 sec - in com.carrotsearch.randomizedtesting.TestRules
20-Nov-2018 10:01:07 Running com.carrotsearch.randomizedtesting.TestUncaughtExceptionsDuplicated
20-Nov-2018 10:01:07 Run started.
20-Nov-2018 10:01:07 Started : test1
20-Nov-2018 10:01:07 Failure : test1(com.carrotsearch.randomizedtesting.TestUncaughtExceptionsDuplicated$Nested3): Captured an uncaught exception in thread: Thread[id=5890, name=Thread-5291, state=RUNNABLE, group=TGRP-TestUncaughtExceptionsDuplicated$Nested3]
20-Nov-2018 10:01:07 Finished: test1
20-Nov-2018 10:01:07 Run finished: run=1, ignored=0, failures=1, assumptions=0
20-Nov-2018 10:01:07
20-Nov-2018 10:01:07 Run started.
20-Nov-2018 10:01:07 Started : test1
20-Nov-2018 10:01:07 Failure : test1(com.carrotsearch.randomizedtesting.TestUncaughtExceptionsDuplicated$Nested2): Captured an uncaught exception in thread: Thread[id=5893, name=Thread-5293, state=RUNNABLE, group=TGRP-TestUncaughtExceptionsDuplicated$Nested2]
20-Nov-2018 10:01:07 Finished: test1
20-Nov-2018 10:01:07 Started : test2
20-Nov-2018 10:01:07 Failure : test2(com.carrotsearch.randomizedtesting.TestUncaughtExceptionsDuplicated$Nested2): Captured an uncaught exception in thread: Thread[id=5894, name=Thread-5294, state=RUNNABLE, group=TGRP-TestUncaughtExceptionsDuplicated$Nested2]
20-Nov-2018 10:01:07 Finished: test2
20-Nov-2018 10:01:07 Started : test3
20-Nov-2018 10:01:07 Failure : test3(com.carrotsearch.randomizedtesting.TestUncaughtExceptionsDuplicated$Nested2): Captured an uncaught exception in thread: Thread[id=5895, name=Thread-5295, state=RUNNABLE, group=TGRP-TestUncaughtExceptionsDuplicated$Nested2]
20-Nov-2018 10:01:07 Finished: test3
20-Nov-2018 10:01:07 Run finished: run=3, ignored=0, failures=3, assumptions=0
20-Nov-2018 10:01:07
20-Nov-2018 10:01:07 Run started.
20-Nov-2018 10:01:07 Started : test
20-Nov-2018 10:01:07 Failure : test(com.carrotsearch.randomizedtesting.TestUncaughtExceptionsDuplicated$Nested1): Captured an uncaught exception in thread: Thread[id=5898, name=Thread-5297, state=RUNNABLE, group=TGRP-TestUncaughtExceptionsDuplicated$Nested1]
20-Nov-2018 10:01:07 Finished: test
20-Nov-2018 10:01:07 Run finished: run=1, ignored=0, failures=1, assumptions=0
20-Nov-2018 10:01:07
20-Nov-2018 10:01:07 Tests run: 3, Failures: 0, Errors: 0, Skipped: 0, Time elapsed: 0.017 sec - in com.carrotsearch.randomizedtesting.TestUncaughtExceptionsDuplicated
20-Nov-2018 10:01:07 Running com.carrotsearch.randomizedtesting.TestResourceDisposal
20-Nov-2018 10:01:07 Run started.
20-Nov-2018 10:01:07 Started : testScope
20-Nov-2018 10:01:07 Failure : testScope(com.carrotsearch.randomizedtesting.TestResourceDisposal$Nested2): Resource in scope TEST failed to close. Resource was registered from thread Thread[id=5900, name=TEST-TestResourceDisposal$Nested2.testScope-seed#[9C4CD37DED0155C3], state=RUNNABLE, group=TGRP-TestResourceDisposal$Nested2], registration stack trace below.
20-Nov-2018 10:01:07 Finished: testScope
20-Nov-2018 10:01:07 Run finished: run=1, ignored=0, failures=1, assumptions=0
20-Nov-2018 10:01:07
20-Nov-2018 10:01:07 Run started.
20-Nov-2018 10:01:07 Started : suiteScopeFromTest
20-Nov-2018 10:01:07 Finished: suiteScopeFromTest
20-Nov-2018 10:01:07 Started : testScopeResourceWithFailures
20-Nov-2018 10:01:07 Failure : testScopeResourceWithFailures(com.carrotsearch.randomizedtesting.TestResourceDisposal$Nested): null
20-Nov-2018 10:01:07 Finished: testScopeResourceWithFailures
20-Nov-2018 10:01:07 Started : testScopeResource
20-Nov-2018 10:01:07 Finished: testScopeResource
20-Nov-2018 10:01:07 Run finished: run=3, ignored=0, failures=1, assumptions=0
20-Nov-2018 10:01:07
20-Nov-2018 10:01:07 Run started.
20-Nov-2018 10:01:07 Started : suiteScopeFromTest
20-Nov-2018 10:01:07 Finished: suiteScopeFromTest
20-Nov-2018 10:01:07 Started : testScopeResourceWithFailures
20-Nov-2018 10:01:07 Failure : testScopeResourceWithFailures(com.carrotsearch.randomizedtesting.TestResourceDisposal$Nested): null
20-Nov-2018 10:01:07 Finished: testScopeResourceWithFailures
20-Nov-2018 10:01:07 Started : testScopeResource
20-Nov-2018 10:01:07 Finished: testScopeResource
20-Nov-2018 10:01:07 Run finished: run=3, ignored=0, failures=1, assumptions=0
20-Nov-2018 10:01:07
20-Nov-2018 10:01:07 Tests run: 3, Failures: 0, Errors: 0, Skipped: 0, Time elapsed: 0.018 sec - in com.carrotsearch.randomizedtesting.TestResourceDisposal
20-Nov-2018 10:01:07 Running com.carrotsearch.randomizedtesting.TestHookMethodOrderWithExceptions
20-Nov-2018 10:01:07 Run started.
20-Nov-2018 10:01:07 Started : testMethod
20-Nov-2018 10:01:07 Failure : testMethod(com.carrotsearch.randomizedtesting.TestHookMethodOrderWithExceptions$WithRegularRunner): null
20-Nov-2018 10:01:07 Failure : testMethod(com.carrotsearch.randomizedtesting.TestHookMethodOrderWithExceptions$WithRegularRunner): null
20-Nov-2018 10:01:07 Finished: testMethod
20-Nov-2018 10:01:07 Failure : com.carrotsearch.randomizedtesting.TestHookMethodOrderWithExceptions$WithRegularRunner: null
20-Nov-2018 10:01:07 Run finished: run=1, ignored=0, failures=3, assumptions=0
20-Nov-2018 10:01:07
20-Nov-2018 10:01:07 Run started.
20-Nov-2018 10:01:07 Started : testMethod
20-Nov-2018 10:01:07 Failure : testMethod(com.carrotsearch.randomizedtesting.TestHookMethodOrderWithExceptions$WithRandomizedRunner): null
20-Nov-2018 10:01:07 Failure : testMethod(com.carrotsearch.randomizedtesting.TestHookMethodOrderWithExceptions$WithRandomizedRunner): null
20-Nov-2018 10:01:07 Finished: testMethod
20-Nov-2018 10:01:07 Failure : com.carrotsearch.randomizedtesting.TestHookMethodOrderWithExceptions$WithRandomizedRunner: null
20-Nov-2018 10:01:07 Run finished: run=1, ignored=0, failures=3, assumptions=0
20-Nov-2018 10:01:07
20-Nov-2018 10:01:07 Run started.
20-Nov-2018 10:01:07 Started : testMethod
20-Nov-2018 10:01:07 Finished: testMethod
20-Nov-2018 10:01:07 Run finished: run=1, ignored=0, failures=0, assumptions=0
20-Nov-2018 10:01:07
20-Nov-2018 10:01:07 Run started.
20-Nov-2018 10:01:07 Started : testMethod
20-Nov-2018 10:01:07 Finished: testMethod
20-Nov-2018 10:01:07 Run finished: run=1, ignored=0, failures=0, assumptions=0
20-Nov-2018 10:01:07
20-Nov-2018 10:01:07 Run started.
20-Nov-2018 10:01:07 Started : testMethod
20-Nov-2018 10:01:07 Failure : testMethod(com.carrotsearch.randomizedtesting.TestHookMethodOrderWithExceptions$WithRegularRunner): null
20-Nov-2018 10:01:07 Finished: testMethod
20-Nov-2018 10:01:07 Run finished: run=1, ignored=0, failures=1, assumptions=0
20-Nov-2018 10:01:07
20-Nov-2018 10:01:07 Run started.
20-Nov-2018 10:01:07 Started : testMethod
20-Nov-2018 10:01:07 Failure : testMethod(com.carrotsearch.randomizedtesting.TestHookMethodOrderWithExceptions$WithRandomizedRunner): null
20-Nov-2018 10:01:07 Finished: testMethod
20-Nov-2018 10:01:07 Run finished: run=1, ignored=0, failures=1, assumptions=0
20-Nov-2018 10:01:07
20-Nov-2018 10:01:07 Run started.
20-Nov-2018 10:01:07 Failure : com.carrotsearch.randomizedtesting.TestHookMethodOrderWithExceptions$WithRegularRunner: null
20-Nov-2018 10:01:07 Run finished: run=0, ignored=0, failures=1, assumptions=0
20-Nov-2018 10:01:07
20-Nov-2018 10:01:07 Run started.
20-Nov-2018 10:01:07 Failure : com.carrotsearch.randomizedtesting.TestHookMethodOrderWithExceptions$WithRandomizedRunner: null
20-Nov-2018 10:01:07 Run finished: run=0, ignored=0, failures=1, assumptions=0
20-Nov-2018 10:01:07
20-Nov-2018 10:01:07 Run started.
20-Nov-2018 10:01:07 Failure : com.carrotsearch.randomizedtesting.TestHookMethodOrderWithExceptions$WithRegularRunner: null
20-Nov-2018 10:01:07 Run finished: run=0, ignored=0, failures=1, assumptions=0
20-Nov-2018 10:01:07
20-Nov-2018 10:01:07 Run started.
20-Nov-2018 10:01:07 Failure : com.carrotsearch.randomizedtesting.TestHookMethodOrderWithExceptions$WithRandomizedRunner: null
20-Nov-2018 10:01:07 Run finished: run=0, ignored=0, failures=1, assumptions=0
20-Nov-2018 10:01:07
20-Nov-2018 10:01:07 Run started.
20-Nov-2018 10:01:07 Started : testMethod
20-Nov-2018 10:01:07 Failure : testMethod(com.carrotsearch.randomizedtesting.TestHookMethodOrderWithExceptions$WithRegularRunner): null
20-Nov-2018 10:01:07 Finished: testMethod
20-Nov-2018 10:01:07 Run finished: run=1, ignored=0, failures=1, assumptions=0
20-Nov-2018 10:01:07
20-Nov-2018 10:01:07 Run started.
20-Nov-2018 10:01:07 Started : testMethod
20-Nov-2018 10:01:07 Failure : testMethod(com.carrotsearch.randomizedtesting.TestHookMethodOrderWithExceptions$WithRandomizedRunner): null
20-Nov-2018 10:01:07 Finished: testMethod
20-Nov-2018 10:01:07 Run finished: run=1, ignored=0, failures=1, assumptions=0
20-Nov-2018 10:01:07
20-Nov-2018 10:01:07 Run started.
20-Nov-2018 10:01:07 Started : testMethod
20-Nov-2018 10:01:07 Finished: testMethod
20-Nov-2018 10:01:07 Run finished: run=1, ignored=0, failures=0, assumptions=0
20-Nov-2018 10:01:07
20-Nov-2018 10:01:07 Run started.
20-Nov-2018 10:01:07 Started : testMethod
20-Nov-2018 10:01:07 Finished: testMethod
20-Nov-2018 10:01:07 Run finished: run=1, ignored=0, failures=0, assumptions=0
20-Nov-2018 10:01:07
20-Nov-2018 10:01:07 Run started.
20-Nov-2018 10:01:07 Started : testMethod
20-Nov-2018 10:01:07 Finished: testMethod
20-Nov-2018 10:01:07 Failure : com.carrotsearch.randomizedtesting.TestHookMethodOrderWithExceptions$WithRegularRunner: null
20-Nov-2018 10:01:07 Run finished: run=1, ignored=0, failures=1, assumptions=0
20-Nov-2018 10:01:07
20-Nov-2018 10:01:07 Run started.
20-Nov-2018 10:01:07 Started : testMethod
20-Nov-2018 10:01:07 Finished: testMethod
20-Nov-2018 10:01:07 Failure : com.carrotsearch.randomizedtesting.TestHookMethodOrderWithExceptions$WithRandomizedRunner: null
20-Nov-2018 10:01:07 Run finished: run=1, ignored=0, failures=1, assumptions=0
20-Nov-2018 10:01:07
20-Nov-2018 10:01:07 Run started.
20-Nov-2018 10:01:07 Failure : com.carrotsearch.randomizedtesting.TestHookMethodOrderWithExceptions$WithRegularRunner: null
20-Nov-2018 10:01:07 Run finished: run=0, ignored=0, failures=1, assumptions=0
20-Nov-2018 10:01:07
20-Nov-2018 10:01:07 Run started.
20-Nov-2018 10:01:07 Failure : com.carrotsearch.randomizedtesting.TestHookMethodOrderWithExceptions$WithRandomizedRunner: null
20-Nov-2018 10:01:07 Run finished: run=0, ignored=0, failures=1, assumptions=0
20-Nov-2018 10:01:07
20-Nov-2018 10:01:07 Run started.
20-Nov-2018 10:01:07 Started : testMethod
20-Nov-2018 10:01:07 Finished: testMethod
20-Nov-2018 10:01:07 Run finished: run=1, ignored=0, failures=0, assumptions=0
20-Nov-2018 10:01:07
20-Nov-2018 10:01:07 Run started.
20-Nov-2018 10:01:07 Started : testMethod
20-Nov-2018 10:01:07 Finished: testMethod
20-Nov-2018 10:01:07 Run finished: run=1, ignored=0, failures=0, assumptions=0
20-Nov-2018 10:01:07
20-Nov-2018 10:01:07 Run started.
20-Nov-2018 10:01:07 Started : testMethod
20-Nov-2018 10:01:07 Finished: testMethod
20-Nov-2018 10:01:07 Run finished: run=1, ignored=0, failures=0, assumptions=0
20-Nov-2018 10:01:07
20-Nov-2018 10:01:07 Run started.
20-Nov-2018 10:01:07 Started : testMethod
20-Nov-2018 10:01:07 Finished: testMethod
20-Nov-2018 10:01:07 Run finished: run=1, ignored=0, failures=0, assumptions=0
20-Nov-2018 10:01:07
20-Nov-2018 10:01:07 Run started.
20-Nov-2018 10:01:07 Started : testMethod
20-Nov-2018 10:01:07 Failure : testMethod(com.carrotsearch.randomizedtesting.TestHookMethodOrderWithExceptions$WithRegularRunner): null
20-Nov-2018 10:01:07 Finished: testMethod
20-Nov-2018 10:01:07 Run finished: run=1, ignored=0, failures=1, assumptions=0
20-Nov-2018 10:01:07
20-Nov-2018 10:01:07 Run started.
20-Nov-2018 10:01:07 Started : testMethod
20-Nov-2018 10:01:07 Failure : testMethod(com.carrotsearch.randomizedtesting.TestHookMethodOrderWithExceptions$WithRandomizedRunner): null
20-Nov-2018 10:01:07 Finished: testMethod
20-Nov-2018 10:01:07 Run finished: run=1, ignored=0, failures=1, assumptions=0
20-Nov-2018 10:01:07
20-Nov-2018 10:01:07 Run started.
20-Nov-2018 10:01:07 Started : testMethod
20-Nov-2018 10:01:07 Finished: testMethod
20-Nov-2018 10:01:07 Run finished: run=1, ignored=0, failures=0, assumptions=0
20-Nov-2018 10:01:07
20-Nov-2018 10:01:07 Run started.
20-Nov-2018 10:01:07 Started : testMethod
20-Nov-2018 10:01:07 Finished: testMethod
20-Nov-2018 10:01:07 Run finished: run=1, ignored=0, failures=0, assumptions=0
20-Nov-2018 10:01:07
20-Nov-2018 10:01:07 Run started.
20-Nov-2018 10:01:07 Started : testMethod
20-Nov-2018 10:01:07 Finished: testMethod
20-Nov-2018 10:01:07 Run finished: run=1, ignored=0, failures=0, assumptions=0
20-Nov-2018 10:01:07
20-Nov-2018 10:01:07 Run started.
20-Nov-2018 10:01:07 Started : testMethod
20-Nov-2018 10:01:07 Finished: testMethod
20-Nov-2018 10:01:07 Run finished: run=1, ignored=0, failures=0, assumptions=0
20-Nov-2018 10:01:07
20-Nov-2018 10:01:07 Run started.
20-Nov-2018 10:01:07 Failure : com.carrotsearch.randomizedtesting.TestHookMethodOrderWithExceptions$WithRegularRunner: null
20-Nov-2018 10:01:07 Run finished: run=0, ignored=0, failures=1, assumptions=0
20-Nov-2018 10:01:07
20-Nov-2018 10:01:07 Run started.
20-Nov-2018 10:01:07 Failure : com.carrotsearch.randomizedtesting.TestHookMethodOrderWithExceptions$WithRandomizedRunner: null
20-Nov-2018 10:01:07 Run finished: run=0, ignored=0, failures=1, assumptions=0
20-Nov-2018 10:01:07
20-Nov-2018 10:01:07 Run started.
20-Nov-2018 10:01:07 Started : testMethod
20-Nov-2018 10:01:07 Finished: testMethod
20-Nov-2018 10:01:07 Run finished: run=1, ignored=0, failures=0, assumptions=0
20-Nov-2018 10:01:07
20-Nov-2018 10:01:07 Run started.
20-Nov-2018 10:01:07 Started : testMethod
20-Nov-2018 10:01:07 Finished: testMethod
20-Nov-2018 10:01:07 Run finished: run=1, ignored=0, failures=0, assumptions=0
20-Nov-2018 10:01:07
20-Nov-2018 10:01:07 Run started.
20-Nov-2018 10:01:07 Started : testMethod
20-Nov-2018 10:01:07 Finished: testMethod
20-Nov-2018 10:01:07 Run finished: run=1, ignored=0, failures=0, assumptions=0
20-Nov-2018 10:01:07
20-Nov-2018 10:01:07 Run started.
20-Nov-2018 10:01:07 Started : testMethod
20-Nov-2018 10:01:07 Finished: testMethod
20-Nov-2018 10:01:07 Run finished: run=1, ignored=0, failures=0, assumptions=0
20-Nov-2018 10:01:07
20-Nov-2018 10:01:07 Run started.
20-Nov-2018 10:01:07 Started : testMethod
20-Nov-2018 10:01:07 Failure : testMethod(com.carrotsearch.randomizedtesting.TestHookMethodOrderWithExceptions$WithRegularRunner): null
20-Nov-2018 10:01:07 Finished: testMethod
20-Nov-2018 10:01:07 Run finished: run=1, ignored=0, failures=1, assumptions=0
20-Nov-2018 10:01:07
20-Nov-2018 10:01:07 Run started.
20-Nov-2018 10:01:07 Started : testMethod
20-Nov-2018 10:01:07 Failure : testMethod(com.carrotsearch.randomizedtesting.TestHookMethodOrderWithExceptions$WithRandomizedRunner): null
20-Nov-2018 10:01:07 Finished: testMethod
20-Nov-2018 10:01:07 Run finished: run=1, ignored=0, failures=1, assumptions=0
20-Nov-2018 10:01:07
20-Nov-2018 10:01:07 Run started.
20-Nov-2018 10:01:07 Started : testMethod
20-Nov-2018 10:01:07 Failure : testMethod(com.carrotsearch.randomizedtesting.TestHookMethodOrderWithExceptions$WithRegularRunner): null
20-Nov-2018 10:01:07 Finished: testMethod
20-Nov-2018 10:01:07 Failure : com.carrotsearch.randomizedtesting.TestHookMethodOrderWithExceptions$WithRegularRunner: null
20-Nov-2018 10:01:07 Failure : com.carrotsearch.randomizedtesting.TestHookMethodOrderWithExceptions$WithRegularRunner: null
20-Nov-2018 10:01:07 Run finished: run=1, ignored=0, failures=3, assumptions=0
20-Nov-2018 10:01:07
20-Nov-2018 10:01:07 Run started.
20-Nov-2018 10:01:07 Started : testMethod
20-Nov-2018 10:01:07 Failure : testMethod(com.carrotsearch.randomizedtesting.TestHookMethodOrderWithExceptions$WithRandomizedRunner): null
20-Nov-2018 10:01:07 Finished: testMethod
20-Nov-2018 10:01:07 Failure : com.carrotsearch.randomizedtesting.TestHookMethodOrderWithExceptions$WithRandomizedRunner: null
20-Nov-2018 10:01:07 Failure : com.carrotsearch.randomizedtesting.TestHookMethodOrderWithExceptions$WithRandomizedRunner: null
20-Nov-2018 10:01:07 Run finished: run=1, ignored=0, failures=3, assumptions=0
20-Nov-2018 10:01:07
20-Nov-2018 10:01:07 Run started.
20-Nov-2018 10:01:07 Started : testMethod
20-Nov-2018 10:01:07 Finished: testMethod
20-Nov-2018 10:01:07 Run finished: run=1, ignored=0, failures=0, assumptions=0
20-Nov-2018 10:01:07
20-Nov-2018 10:01:07 Run started.
20-Nov-2018 10:01:07 Started : testMethod
20-Nov-2018 10:01:07 Finished: testMethod
20-Nov-2018 10:01:07 Run finished: run=1, ignored=0, failures=0, assumptions=0
20-Nov-2018 10:01:07
20-Nov-2018 10:01:07 Tests run: 20, Failures: 0, Errors: 0, Skipped: 0, Time elapsed: 0.073 sec - in com.carrotsearch.randomizedtesting.TestHookMethodOrderWithExceptions
20-Nov-2018 10:01:07 Running com.carrotsearch.randomizedtesting.TestThreadNameContainsTestName
20-Nov-2018 10:01:07 Tests run: 3, Failures: 0, Errors: 0, Skipped: 0, Time elapsed: 0.002 sec - in com.carrotsearch.randomizedtesting.TestThreadNameContainsTestName
20-Nov-2018 10:01:07 Running com.carrotsearch.randomizedtesting.TestCustomTestContextSupplier
20-Nov-2018 10:01:07 Tests run: 1, Failures: 0, Errors: 0, Skipped: 0, Time elapsed: 0.002 sec - in com.carrotsearch.randomizedtesting.TestCustomTestContextSupplier
20-Nov-2018 10:01:07 Running com.carrotsearch.randomizedtesting.TestClassMethodFiltering
20-Nov-2018 10:01:07 Run started.
20-Nov-2018 10:01:07 Started : method2
20-Nov-2018 10:01:07 Finished: method2
20-Nov-2018 10:01:07 Started : method1
20-Nov-2018 10:01:07 Finished: method1
20-Nov-2018 10:01:07 Run finished: run=2, ignored=0, failures=0, assumptions=0
20-Nov-2018 10:01:07
20-Nov-2018 10:01:07 Run started.
20-Nov-2018 10:01:07 Started : method2
20-Nov-2018 10:01:07 Finished: method2
20-Nov-2018 10:01:07 Run finished: run=1, ignored=0, failures=0, assumptions=0
20-Nov-2018 10:01:07
20-Nov-2018 10:01:07 Run started.
20-Nov-2018 10:01:07 Started : method1
20-Nov-2018 10:01:07 Finished: method1
20-Nov-2018 10:01:07 Started : method1
20-Nov-2018 10:01:07 Finished: method1
20-Nov-2018 10:01:07 Run finished: run=2, ignored=0, failures=0, assumptions=0
20-Nov-2018 10:01:07
20-Nov-2018 10:01:07 Run started.
20-Nov-2018 10:01:07 Started : method2
20-Nov-2018 10:01:07 Finished: method2
20-Nov-2018 10:01:07 Started : method1
20-Nov-2018 10:01:07 Finished: method1
20-Nov-2018 10:01:07 Run finished: run=2, ignored=0, failures=0, assumptions=0
20-Nov-2018 10:01:07
20-Nov-2018 10:01:07 Run started.
20-Nov-2018 10:01:07 Started : method1
20-Nov-2018 10:01:07 Finished: method1
20-Nov-2018 10:01:07 Started : method1
20-Nov-2018 10:01:07 Finished: method1
20-Nov-2018 10:01:07 Run finished: run=2, ignored=0, failures=0, assumptions=0
20-Nov-2018 10:01:07
20-Nov-2018 10:01:07 Tests run: 5, Failures: 0, Errors: 0, Skipped: 0, Time elapsed: 0.017 sec - in com.carrotsearch.randomizedtesting.TestClassMethodFiltering
20-Nov-2018 10:01:07
20-Nov-2018 10:01:07 Results :
20-Nov-2018 10:01:07
20-Nov-2018 10:01:07 Tests run: 2257, Failures: 0, Errors: 0, Skipped: 6
20-Nov-2018 10:01:07
20-Nov-2018 10:01:07 [INFO]
20-Nov-2018 10:01:07 [INFO] --- maven-jar-plugin:3.0.2:jar (default-jar) @ randomizedtesting-runner ---
20-Nov-2018 10:01:07 [INFO] Building jar: /home/bamboo/xml-data/build-dir/RNDTEST-SOFTWARE-RRJ10/randomized-runner/target/randomizedtesting-runner-2.7.1.jar
20-Nov-2018 10:01:07 [INFO]
20-Nov-2018 10:01:07 [INFO] --- maven-site-plugin:3.5.1:attach-descriptor (attach-descriptor) @ randomizedtesting-runner ---
20-Nov-2018 10:01:07 [INFO]
20-Nov-2018 10:01:07 [INFO] --- forbiddenapis:2.5:check (check-forbidden-apis) @ randomizedtesting-runner ---
20-Nov-2018 10:01:07 [INFO] Scanning for classes to check...
20-Nov-2018 10:01:07 [INFO] Reading bundled API signatures: jdk-unsafe-1.8
20-Nov-2018 10:01:07 [INFO] Reading bundled API signatures: jdk-deprecated-1.8
20-Nov-2018 10:01:08 [INFO] Reading bundled API signatures: jdk-system-out
20-Nov-2018 10:01:08 [INFO] Reading bundled API signatures: jdk-non-portable
20-Nov-2018 10:01:08 [INFO] Loading classes to check...
20-Nov-2018 10:01:08 [INFO] Scanning classes for violations...
20-Nov-2018 10:01:08 [INFO] Scanned 190 class file(s) for forbidden API invocations (in 0.32s), 0 error(s).
20-Nov-2018 10:01:08 [INFO]
20-Nov-2018 10:01:08 [INFO] -----------< com.carrotsearch.randomizedtesting:junit4-ant >------------
20-Nov-2018 10:01:08 [INFO] Building RandomizedTesting JUnit4 ANT Task 2.7.1                   [3/8]
20-Nov-2018 10:01:08 [INFO] --------------------------------[ jar ]---------------------------------
20-Nov-2018 10:01:08 [INFO]
20-Nov-2018 10:01:08 [INFO] --- maven-clean-plugin:3.0.0:clean (default-clean) @ junit4-ant ---
20-Nov-2018 10:01:08 [INFO] Deleting /home/bamboo/xml-data/build-dir/RNDTEST-SOFTWARE-RRJ10/junit4-ant/target (includes = [], excludes = [eclipse/**, idea/**])
20-Nov-2018 10:01:08 [INFO]
20-Nov-2018 10:01:08 [INFO] --- maven-enforcer-plugin:3.0.0-M1:enforce (enforce-proguard-java-home) @ junit4-ant ---
20-Nov-2018 10:01:08 [INFO]
20-Nov-2018 10:01:08 [INFO] --- maven-resources-plugin:3.0.1:resources (default-resources) @ junit4-ant ---
20-Nov-2018 10:01:08 [INFO] Using 'UTF-8' encoding to copy filtered resources.
20-Nov-2018 10:01:08 [INFO] Copying 15 resources
20-Nov-2018 10:01:08 [INFO]
20-Nov-2018 10:01:08 [INFO] --- maven-compiler-plugin:3.5.1:compile (default-compile) @ junit4-ant ---
20-Nov-2018 10:01:08 [INFO] Changes detected - recompiling the module!
20-Nov-2018 10:01:08 [INFO] Compiling 99 source files to /home/bamboo/xml-data/build-dir/RNDTEST-SOFTWARE-RRJ10/junit4-ant/target/classes
20-Nov-2018 10:01:08 [INFO] -------------------------------------------------------------
20-Nov-2018 10:01:08 [ERROR] COMPILATION ERROR :
20-Nov-2018 10:01:08 [INFO] -------------------------------------------------------------
20-Nov-2018 10:01:08 [ERROR] /home/bamboo/xml-data/build-dir/RNDTEST-SOFTWARE-RRJ10/junit4-ant/src/main/java/com/carrotsearch/ant/tasks/junit4/listeners/json/JsonReport.java:[267,9] ';' expected
20-Nov-2018 10:01:08 [INFO] 1 error
20-Nov-2018 10:01:08 [INFO] -------------------------------------------------------------
20-Nov-2018 10:01:08 [INFO] ------------------------------------------------------------------------
20-Nov-2018 10:01:08 [INFO] Reactor Summary:
20-Nov-2018 10:01:08 [INFO]
20-Nov-2018 10:01:08 [INFO] RandomizedTesting Parent POM 2.7.1 ................. SUCCESS [  0.990 s]
20-Nov-2018 10:01:08 [INFO] RandomizedTesting Randomized Runner ................ SUCCESS [ 33.996 s]
20-Nov-2018 10:01:08 [INFO] RandomizedTesting JUnit4 ANT Task .................. FAILURE [  0.428 s]
20-Nov-2018 10:01:08 [INFO] RandomizedTesting JUnit4 Maven Plugin .............. SKIPPED
20-Nov-2018 10:01:08 [INFO] RandomizedTesting JUnit4 Maven Plugin Tests ........ SKIPPED
20-Nov-2018 10:01:08 [INFO] RandomizedTesting Examples ......................... SKIPPED
20-Nov-2018 10:01:08 [INFO] RandomizedTesting ANT Examples ..................... SKIPPED
20-Nov-2018 10:01:08 [INFO] RandomizedTesting Security Manager Example 2.7.1 ... SKIPPED
20-Nov-2018 10:01:08 [INFO] ------------------------------------------------------------------------
20-Nov-2018 10:01:08 [INFO] BUILD FAILURE
20-Nov-2018 10:01:08 [INFO] ------------------------------------------------------------------------
20-Nov-2018 10:01:08 [INFO] Total time: 35.596 s
20-Nov-2018 10:01:08 [INFO] Finished at: 2018-11-20T10:01:08+01:00
20-Nov-2018 10:01:08 [INFO] ------------------------------------------------------------------------
20-Nov-2018 10:01:08 [ERROR] Failed to execute goal org.apache.maven.plugins:maven-compiler-plugin:3.5.1:compile (default-compile) on project junit4-ant: Compilation failure
20-Nov-2018 10:01:08 [ERROR] /home/bamboo/xml-data/build-dir/RNDTEST-SOFTWARE-RRJ10/junit4-ant/src/main/java/com/carrotsearch/ant/tasks/junit4/listeners/json/JsonReport.java:[267,9] ';' expected
20-Nov-2018 10:01:08 [ERROR] -> [Help 1]
20-Nov-2018 10:01:08 [ERROR]
20-Nov-2018 10:01:08 [ERROR] To see the full stack trace of the errors, re-run Maven with the -e switch.
20-Nov-2018 10:01:08 [ERROR] Re-run Maven using the -X switch to enable full debug logging.
20-Nov-2018 10:01:08 [ERROR]
20-Nov-2018 10:01:08 [ERROR] For more information about the errors and possible solutions, please read the following articles:
20-Nov-2018 10:01:08 [ERROR] [Help 1] http://cwiki.apache.org/confluence/display/MAVEN/MojoFailureException
20-Nov-2018 10:01:08 [ERROR]
20-Nov-2018 10:01:08 [ERROR] After correcting the problems, you can resume the build with the command
20-Nov-2018 10:01:08 [ERROR]   mvn <goals> -rf :junit4-ant
20-Nov-2018 10:01:08 Failing task since return code of [/home/bamboo/jvms/maven/bin/mvn --batch-mode -Djava.io.tmpdir=/tmp/RNDTEST-SOFTWARE-RRJ10 -Dmaven.repo.local=/home/bamboo/bamboo-agent-home-1/.m2/AGENT-61898765/repository clean verify -Dproguard.java.home=/home/bamboo/jvms/jdk8/jre] was 1 while expected 0
20-Nov-2018 10:01:08 Parsing test results under /home/bamboo/xml-data/build-dir/RNDTEST-SOFTWARE-RRJ10...
20-Nov-2018 10:01:09 Finished task 'Maven 3.x' with result: Failed
20-Nov-2018 10:01:09 Running post build plugin 'Docker Container Cleanup'
20-Nov-2018 10:01:09 Running post build plugin 'NCover Results Collector'
20-Nov-2018 10:01:09 Running post build plugin 'Clover Results Collector'
20-Nov-2018 10:01:09 Running post build plugin 'npm Cache Cleanup'
20-Nov-2018 10:01:09 Running post build plugin 'Artifact Copier'
20-Nov-2018 10:01:09 Finalising the build...
20-Nov-2018 10:01:09 Stopping timer.
20-Nov-2018 10:01:09 Build RNDTEST-SOFTWARE-RRJ10-225 completed.
20-Nov-2018 10:01:12 Running on server: post build plugin 'NCover Results Collector'
20-Nov-2018 10:01:12 Running on server: post build plugin 'Build Hanging Detection Configuration'
20-Nov-2018 10:01:12 Running on server: post build plugin 'Clover Delta Calculator'
20-Nov-2018 10:01:12 Running on server: post build plugin 'Maven Dependencies Postprocessor'
20-Nov-2018 10:01:12 All post build plugins have finished
20-Nov-2018 10:01:12 Generating build results summary...
20-Nov-2018 10:01:14 Saving build results to disk...
20-Nov-2018 10:01:14 Logging substituted variables...
20-Nov-2018 10:01:14 Indexing build results...
20-Nov-2018 10:01:14 Finished building RNDTEST-SOFTWARE-RRJ10-225.