Build #84

Build: #84 failed

Job: JDK 9 was successful

Stages & jobs

  1. Compile and test

  2. Package

Build log

The build generated 9,711 lines of output.The output is too long and has been truncated to the last 1,000 lines. Download or view full build log

27-Oct-2015 13:46:54 policy: evaluate codesources:
27-Oct-2015 13:46:54         Policy CodeSource: (file:/mnt/work/bamboo-home/xml-data/build-dir/RNDTEST-SOFTWARE-JDK19/examples/security-manager/target/J0/$%7b%7bjava.ext.dirs%7d%7d/* <no signer certificates>)
27-Oct-2015 13:46:54         Active CodeSource: (file:/mnt/work/bamboo-home/xml-data/build-dir/RNDTEST-SOFTWARE-JDK19/junit4-ant/target/junit4-ant-2.2.0-SNAPSHOT.jar <no signer certificates>)
27-Oct-2015 13:46:54 policy: evaluation (codesource) failed
27-Oct-2015 13:46:54 policy: evaluate codesources:
27-Oct-2015 13:46:54         Policy CodeSource: (file:/mnt/work/bamboo-home/xml-data/build-dir/RNDTEST-SOFTWARE-JDK19/junit4-ant/target/junit4-ant-2.2.0-SNAPSHOT.jar <no signer certificates>)
27-Oct-2015 13:46:54         Active CodeSource: (file:/mnt/work/bamboo-home/xml-data/build-dir/RNDTEST-SOFTWARE-JDK19/junit4-ant/target/junit4-ant-2.2.0-SNAPSHOT.jar <no signer certificates>)
27-Oct-2015 13:46:54 policy: evaluate principals:
27-Oct-2015 13:46:54         Policy Principals: []
27-Oct-2015 13:46:54         Active Principals: []
27-Oct-2015 13:46:54 policy:   granting ("java.lang.RuntimePermission" "setIO")
27-Oct-2015 13:46:54 policy: evaluation (codesource/principals) passed
27-Oct-2015 13:46:54 policy: evaluate codesources:
27-Oct-2015 13:46:54         Policy CodeSource: (file:/mnt/work/bamboo-home/xml-data/build-dir/RNDTEST-SOFTWARE-JDK19/randomized-runner/target/randomizedtesting-runner-2.2.0-SNAPSHOT.jar <no signer certificates>)
27-Oct-2015 13:46:54         Active CodeSource: (file:/mnt/work/bamboo-home/xml-data/build-dir/RNDTEST-SOFTWARE-JDK19/junit4-ant/target/junit4-ant-2.2.0-SNAPSHOT.jar <no signer certificates>)
27-Oct-2015 13:46:54 policy: evaluation (codesource) failed
27-Oct-2015 13:46:54 policy: evaluate codesources:
27-Oct-2015 13:46:54         Policy CodeSource: (file:/mnt/work/bamboo-home/.m2/AGENT-1671170/repository/junit/junit/4.10/junit-4.10.jar <no signer certificates>)
27-Oct-2015 13:46:54         Active CodeSource: (file:/mnt/work/bamboo-home/xml-data/build-dir/RNDTEST-SOFTWARE-JDK19/junit4-ant/target/junit4-ant-2.2.0-SNAPSHOT.jar <no signer certificates>)
27-Oct-2015 13:46:54 policy: evaluation (codesource) failed
27-Oct-2015 13:46:54 policy: evaluate codesources:
27-Oct-2015 13:46:54         Policy CodeSource: (null <no signer certificates>)
27-Oct-2015 13:46:54         Active CodeSource: (file:/mnt/work/bamboo-home/xml-data/build-dir/RNDTEST-SOFTWARE-JDK19/junit4-ant/target/junit4-ant-2.2.0-SNAPSHOT.jar <no signer certificates>)
27-Oct-2015 13:46:54 policy: evaluate principals:
27-Oct-2015 13:46:54         Policy Principals: []
27-Oct-2015 13:46:54         Active Principals: []
27-Oct-2015 13:46:54 policy:   granting ("java.util.PropertyPermission" "*" "read")
27-Oct-2015 13:46:54 policy:   granting ("java.io.FilePermission" "<<ALL FILES>>" "read,write,execute,delete")
27-Oct-2015 13:46:54 policy: evaluation (codesource/principals) passed
27-Oct-2015 13:46:54 access: domain 0 ProtectionDomain  (file:/mnt/work/bamboo-home/xml-data/build-dir/RNDTEST-SOFTWARE-JDK19/junit4-ant/target/junit4-ant-2.2.0-SNAPSHOT.jar <no signer certificates>)
27-Oct-2015 13:46:54 sun.misc.Launcher$AppClassLoader@5ccd43c2
27-Oct-2015 13:46:54 <no principals>
27-Oct-2015 13:46:54 java.security.Permissions@5622fdf (
27-Oct-2015 13:46:54 ("java.lang.RuntimePermission" "exitVM")
27-Oct-2015 13:46:54 ("java.lang.RuntimePermission" "setIO")
27-Oct-2015 13:46:54 ("java.io.FilePermission" "<<ALL FILES>>" "read,write,execute,delete")
27-Oct-2015 13:46:54 ("java.io.FilePermission" "/mnt/work/bamboo-home/xml-data/build-dir/RNDTEST-SOFTWARE-JDK19/junit4-ant/target/junit4-ant-2.2.0-SNAPSHOT.jar" "read")
27-Oct-2015 13:46:54 ("java.util.PropertyPermission" "*" "read")
27-Oct-2015 13:46:54 )
27-Oct-2015 13:46:54
27-Oct-2015 13:46:54
27-Oct-2015 13:46:54 access: access allowed ("java.util.PropertyPermission" "java.class.version" "read")
27-Oct-2015 13:46:54 java.lang.Exception: Stack trace
27-Oct-2015 13:46:54         at java.lang.Thread.dumpStack(Thread.java:1333)
27-Oct-2015 13:46:54         at java.security.AccessControlContext.checkPermission(AccessControlContext.java:415)
27-Oct-2015 13:46:54         at java.security.AccessController.checkPermission(AccessController.java:894)
27-Oct-2015 13:46:54         at java.lang.SecurityManager.checkPermission(SecurityManager.java:541)
27-Oct-2015 13:46:54         at java.lang.SecurityManager.checkPropertyAccess(SecurityManager.java:1285)
27-Oct-2015 13:46:54         at java.lang.System.getProperty(System.java:708)
27-Oct-2015 13:46:54         at com.carrotsearch.ant.tasks.junit4.events.BootstrapEvent.collectSystemProperties(BootstrapEvent.java:93)
27-Oct-2015 13:46:54         at com.carrotsearch.ant.tasks.junit4.events.BootstrapEvent.<init>(BootstrapEvent.java:68)
27-Oct-2015 13:46:54         at com.carrotsearch.ant.tasks.junit4.slave.SlaveMain.main(SlaveMain.java:337)
27-Oct-2015 13:46:54         at com.carrotsearch.ant.tasks.junit4.slave.SlaveMainSafe.main(SlaveMainSafe.java:10)
27-Oct-2015 13:46:54 policy: getPermissions:
27-Oct-2015 13:46:54         PD CodeSource: (file:/mnt/work/bamboo-home/xml-data/build-dir/RNDTEST-SOFTWARE-JDK19/junit4-ant/target/junit4-ant-2.2.0-SNAPSHOT.jar <no signer certificates>)
27-Oct-2015 13:46:54         PD ClassLoader: sun.misc.Launcher$AppClassLoader@5ccd43c2
27-Oct-2015 13:46:54         PD Principals: <no principals>
27-Oct-2015 13:46:54 policy: evaluate codesources:
27-Oct-2015 13:46:54         Policy CodeSource: (file:/mnt/work/bamboo-home/xml-data/build-dir/RNDTEST-SOFTWARE-JDK19/examples/security-manager/target/J0/$%7b%7bjava.ext.dirs%7d%7d/* <no signer certificates>)
27-Oct-2015 13:46:54         Active CodeSource: (file:/mnt/work/bamboo-home/xml-data/build-dir/RNDTEST-SOFTWARE-JDK19/junit4-ant/target/junit4-ant-2.2.0-SNAPSHOT.jar <no signer certificates>)
27-Oct-2015 13:46:54 policy: evaluation (codesource) failed
27-Oct-2015 13:46:54 policy: evaluate codesources:
27-Oct-2015 13:46:54         Policy CodeSource: (file:/mnt/work/bamboo-home/xml-data/build-dir/RNDTEST-SOFTWARE-JDK19/junit4-ant/target/junit4-ant-2.2.0-SNAPSHOT.jar <no signer certificates>)
27-Oct-2015 13:46:54         Active CodeSource: (file:/mnt/work/bamboo-home/xml-data/build-dir/RNDTEST-SOFTWARE-JDK19/junit4-ant/target/junit4-ant-2.2.0-SNAPSHOT.jar <no signer certificates>)
27-Oct-2015 13:46:54 policy: evaluate principals:
27-Oct-2015 13:46:54         Policy Principals: []
27-Oct-2015 13:46:54         Active Principals: []
27-Oct-2015 13:46:54 policy:   granting ("java.lang.RuntimePermission" "setIO")
27-Oct-2015 13:46:54 policy: evaluation (codesource/principals) passed
27-Oct-2015 13:46:54 policy: evaluate codesources:
27-Oct-2015 13:46:54         Policy CodeSource: (file:/mnt/work/bamboo-home/xml-data/build-dir/RNDTEST-SOFTWARE-JDK19/randomized-runner/target/randomizedtesting-runner-2.2.0-SNAPSHOT.jar <no signer certificates>)
27-Oct-2015 13:46:54         Active CodeSource: (file:/mnt/work/bamboo-home/xml-data/build-dir/RNDTEST-SOFTWARE-JDK19/junit4-ant/target/junit4-ant-2.2.0-SNAPSHOT.jar <no signer certificates>)
27-Oct-2015 13:46:54 policy: evaluation (codesource) failed
27-Oct-2015 13:46:54 policy: evaluate codesources:
27-Oct-2015 13:46:54         Policy CodeSource: (file:/mnt/work/bamboo-home/.m2/AGENT-1671170/repository/junit/junit/4.10/junit-4.10.jar <no signer certificates>)
27-Oct-2015 13:46:54         Active CodeSource: (file:/mnt/work/bamboo-home/xml-data/build-dir/RNDTEST-SOFTWARE-JDK19/junit4-ant/target/junit4-ant-2.2.0-SNAPSHOT.jar <no signer certificates>)
27-Oct-2015 13:46:54 policy: evaluation (codesource) failed
27-Oct-2015 13:46:54 policy: evaluate codesources:
27-Oct-2015 13:46:54         Policy CodeSource: (null <no signer certificates>)
27-Oct-2015 13:46:54         Active CodeSource: (file:/mnt/work/bamboo-home/xml-data/build-dir/RNDTEST-SOFTWARE-JDK19/junit4-ant/target/junit4-ant-2.2.0-SNAPSHOT.jar <no signer certificates>)
27-Oct-2015 13:46:54 policy: evaluate principals:
27-Oct-2015 13:46:54         Policy Principals: []
27-Oct-2015 13:46:54         Active Principals: []
27-Oct-2015 13:46:54 policy:   granting ("java.util.PropertyPermission" "*" "read")
27-Oct-2015 13:46:54 policy:   granting ("java.io.FilePermission" "<<ALL FILES>>" "read,write,execute,delete")
27-Oct-2015 13:46:54 policy: evaluation (codesource/principals) passed
27-Oct-2015 13:46:54 access: domain 0 ProtectionDomain  (file:/mnt/work/bamboo-home/xml-data/build-dir/RNDTEST-SOFTWARE-JDK19/junit4-ant/target/junit4-ant-2.2.0-SNAPSHOT.jar <no signer certificates>)
27-Oct-2015 13:46:54 sun.misc.Launcher$AppClassLoader@5ccd43c2
27-Oct-2015 13:46:54 <no principals>
27-Oct-2015 13:46:54 java.security.Permissions@7d9d1a19 (
27-Oct-2015 13:46:54 ("java.lang.RuntimePermission" "exitVM")
27-Oct-2015 13:46:54 ("java.lang.RuntimePermission" "setIO")
27-Oct-2015 13:46:54 ("java.io.FilePermission" "<<ALL FILES>>" "read,write,execute,delete")
27-Oct-2015 13:46:54 ("java.io.FilePermission" "/mnt/work/bamboo-home/xml-data/build-dir/RNDTEST-SOFTWARE-JDK19/junit4-ant/target/junit4-ant-2.2.0-SNAPSHOT.jar" "read")
27-Oct-2015 13:46:54 ("java.util.PropertyPermission" "*" "read")
27-Oct-2015 13:46:54 )
27-Oct-2015 13:46:54
27-Oct-2015 13:46:54
27-Oct-2015 13:46:54 access: access allowed ("java.util.PropertyPermission" "java.class.path" "read")
27-Oct-2015 13:46:54 java.lang.Exception: Stack trace
27-Oct-2015 13:46:54         at java.lang.Thread.dumpStack(Thread.java:1333)
27-Oct-2015 13:46:54         at java.security.AccessControlContext.checkPermission(AccessControlContext.java:415)
27-Oct-2015 13:46:54         at java.security.AccessController.checkPermission(AccessController.java:894)
27-Oct-2015 13:46:54         at java.lang.SecurityManager.checkPermission(SecurityManager.java:541)
27-Oct-2015 13:46:54         at java.lang.SecurityManager.checkPropertyAccess(SecurityManager.java:1285)
27-Oct-2015 13:46:54         at java.lang.System.getProperty(System.java:708)
27-Oct-2015 13:46:54         at com.carrotsearch.ant.tasks.junit4.events.BootstrapEvent.collectSystemProperties(BootstrapEvent.java:93)
27-Oct-2015 13:46:54         at com.carrotsearch.ant.tasks.junit4.events.BootstrapEvent.<init>(BootstrapEvent.java:68)
27-Oct-2015 13:46:54         at com.carrotsearch.ant.tasks.junit4.slave.SlaveMain.main(SlaveMain.java:337)
27-Oct-2015 13:46:54         at com.carrotsearch.ant.tasks.junit4.slave.SlaveMainSafe.main(SlaveMainSafe.java:10)
27-Oct-2015 13:46:54 policy: getPermissions:
27-Oct-2015 13:46:54         PD CodeSource: (file:/mnt/work/bamboo-home/xml-data/build-dir/RNDTEST-SOFTWARE-JDK19/junit4-ant/target/junit4-ant-2.2.0-SNAPSHOT.jar <no signer certificates>)
27-Oct-2015 13:46:54         PD ClassLoader: sun.misc.Launcher$AppClassLoader@5ccd43c2
27-Oct-2015 13:46:54         PD Principals: <no principals>
27-Oct-2015 13:46:54 policy: evaluate codesources:
27-Oct-2015 13:46:54         Policy CodeSource: (file:/mnt/work/bamboo-home/xml-data/build-dir/RNDTEST-SOFTWARE-JDK19/examples/security-manager/target/J0/$%7b%7bjava.ext.dirs%7d%7d/* <no signer certificates>)
27-Oct-2015 13:46:54         Active CodeSource: (file:/mnt/work/bamboo-home/xml-data/build-dir/RNDTEST-SOFTWARE-JDK19/junit4-ant/target/junit4-ant-2.2.0-SNAPSHOT.jar <no signer certificates>)
27-Oct-2015 13:46:54 policy: evaluation (codesource) failed
27-Oct-2015 13:46:54 policy: evaluate codesources:
27-Oct-2015 13:46:54         Policy CodeSource: (file:/mnt/work/bamboo-home/xml-data/build-dir/RNDTEST-SOFTWARE-JDK19/junit4-ant/target/junit4-ant-2.2.0-SNAPSHOT.jar <no signer certificates>)
27-Oct-2015 13:46:54         Active CodeSource: (file:/mnt/work/bamboo-home/xml-data/build-dir/RNDTEST-SOFTWARE-JDK19/junit4-ant/target/junit4-ant-2.2.0-SNAPSHOT.jar <no signer certificates>)
27-Oct-2015 13:46:54 policy: evaluate principals:
27-Oct-2015 13:46:54         Policy Principals: []
27-Oct-2015 13:46:54         Active Principals: []
27-Oct-2015 13:46:54 policy:   granting ("java.lang.RuntimePermission" "setIO")
27-Oct-2015 13:46:54 policy: evaluation (codesource/principals) passed
27-Oct-2015 13:46:54 policy: evaluate codesources:
27-Oct-2015 13:46:54         Policy CodeSource: (file:/mnt/work/bamboo-home/xml-data/build-dir/RNDTEST-SOFTWARE-JDK19/randomized-runner/target/randomizedtesting-runner-2.2.0-SNAPSHOT.jar <no signer certificates>)
27-Oct-2015 13:46:54         Active CodeSource: (file:/mnt/work/bamboo-home/xml-data/build-dir/RNDTEST-SOFTWARE-JDK19/junit4-ant/target/junit4-ant-2.2.0-SNAPSHOT.jar <no signer certificates>)
27-Oct-2015 13:46:54 policy: evaluation (codesource) failed
27-Oct-2015 13:46:54 policy: evaluate codesources:
27-Oct-2015 13:46:54         Policy CodeSource: (file:/mnt/work/bamboo-home/.m2/AGENT-1671170/repository/junit/junit/4.10/junit-4.10.jar <no signer certificates>)
27-Oct-2015 13:46:54         Active CodeSource: (file:/mnt/work/bamboo-home/xml-data/build-dir/RNDTEST-SOFTWARE-JDK19/junit4-ant/target/junit4-ant-2.2.0-SNAPSHOT.jar <no signer certificates>)
27-Oct-2015 13:46:54 policy: evaluation (codesource) failed
27-Oct-2015 13:46:54 policy: evaluate codesources:
27-Oct-2015 13:46:54         Policy CodeSource: (null <no signer certificates>)
27-Oct-2015 13:46:54         Active CodeSource: (file:/mnt/work/bamboo-home/xml-data/build-dir/RNDTEST-SOFTWARE-JDK19/junit4-ant/target/junit4-ant-2.2.0-SNAPSHOT.jar <no signer certificates>)
27-Oct-2015 13:46:54 policy: evaluate principals:
27-Oct-2015 13:46:54         Policy Principals: []
27-Oct-2015 13:46:54         Active Principals: []
27-Oct-2015 13:46:54 policy:   granting ("java.util.PropertyPermission" "*" "read")
27-Oct-2015 13:46:54 policy:   granting ("java.io.FilePermission" "<<ALL FILES>>" "read,write,execute,delete")
27-Oct-2015 13:46:54 policy: evaluation (codesource/principals) passed
27-Oct-2015 13:46:54 access: domain 0 ProtectionDomain  (file:/mnt/work/bamboo-home/xml-data/build-dir/RNDTEST-SOFTWARE-JDK19/junit4-ant/target/junit4-ant-2.2.0-SNAPSHOT.jar <no signer certificates>)
27-Oct-2015 13:46:54 sun.misc.Launcher$AppClassLoader@5ccd43c2
27-Oct-2015 13:46:54 <no principals>
27-Oct-2015 13:46:54 java.security.Permissions@1794d431 (
27-Oct-2015 13:46:54 ("java.lang.RuntimePermission" "exitVM")
27-Oct-2015 13:46:54 ("java.lang.RuntimePermission" "setIO")
27-Oct-2015 13:46:54 ("java.io.FilePermission" "<<ALL FILES>>" "read,write,execute,delete")
27-Oct-2015 13:46:54 ("java.io.FilePermission" "/mnt/work/bamboo-home/xml-data/build-dir/RNDTEST-SOFTWARE-JDK19/junit4-ant/target/junit4-ant-2.2.0-SNAPSHOT.jar" "read")
27-Oct-2015 13:46:54 ("java.util.PropertyPermission" "*" "read")
27-Oct-2015 13:46:54 )
27-Oct-2015 13:46:54
27-Oct-2015 13:46:54
27-Oct-2015 13:46:54 access: access allowed ("java.util.PropertyPermission" "java.library.path" "read")
27-Oct-2015 13:46:54 java.lang.Exception: Stack trace
27-Oct-2015 13:46:54         at java.lang.Thread.dumpStack(Thread.java:1333)
27-Oct-2015 13:46:54         at java.security.AccessControlContext.checkPermission(AccessControlContext.java:415)
27-Oct-2015 13:46:54         at java.security.AccessController.checkPermission(AccessController.java:894)
27-Oct-2015 13:46:54         at java.lang.SecurityManager.checkPermission(SecurityManager.java:541)
27-Oct-2015 13:46:54         at java.lang.SecurityManager.checkPropertyAccess(SecurityManager.java:1285)
27-Oct-2015 13:46:54         at java.lang.System.getProperty(System.java:708)
27-Oct-2015 13:46:54         at com.carrotsearch.ant.tasks.junit4.events.BootstrapEvent.collectSystemProperties(BootstrapEvent.java:93)
27-Oct-2015 13:46:54         at com.carrotsearch.ant.tasks.junit4.events.BootstrapEvent.<init>(BootstrapEvent.java:68)
27-Oct-2015 13:46:54         at com.carrotsearch.ant.tasks.junit4.slave.SlaveMain.main(SlaveMain.java:337)
27-Oct-2015 13:46:54         at com.carrotsearch.ant.tasks.junit4.slave.SlaveMainSafe.main(SlaveMainSafe.java:10)
27-Oct-2015 13:46:54 policy: getPermissions:
27-Oct-2015 13:46:54         PD CodeSource: (file:/mnt/work/bamboo-home/xml-data/build-dir/RNDTEST-SOFTWARE-JDK19/junit4-ant/target/junit4-ant-2.2.0-SNAPSHOT.jar <no signer certificates>)
27-Oct-2015 13:46:54         PD ClassLoader: sun.misc.Launcher$AppClassLoader@5ccd43c2
27-Oct-2015 13:46:54         PD Principals: <no principals>
27-Oct-2015 13:46:54 policy: evaluate codesources:
27-Oct-2015 13:46:54         Policy CodeSource: (file:/mnt/work/bamboo-home/xml-data/build-dir/RNDTEST-SOFTWARE-JDK19/examples/security-manager/target/J0/$%7b%7bjava.ext.dirs%7d%7d/* <no signer certificates>)
27-Oct-2015 13:46:54         Active CodeSource: (file:/mnt/work/bamboo-home/xml-data/build-dir/RNDTEST-SOFTWARE-JDK19/junit4-ant/target/junit4-ant-2.2.0-SNAPSHOT.jar <no signer certificates>)
27-Oct-2015 13:46:54 policy: evaluation (codesource) failed
27-Oct-2015 13:46:54 policy: evaluate codesources:
27-Oct-2015 13:46:54         Policy CodeSource: (file:/mnt/work/bamboo-home/xml-data/build-dir/RNDTEST-SOFTWARE-JDK19/junit4-ant/target/junit4-ant-2.2.0-SNAPSHOT.jar <no signer certificates>)
27-Oct-2015 13:46:54         Active CodeSource: (file:/mnt/work/bamboo-home/xml-data/build-dir/RNDTEST-SOFTWARE-JDK19/junit4-ant/target/junit4-ant-2.2.0-SNAPSHOT.jar <no signer certificates>)
27-Oct-2015 13:46:54 policy: evaluate principals:
27-Oct-2015 13:46:54         Policy Principals: []
27-Oct-2015 13:46:54         Active Principals: []
27-Oct-2015 13:46:54 policy:   granting ("java.lang.RuntimePermission" "setIO")
27-Oct-2015 13:46:54 policy: evaluation (codesource/principals) passed
27-Oct-2015 13:46:54 policy: evaluate codesources:
27-Oct-2015 13:46:54         Policy CodeSource: (file:/mnt/work/bamboo-home/xml-data/build-dir/RNDTEST-SOFTWARE-JDK19/randomized-runner/target/randomizedtesting-runner-2.2.0-SNAPSHOT.jar <no signer certificates>)
27-Oct-2015 13:46:54         Active CodeSource: (file:/mnt/work/bamboo-home/xml-data/build-dir/RNDTEST-SOFTWARE-JDK19/junit4-ant/target/junit4-ant-2.2.0-SNAPSHOT.jar <no signer certificates>)
27-Oct-2015 13:46:54 policy: evaluation (codesource) failed
27-Oct-2015 13:46:54 policy: evaluate codesources:
27-Oct-2015 13:46:54         Policy CodeSource: (file:/mnt/work/bamboo-home/.m2/AGENT-1671170/repository/junit/junit/4.10/junit-4.10.jar <no signer certificates>)
27-Oct-2015 13:46:54         Active CodeSource: (file:/mnt/work/bamboo-home/xml-data/build-dir/RNDTEST-SOFTWARE-JDK19/junit4-ant/target/junit4-ant-2.2.0-SNAPSHOT.jar <no signer certificates>)
27-Oct-2015 13:46:54 policy: evaluation (codesource) failed
27-Oct-2015 13:46:54 policy: evaluate codesources:
27-Oct-2015 13:46:54         Policy CodeSource: (null <no signer certificates>)
27-Oct-2015 13:46:54         Active CodeSource: (file:/mnt/work/bamboo-home/xml-data/build-dir/RNDTEST-SOFTWARE-JDK19/junit4-ant/target/junit4-ant-2.2.0-SNAPSHOT.jar <no signer certificates>)
27-Oct-2015 13:46:54 policy: evaluate principals:
27-Oct-2015 13:46:54         Policy Principals: []
27-Oct-2015 13:46:54         Active Principals: []
27-Oct-2015 13:46:54 policy:   granting ("java.util.PropertyPermission" "*" "read")
27-Oct-2015 13:46:54 policy:   granting ("java.io.FilePermission" "<<ALL FILES>>" "read,write,execute,delete")
27-Oct-2015 13:46:54 policy: evaluation (codesource/principals) passed
27-Oct-2015 13:46:54 access: domain 0 ProtectionDomain  (file:/mnt/work/bamboo-home/xml-data/build-dir/RNDTEST-SOFTWARE-JDK19/junit4-ant/target/junit4-ant-2.2.0-SNAPSHOT.jar <no signer certificates>)
27-Oct-2015 13:46:54 sun.misc.Launcher$AppClassLoader@5ccd43c2
27-Oct-2015 13:46:54 <no principals>
27-Oct-2015 13:46:54 java.security.Permissions@57baeedf (
27-Oct-2015 13:46:54 ("java.lang.RuntimePermission" "exitVM")
27-Oct-2015 13:46:54 ("java.lang.RuntimePermission" "setIO")
27-Oct-2015 13:46:54 ("java.io.FilePermission" "<<ALL FILES>>" "read,write,execute,delete")
27-Oct-2015 13:46:54 ("java.io.FilePermission" "/mnt/work/bamboo-home/xml-data/build-dir/RNDTEST-SOFTWARE-JDK19/junit4-ant/target/junit4-ant-2.2.0-SNAPSHOT.jar" "read")
27-Oct-2015 13:46:54 ("java.util.PropertyPermission" "*" "read")
27-Oct-2015 13:46:54 )
27-Oct-2015 13:46:54
27-Oct-2015 13:46:54
27-Oct-2015 13:46:54 access: access allowed ("java.util.PropertyPermission" "java.io.tmpdir" "read")
27-Oct-2015 13:46:54 java.lang.Exception: Stack trace
27-Oct-2015 13:46:54         at java.lang.Thread.dumpStack(Thread.java:1333)
27-Oct-2015 13:46:54         at java.security.AccessControlContext.checkPermission(AccessControlContext.java:415)
27-Oct-2015 13:46:54         at java.security.AccessController.checkPermission(AccessController.java:894)
27-Oct-2015 13:46:54         at java.lang.SecurityManager.checkPermission(SecurityManager.java:541)
27-Oct-2015 13:46:54         at java.lang.SecurityManager.checkPropertyAccess(SecurityManager.java:1285)
27-Oct-2015 13:46:54         at java.lang.System.getProperty(System.java:708)
27-Oct-2015 13:46:54         at com.carrotsearch.ant.tasks.junit4.events.BootstrapEvent.collectSystemProperties(BootstrapEvent.java:93)
27-Oct-2015 13:46:54         at com.carrotsearch.ant.tasks.junit4.events.BootstrapEvent.<init>(BootstrapEvent.java:68)
27-Oct-2015 13:46:54         at com.carrotsearch.ant.tasks.junit4.slave.SlaveMain.main(SlaveMain.java:337)
27-Oct-2015 13:46:54         at com.carrotsearch.ant.tasks.junit4.slave.SlaveMainSafe.main(SlaveMainSafe.java:10)
27-Oct-2015 13:46:54 policy: getPermissions:
27-Oct-2015 13:46:54         PD CodeSource: (file:/mnt/work/bamboo-home/xml-data/build-dir/RNDTEST-SOFTWARE-JDK19/junit4-ant/target/junit4-ant-2.2.0-SNAPSHOT.jar <no signer certificates>)
27-Oct-2015 13:46:54         PD ClassLoader: sun.misc.Launcher$AppClassLoader@5ccd43c2
27-Oct-2015 13:46:54         PD Principals: <no principals>
27-Oct-2015 13:46:54 policy: evaluate codesources:
27-Oct-2015 13:46:54         Policy CodeSource: (file:/mnt/work/bamboo-home/xml-data/build-dir/RNDTEST-SOFTWARE-JDK19/examples/security-manager/target/J0/$%7b%7bjava.ext.dirs%7d%7d/* <no signer certificates>)
27-Oct-2015 13:46:54         Active CodeSource: (file:/mnt/work/bamboo-home/xml-data/build-dir/RNDTEST-SOFTWARE-JDK19/junit4-ant/target/junit4-ant-2.2.0-SNAPSHOT.jar <no signer certificates>)
27-Oct-2015 13:46:54 policy: evaluation (codesource) failed
27-Oct-2015 13:46:54 policy: evaluate codesources:
27-Oct-2015 13:46:54         Policy CodeSource: (file:/mnt/work/bamboo-home/xml-data/build-dir/RNDTEST-SOFTWARE-JDK19/junit4-ant/target/junit4-ant-2.2.0-SNAPSHOT.jar <no signer certificates>)
27-Oct-2015 13:46:54         Active CodeSource: (file:/mnt/work/bamboo-home/xml-data/build-dir/RNDTEST-SOFTWARE-JDK19/junit4-ant/target/junit4-ant-2.2.0-SNAPSHOT.jar <no signer certificates>)
27-Oct-2015 13:46:54 policy: evaluate principals:
27-Oct-2015 13:46:54         Policy Principals: []
27-Oct-2015 13:46:54         Active Principals: []
27-Oct-2015 13:46:54 policy:   granting ("java.lang.RuntimePermission" "setIO")
27-Oct-2015 13:46:54 policy: evaluation (codesource/principals) passed
27-Oct-2015 13:46:54 policy: evaluate codesources:
27-Oct-2015 13:46:54         Policy CodeSource: (file:/mnt/work/bamboo-home/xml-data/build-dir/RNDTEST-SOFTWARE-JDK19/randomized-runner/target/randomizedtesting-runner-2.2.0-SNAPSHOT.jar <no signer certificates>)
27-Oct-2015 13:46:54         Active CodeSource: (file:/mnt/work/bamboo-home/xml-data/build-dir/RNDTEST-SOFTWARE-JDK19/junit4-ant/target/junit4-ant-2.2.0-SNAPSHOT.jar <no signer certificates>)
27-Oct-2015 13:46:54 policy: evaluation (codesource) failed
27-Oct-2015 13:46:54 policy: evaluate codesources:
27-Oct-2015 13:46:54         Policy CodeSource: (file:/mnt/work/bamboo-home/.m2/AGENT-1671170/repository/junit/junit/4.10/junit-4.10.jar <no signer certificates>)
27-Oct-2015 13:46:54         Active CodeSource: (file:/mnt/work/bamboo-home/xml-data/build-dir/RNDTEST-SOFTWARE-JDK19/junit4-ant/target/junit4-ant-2.2.0-SNAPSHOT.jar <no signer certificates>)
27-Oct-2015 13:46:54 policy: evaluation (codesource) failed
27-Oct-2015 13:46:54 policy: evaluate codesources:
27-Oct-2015 13:46:54         Policy CodeSource: (null <no signer certificates>)
27-Oct-2015 13:46:54         Active CodeSource: (file:/mnt/work/bamboo-home/xml-data/build-dir/RNDTEST-SOFTWARE-JDK19/junit4-ant/target/junit4-ant-2.2.0-SNAPSHOT.jar <no signer certificates>)
27-Oct-2015 13:46:54 policy: evaluate principals:
27-Oct-2015 13:46:54         Policy Principals: []
27-Oct-2015 13:46:54         Active Principals: []
27-Oct-2015 13:46:54 policy:   granting ("java.util.PropertyPermission" "*" "read")
27-Oct-2015 13:46:54 policy:   granting ("java.io.FilePermission" "<<ALL FILES>>" "read,write,execute,delete")
27-Oct-2015 13:46:54 policy: evaluation (codesource/principals) passed
27-Oct-2015 13:46:54 access: domain 0 ProtectionDomain  (file:/mnt/work/bamboo-home/xml-data/build-dir/RNDTEST-SOFTWARE-JDK19/junit4-ant/target/junit4-ant-2.2.0-SNAPSHOT.jar <no signer certificates>)
27-Oct-2015 13:46:54 sun.misc.Launcher$AppClassLoader@5ccd43c2
27-Oct-2015 13:46:54 <no principals>
27-Oct-2015 13:46:54 java.security.Permissions@53b32d7 (
27-Oct-2015 13:46:54 ("java.lang.RuntimePermission" "exitVM")
27-Oct-2015 13:46:54 ("java.lang.RuntimePermission" "setIO")
27-Oct-2015 13:46:54 ("java.io.FilePermission" "<<ALL FILES>>" "read,write,execute,delete")
27-Oct-2015 13:46:54 ("java.io.FilePermission" "/mnt/work/bamboo-home/xml-data/build-dir/RNDTEST-SOFTWARE-JDK19/junit4-ant/target/junit4-ant-2.2.0-SNAPSHOT.jar" "read")
27-Oct-2015 13:46:54 ("java.util.PropertyPermission" "*" "read")
27-Oct-2015 13:46:54 )
27-Oct-2015 13:46:54
27-Oct-2015 13:46:54
27-Oct-2015 13:46:54 access: access allowed ("java.util.PropertyPermission" "java.compiler" "read")
27-Oct-2015 13:46:54 java.lang.Exception: Stack trace
27-Oct-2015 13:46:54         at java.lang.Thread.dumpStack(Thread.java:1333)
27-Oct-2015 13:46:54         at java.security.AccessControlContext.checkPermission(AccessControlContext.java:415)
27-Oct-2015 13:46:54         at java.security.AccessController.checkPermission(AccessController.java:894)
27-Oct-2015 13:46:54         at java.lang.SecurityManager.checkPermission(SecurityManager.java:541)
27-Oct-2015 13:46:54         at java.lang.SecurityManager.checkPropertyAccess(SecurityManager.java:1285)
27-Oct-2015 13:46:54         at java.lang.System.getProperty(System.java:708)
27-Oct-2015 13:46:54         at com.carrotsearch.ant.tasks.junit4.events.BootstrapEvent.collectSystemProperties(BootstrapEvent.java:93)
27-Oct-2015 13:46:54         at com.carrotsearch.ant.tasks.junit4.events.BootstrapEvent.<init>(BootstrapEvent.java:68)
27-Oct-2015 13:46:54         at com.carrotsearch.ant.tasks.junit4.slave.SlaveMain.main(SlaveMain.java:337)
27-Oct-2015 13:46:54         at com.carrotsearch.ant.tasks.junit4.slave.SlaveMainSafe.main(SlaveMainSafe.java:10)
27-Oct-2015 13:46:54 policy: getPermissions:
27-Oct-2015 13:46:54         PD CodeSource: (file:/mnt/work/bamboo-home/xml-data/build-dir/RNDTEST-SOFTWARE-JDK19/junit4-ant/target/junit4-ant-2.2.0-SNAPSHOT.jar <no signer certificates>)
27-Oct-2015 13:46:54         PD ClassLoader: sun.misc.Launcher$AppClassLoader@5ccd43c2
27-Oct-2015 13:46:54         PD Principals: <no principals>
27-Oct-2015 13:46:54 policy: evaluate codesources:
27-Oct-2015 13:46:54         Policy CodeSource: (file:/mnt/work/bamboo-home/xml-data/build-dir/RNDTEST-SOFTWARE-JDK19/examples/security-manager/target/J0/$%7b%7bjava.ext.dirs%7d%7d/* <no signer certificates>)
27-Oct-2015 13:46:54         Active CodeSource: (file:/mnt/work/bamboo-home/xml-data/build-dir/RNDTEST-SOFTWARE-JDK19/junit4-ant/target/junit4-ant-2.2.0-SNAPSHOT.jar <no signer certificates>)
27-Oct-2015 13:46:54 policy: evaluation (codesource) failed
27-Oct-2015 13:46:54 policy: evaluate codesources:
27-Oct-2015 13:46:54         Policy CodeSource: (file:/mnt/work/bamboo-home/xml-data/build-dir/RNDTEST-SOFTWARE-JDK19/junit4-ant/target/junit4-ant-2.2.0-SNAPSHOT.jar <no signer certificates>)
27-Oct-2015 13:46:54         Active CodeSource: (file:/mnt/work/bamboo-home/xml-data/build-dir/RNDTEST-SOFTWARE-JDK19/junit4-ant/target/junit4-ant-2.2.0-SNAPSHOT.jar <no signer certificates>)
27-Oct-2015 13:46:54 policy: evaluate principals:
27-Oct-2015 13:46:54         Policy Principals: []
27-Oct-2015 13:46:54         Active Principals: []
27-Oct-2015 13:46:54 policy:   granting ("java.lang.RuntimePermission" "setIO")
27-Oct-2015 13:46:54 policy: evaluation (codesource/principals) passed
27-Oct-2015 13:46:54 policy: evaluate codesources:
27-Oct-2015 13:46:54         Policy CodeSource: (file:/mnt/work/bamboo-home/xml-data/build-dir/RNDTEST-SOFTWARE-JDK19/randomized-runner/target/randomizedtesting-runner-2.2.0-SNAPSHOT.jar <no signer certificates>)
27-Oct-2015 13:46:54         Active CodeSource: (file:/mnt/work/bamboo-home/xml-data/build-dir/RNDTEST-SOFTWARE-JDK19/junit4-ant/target/junit4-ant-2.2.0-SNAPSHOT.jar <no signer certificates>)
27-Oct-2015 13:46:54 policy: evaluation (codesource) failed
27-Oct-2015 13:46:54 policy: evaluate codesources:
27-Oct-2015 13:46:54         Policy CodeSource: (file:/mnt/work/bamboo-home/.m2/AGENT-1671170/repository/junit/junit/4.10/junit-4.10.jar <no signer certificates>)
27-Oct-2015 13:46:54         Active CodeSource: (file:/mnt/work/bamboo-home/xml-data/build-dir/RNDTEST-SOFTWARE-JDK19/junit4-ant/target/junit4-ant-2.2.0-SNAPSHOT.jar <no signer certificates>)
27-Oct-2015 13:46:54 policy: evaluation (codesource) failed
27-Oct-2015 13:46:54 policy: evaluate codesources:
27-Oct-2015 13:46:54         Policy CodeSource: (null <no signer certificates>)
27-Oct-2015 13:46:54         Active CodeSource: (file:/mnt/work/bamboo-home/xml-data/build-dir/RNDTEST-SOFTWARE-JDK19/junit4-ant/target/junit4-ant-2.2.0-SNAPSHOT.jar <no signer certificates>)
27-Oct-2015 13:46:54 policy: evaluate principals:
27-Oct-2015 13:46:54         Policy Principals: []
27-Oct-2015 13:46:54         Active Principals: []
27-Oct-2015 13:46:54 policy:   granting ("java.util.PropertyPermission" "*" "read")
27-Oct-2015 13:46:54 policy:   granting ("java.io.FilePermission" "<<ALL FILES>>" "read,write,execute,delete")
27-Oct-2015 13:46:54 policy: evaluation (codesource/principals) passed
27-Oct-2015 13:46:54 access: domain 0 ProtectionDomain  (file:/mnt/work/bamboo-home/xml-data/build-dir/RNDTEST-SOFTWARE-JDK19/junit4-ant/target/junit4-ant-2.2.0-SNAPSHOT.jar <no signer certificates>)
27-Oct-2015 13:46:54 sun.misc.Launcher$AppClassLoader@5ccd43c2
27-Oct-2015 13:46:54 <no principals>
27-Oct-2015 13:46:54 java.security.Permissions@548e7350 (
27-Oct-2015 13:46:54 ("java.lang.RuntimePermission" "exitVM")
27-Oct-2015 13:46:54 ("java.lang.RuntimePermission" "setIO")
27-Oct-2015 13:46:54 ("java.io.FilePermission" "<<ALL FILES>>" "read,write,execute,delete")
27-Oct-2015 13:46:54 ("java.io.FilePermission" "/mnt/work/bamboo-home/xml-data/build-dir/RNDTEST-SOFTWARE-JDK19/junit4-ant/target/junit4-ant-2.2.0-SNAPSHOT.jar" "read")
27-Oct-2015 13:46:54 ("java.util.PropertyPermission" "*" "read")
27-Oct-2015 13:46:54 )
27-Oct-2015 13:46:54
27-Oct-2015 13:46:54
27-Oct-2015 13:46:54 access: access allowed ("java.util.PropertyPermission" "java.ext.dirs" "read")
27-Oct-2015 13:46:54 java.lang.Exception: Stack trace
27-Oct-2015 13:46:54         at java.lang.Thread.dumpStack(Thread.java:1333)
27-Oct-2015 13:46:54         at java.security.AccessControlContext.checkPermission(AccessControlContext.java:415)
27-Oct-2015 13:46:54         at java.security.AccessController.checkPermission(AccessController.java:894)
27-Oct-2015 13:46:54         at java.lang.SecurityManager.checkPermission(SecurityManager.java:541)
27-Oct-2015 13:46:54         at java.lang.SecurityManager.checkPropertyAccess(SecurityManager.java:1285)
27-Oct-2015 13:46:54         at java.lang.System.getProperty(System.java:708)
27-Oct-2015 13:46:54         at com.carrotsearch.ant.tasks.junit4.events.BootstrapEvent.collectSystemProperties(BootstrapEvent.java:93)
27-Oct-2015 13:46:54         at com.carrotsearch.ant.tasks.junit4.events.BootstrapEvent.<init>(BootstrapEvent.java:68)
27-Oct-2015 13:46:54         at com.carrotsearch.ant.tasks.junit4.slave.SlaveMain.main(SlaveMain.java:337)
27-Oct-2015 13:46:54         at com.carrotsearch.ant.tasks.junit4.slave.SlaveMainSafe.main(SlaveMainSafe.java:10)
27-Oct-2015 13:46:54 policy: getPermissions:
27-Oct-2015 13:46:54         PD CodeSource: (file:/mnt/work/bamboo-home/xml-data/build-dir/RNDTEST-SOFTWARE-JDK19/junit4-ant/target/junit4-ant-2.2.0-SNAPSHOT.jar <no signer certificates>)
27-Oct-2015 13:46:54         PD ClassLoader: sun.misc.Launcher$AppClassLoader@5ccd43c2
27-Oct-2015 13:46:54         PD Principals: <no principals>
27-Oct-2015 13:46:54 policy: evaluate codesources:
27-Oct-2015 13:46:54         Policy CodeSource: (file:/mnt/work/bamboo-home/xml-data/build-dir/RNDTEST-SOFTWARE-JDK19/examples/security-manager/target/J0/$%7b%7bjava.ext.dirs%7d%7d/* <no signer certificates>)
27-Oct-2015 13:46:54         Active CodeSource: (file:/mnt/work/bamboo-home/xml-data/build-dir/RNDTEST-SOFTWARE-JDK19/junit4-ant/target/junit4-ant-2.2.0-SNAPSHOT.jar <no signer certificates>)
27-Oct-2015 13:46:54 policy: evaluation (codesource) failed
27-Oct-2015 13:46:54 policy: evaluate codesources:
27-Oct-2015 13:46:54         Policy CodeSource: (file:/mnt/work/bamboo-home/xml-data/build-dir/RNDTEST-SOFTWARE-JDK19/junit4-ant/target/junit4-ant-2.2.0-SNAPSHOT.jar <no signer certificates>)
27-Oct-2015 13:46:54         Active CodeSource: (file:/mnt/work/bamboo-home/xml-data/build-dir/RNDTEST-SOFTWARE-JDK19/junit4-ant/target/junit4-ant-2.2.0-SNAPSHOT.jar <no signer certificates>)
27-Oct-2015 13:46:54 policy: evaluate principals:
27-Oct-2015 13:46:54         Policy Principals: []
27-Oct-2015 13:46:54         Active Principals: []
27-Oct-2015 13:46:54 policy:   granting ("java.lang.RuntimePermission" "setIO")
27-Oct-2015 13:46:54 policy: evaluation (codesource/principals) passed
27-Oct-2015 13:46:54 policy: evaluate codesources:
27-Oct-2015 13:46:54         Policy CodeSource: (file:/mnt/work/bamboo-home/xml-data/build-dir/RNDTEST-SOFTWARE-JDK19/randomized-runner/target/randomizedtesting-runner-2.2.0-SNAPSHOT.jar <no signer certificates>)
27-Oct-2015 13:46:54         Active CodeSource: (file:/mnt/work/bamboo-home/xml-data/build-dir/RNDTEST-SOFTWARE-JDK19/junit4-ant/target/junit4-ant-2.2.0-SNAPSHOT.jar <no signer certificates>)
27-Oct-2015 13:46:54 policy: evaluation (codesource) failed
27-Oct-2015 13:46:54 policy: evaluate codesources:
27-Oct-2015 13:46:54         Policy CodeSource: (file:/mnt/work/bamboo-home/.m2/AGENT-1671170/repository/junit/junit/4.10/junit-4.10.jar <no signer certificates>)
27-Oct-2015 13:46:54         Active CodeSource: (file:/mnt/work/bamboo-home/xml-data/build-dir/RNDTEST-SOFTWARE-JDK19/junit4-ant/target/junit4-ant-2.2.0-SNAPSHOT.jar <no signer certificates>)
27-Oct-2015 13:46:54 policy: evaluation (codesource) failed
27-Oct-2015 13:46:54 policy: evaluate codesources:
27-Oct-2015 13:46:54         Policy CodeSource: (null <no signer certificates>)
27-Oct-2015 13:46:54         Active CodeSource: (file:/mnt/work/bamboo-home/xml-data/build-dir/RNDTEST-SOFTWARE-JDK19/junit4-ant/target/junit4-ant-2.2.0-SNAPSHOT.jar <no signer certificates>)
27-Oct-2015 13:46:54 policy: evaluate principals:
27-Oct-2015 13:46:54         Policy Principals: []
27-Oct-2015 13:46:54         Active Principals: []
27-Oct-2015 13:46:54 policy:   granting ("java.util.PropertyPermission" "*" "read")
27-Oct-2015 13:46:54 policy:   granting ("java.io.FilePermission" "<<ALL FILES>>" "read,write,execute,delete")
27-Oct-2015 13:46:54 policy: evaluation (codesource/principals) passed
27-Oct-2015 13:46:54 access: domain 0 ProtectionDomain  (file:/mnt/work/bamboo-home/xml-data/build-dir/RNDTEST-SOFTWARE-JDK19/junit4-ant/target/junit4-ant-2.2.0-SNAPSHOT.jar <no signer certificates>)
27-Oct-2015 13:46:54 sun.misc.Launcher$AppClassLoader@5ccd43c2
27-Oct-2015 13:46:54 <no principals>
27-Oct-2015 13:46:54 java.security.Permissions@4667ae56 (
27-Oct-2015 13:46:54 ("java.lang.RuntimePermission" "exitVM")
27-Oct-2015 13:46:54 ("java.lang.RuntimePermission" "setIO")
27-Oct-2015 13:46:54 ("java.io.FilePermission" "<<ALL FILES>>" "read,write,execute,delete")
27-Oct-2015 13:46:54 ("java.io.FilePermission" "/mnt/work/bamboo-home/xml-data/build-dir/RNDTEST-SOFTWARE-JDK19/junit4-ant/target/junit4-ant-2.2.0-SNAPSHOT.jar" "read")
27-Oct-2015 13:46:54 ("java.util.PropertyPermission" "*" "read")
27-Oct-2015 13:46:54 )
27-Oct-2015 13:46:54
27-Oct-2015 13:46:54
27-Oct-2015 13:46:54 access: access allowed ("java.util.PropertyPermission" "os.name" "read")
27-Oct-2015 13:46:54 java.lang.Exception: Stack trace
27-Oct-2015 13:46:54         at java.lang.Thread.dumpStack(Thread.java:1333)
27-Oct-2015 13:46:54         at java.security.AccessControlContext.checkPermission(AccessControlContext.java:415)
27-Oct-2015 13:46:54         at java.security.AccessController.checkPermission(AccessController.java:894)
27-Oct-2015 13:46:54         at java.lang.SecurityManager.checkPermission(SecurityManager.java:541)
27-Oct-2015 13:46:54         at java.lang.SecurityManager.checkPropertyAccess(SecurityManager.java:1285)
27-Oct-2015 13:46:54         at java.lang.System.getProperty(System.java:708)
27-Oct-2015 13:46:54         at com.carrotsearch.ant.tasks.junit4.events.BootstrapEvent.collectSystemProperties(BootstrapEvent.java:93)
27-Oct-2015 13:46:54         at com.carrotsearch.ant.tasks.junit4.events.BootstrapEvent.<init>(BootstrapEvent.java:68)
27-Oct-2015 13:46:54         at com.carrotsearch.ant.tasks.junit4.slave.SlaveMain.main(SlaveMain.java:337)
27-Oct-2015 13:46:54         at com.carrotsearch.ant.tasks.junit4.slave.SlaveMainSafe.main(SlaveMainSafe.java:10)
27-Oct-2015 13:46:54 policy: getPermissions:
27-Oct-2015 13:46:54         PD CodeSource: (file:/mnt/work/bamboo-home/xml-data/build-dir/RNDTEST-SOFTWARE-JDK19/junit4-ant/target/junit4-ant-2.2.0-SNAPSHOT.jar <no signer certificates>)
27-Oct-2015 13:46:54         PD ClassLoader: sun.misc.Launcher$AppClassLoader@5ccd43c2
27-Oct-2015 13:46:54         PD Principals: <no principals>
27-Oct-2015 13:46:54 policy: evaluate codesources:
27-Oct-2015 13:46:54         Policy CodeSource: (file:/mnt/work/bamboo-home/xml-data/build-dir/RNDTEST-SOFTWARE-JDK19/examples/security-manager/target/J0/$%7b%7bjava.ext.dirs%7d%7d/* <no signer certificates>)
27-Oct-2015 13:46:54         Active CodeSource: (file:/mnt/work/bamboo-home/xml-data/build-dir/RNDTEST-SOFTWARE-JDK19/junit4-ant/target/junit4-ant-2.2.0-SNAPSHOT.jar <no signer certificates>)
27-Oct-2015 13:46:54 policy: evaluation (codesource) failed
27-Oct-2015 13:46:54 policy: evaluate codesources:
27-Oct-2015 13:46:54         Policy CodeSource: (file:/mnt/work/bamboo-home/xml-data/build-dir/RNDTEST-SOFTWARE-JDK19/junit4-ant/target/junit4-ant-2.2.0-SNAPSHOT.jar <no signer certificates>)
27-Oct-2015 13:46:54         Active CodeSource: (file:/mnt/work/bamboo-home/xml-data/build-dir/RNDTEST-SOFTWARE-JDK19/junit4-ant/target/junit4-ant-2.2.0-SNAPSHOT.jar <no signer certificates>)
27-Oct-2015 13:46:54 policy: evaluate principals:
27-Oct-2015 13:46:54         Policy Principals: []
27-Oct-2015 13:46:54         Active Principals: []
27-Oct-2015 13:46:54 policy:   granting ("java.lang.RuntimePermission" "setIO")
27-Oct-2015 13:46:54 policy: evaluation (codesource/principals) passed
27-Oct-2015 13:46:54 policy: evaluate codesources:
27-Oct-2015 13:46:54         Policy CodeSource: (file:/mnt/work/bamboo-home/xml-data/build-dir/RNDTEST-SOFTWARE-JDK19/randomized-runner/target/randomizedtesting-runner-2.2.0-SNAPSHOT.jar <no signer certificates>)
27-Oct-2015 13:46:54         Active CodeSource: (file:/mnt/work/bamboo-home/xml-data/build-dir/RNDTEST-SOFTWARE-JDK19/junit4-ant/target/junit4-ant-2.2.0-SNAPSHOT.jar <no signer certificates>)
27-Oct-2015 13:46:54 policy: evaluation (codesource) failed
27-Oct-2015 13:46:54 policy: evaluate codesources:
27-Oct-2015 13:46:54         Policy CodeSource: (file:/mnt/work/bamboo-home/.m2/AGENT-1671170/repository/junit/junit/4.10/junit-4.10.jar <no signer certificates>)
27-Oct-2015 13:46:54         Active CodeSource: (file:/mnt/work/bamboo-home/xml-data/build-dir/RNDTEST-SOFTWARE-JDK19/junit4-ant/target/junit4-ant-2.2.0-SNAPSHOT.jar <no signer certificates>)
27-Oct-2015 13:46:54 policy: evaluation (codesource) failed
27-Oct-2015 13:46:54 policy: evaluate codesources:
27-Oct-2015 13:46:54         Policy CodeSource: (null <no signer certificates>)
27-Oct-2015 13:46:54         Active CodeSource: (file:/mnt/work/bamboo-home/xml-data/build-dir/RNDTEST-SOFTWARE-JDK19/junit4-ant/target/junit4-ant-2.2.0-SNAPSHOT.jar <no signer certificates>)
27-Oct-2015 13:46:54 policy: evaluate principals:
27-Oct-2015 13:46:54         Policy Principals: []
27-Oct-2015 13:46:54         Active Principals: []
27-Oct-2015 13:46:54 policy:   granting ("java.util.PropertyPermission" "*" "read")
27-Oct-2015 13:46:54 policy:   granting ("java.io.FilePermission" "<<ALL FILES>>" "read,write,execute,delete")
27-Oct-2015 13:46:54 policy: evaluation (codesource/principals) passed
27-Oct-2015 13:46:54 access: domain 0 ProtectionDomain  (file:/mnt/work/bamboo-home/xml-data/build-dir/RNDTEST-SOFTWARE-JDK19/junit4-ant/target/junit4-ant-2.2.0-SNAPSHOT.jar <no signer certificates>)
27-Oct-2015 13:46:54 sun.misc.Launcher$AppClassLoader@5ccd43c2
27-Oct-2015 13:46:54 <no principals>
27-Oct-2015 13:46:54 java.security.Permissions@204f30ec (
27-Oct-2015 13:46:54 ("java.lang.RuntimePermission" "exitVM")
27-Oct-2015 13:46:54 ("java.lang.RuntimePermission" "setIO")
27-Oct-2015 13:46:54 ("java.io.FilePermission" "<<ALL FILES>>" "read,write,execute,delete")
27-Oct-2015 13:46:54 ("java.io.FilePermission" "/mnt/work/bamboo-home/xml-data/build-dir/RNDTEST-SOFTWARE-JDK19/junit4-ant/target/junit4-ant-2.2.0-SNAPSHOT.jar" "read")
27-Oct-2015 13:46:54 ("java.util.PropertyPermission" "*" "read")
27-Oct-2015 13:46:54 )
27-Oct-2015 13:46:54
27-Oct-2015 13:46:54
27-Oct-2015 13:46:54 access: access allowed ("java.util.PropertyPermission" "os.arch" "read")
27-Oct-2015 13:46:54 java.lang.Exception: Stack trace
27-Oct-2015 13:46:54         at java.lang.Thread.dumpStack(Thread.java:1333)
27-Oct-2015 13:46:54         at java.security.AccessControlContext.checkPermission(AccessControlContext.java:415)
27-Oct-2015 13:46:54         at java.security.AccessController.checkPermission(AccessController.java:894)
27-Oct-2015 13:46:54         at java.lang.SecurityManager.checkPermission(SecurityManager.java:541)
27-Oct-2015 13:46:54         at java.lang.SecurityManager.checkPropertyAccess(SecurityManager.java:1285)
27-Oct-2015 13:46:54         at java.lang.System.getProperty(System.java:708)
27-Oct-2015 13:46:54         at com.carrotsearch.ant.tasks.junit4.events.BootstrapEvent.collectSystemProperties(BootstrapEvent.java:93)
27-Oct-2015 13:46:54         at com.carrotsearch.ant.tasks.junit4.events.BootstrapEvent.<init>(BootstrapEvent.java:68)
27-Oct-2015 13:46:54         at com.carrotsearch.ant.tasks.junit4.slave.SlaveMain.main(SlaveMain.java:337)
27-Oct-2015 13:46:54         at com.carrotsearch.ant.tasks.junit4.slave.SlaveMainSafe.main(SlaveMainSafe.java:10)
27-Oct-2015 13:46:54 policy: getPermissions:
27-Oct-2015 13:46:54         PD CodeSource: (file:/mnt/work/bamboo-home/xml-data/build-dir/RNDTEST-SOFTWARE-JDK19/junit4-ant/target/junit4-ant-2.2.0-SNAPSHOT.jar <no signer certificates>)
27-Oct-2015 13:46:54         PD ClassLoader: sun.misc.Launcher$AppClassLoader@5ccd43c2
27-Oct-2015 13:46:54         PD Principals: <no principals>
27-Oct-2015 13:46:54 policy: evaluate codesources:
27-Oct-2015 13:46:54         Policy CodeSource: (file:/mnt/work/bamboo-home/xml-data/build-dir/RNDTEST-SOFTWARE-JDK19/examples/security-manager/target/J0/$%7b%7bjava.ext.dirs%7d%7d/* <no signer certificates>)
27-Oct-2015 13:46:54         Active CodeSource: (file:/mnt/work/bamboo-home/xml-data/build-dir/RNDTEST-SOFTWARE-JDK19/junit4-ant/target/junit4-ant-2.2.0-SNAPSHOT.jar <no signer certificates>)
27-Oct-2015 13:46:54 policy: evaluation (codesource) failed
27-Oct-2015 13:46:54 policy: evaluate codesources:
27-Oct-2015 13:46:54         Policy CodeSource: (file:/mnt/work/bamboo-home/xml-data/build-dir/RNDTEST-SOFTWARE-JDK19/junit4-ant/target/junit4-ant-2.2.0-SNAPSHOT.jar <no signer certificates>)
27-Oct-2015 13:46:54         Active CodeSource: (file:/mnt/work/bamboo-home/xml-data/build-dir/RNDTEST-SOFTWARE-JDK19/junit4-ant/target/junit4-ant-2.2.0-SNAPSHOT.jar <no signer certificates>)
27-Oct-2015 13:46:54 policy: evaluate principals:
27-Oct-2015 13:46:54         Policy Principals: []
27-Oct-2015 13:46:54         Active Principals: []
27-Oct-2015 13:46:54 policy:   granting ("java.lang.RuntimePermission" "setIO")
27-Oct-2015 13:46:54 policy: evaluation (codesource/principals) passed
27-Oct-2015 13:46:54 policy: evaluate codesources:
27-Oct-2015 13:46:54         Policy CodeSource: (file:/mnt/work/bamboo-home/xml-data/build-dir/RNDTEST-SOFTWARE-JDK19/randomized-runner/target/randomizedtesting-runner-2.2.0-SNAPSHOT.jar <no signer certificates>)
27-Oct-2015 13:46:54         Active CodeSource: (file:/mnt/work/bamboo-home/xml-data/build-dir/RNDTEST-SOFTWARE-JDK19/junit4-ant/target/junit4-ant-2.2.0-SNAPSHOT.jar <no signer certificates>)
27-Oct-2015 13:46:54 policy: evaluation (codesource) failed
27-Oct-2015 13:46:54 policy: evaluate codesources:
27-Oct-2015 13:46:54         Policy CodeSource: (file:/mnt/work/bamboo-home/.m2/AGENT-1671170/repository/junit/junit/4.10/junit-4.10.jar <no signer certificates>)
27-Oct-2015 13:46:54         Active CodeSource: (file:/mnt/work/bamboo-home/xml-data/build-dir/RNDTEST-SOFTWARE-JDK19/junit4-ant/target/junit4-ant-2.2.0-SNAPSHOT.jar <no signer certificates>)
27-Oct-2015 13:46:54 policy: evaluation (codesource) failed
27-Oct-2015 13:46:54 policy: evaluate codesources:
27-Oct-2015 13:46:54         Policy CodeSource: (null <no signer certificates>)
27-Oct-2015 13:46:54         Active CodeSource: (file:/mnt/work/bamboo-home/xml-data/build-dir/RNDTEST-SOFTWARE-JDK19/junit4-ant/target/junit4-ant-2.2.0-SNAPSHOT.jar <no signer certificates>)
27-Oct-2015 13:46:54 policy: evaluate principals:
27-Oct-2015 13:46:54         Policy Principals: []
27-Oct-2015 13:46:54         Active Principals: []
27-Oct-2015 13:46:54 policy:   granting ("java.util.PropertyPermission" "*" "read")
27-Oct-2015 13:46:54 policy:   granting ("java.io.FilePermission" "<<ALL FILES>>" "read,write,execute,delete")
27-Oct-2015 13:46:54 policy: evaluation (codesource/principals) passed
27-Oct-2015 13:46:54 access: domain 0 ProtectionDomain  (file:/mnt/work/bamboo-home/xml-data/build-dir/RNDTEST-SOFTWARE-JDK19/junit4-ant/target/junit4-ant-2.2.0-SNAPSHOT.jar <no signer certificates>)
27-Oct-2015 13:46:54 sun.misc.Launcher$AppClassLoader@5ccd43c2
27-Oct-2015 13:46:54 <no principals>
27-Oct-2015 13:46:54 java.security.Permissions@754ba872 (
27-Oct-2015 13:46:54 ("java.lang.RuntimePermission" "exitVM")
27-Oct-2015 13:46:54 ("java.lang.RuntimePermission" "setIO")
27-Oct-2015 13:46:54 ("java.io.FilePermission" "<<ALL FILES>>" "read,write,execute,delete")
27-Oct-2015 13:46:54 ("java.io.FilePermission" "/mnt/work/bamboo-home/xml-data/build-dir/RNDTEST-SOFTWARE-JDK19/junit4-ant/target/junit4-ant-2.2.0-SNAPSHOT.jar" "read")
27-Oct-2015 13:46:54 ("java.util.PropertyPermission" "*" "read")
27-Oct-2015 13:46:54 )
27-Oct-2015 13:46:54
27-Oct-2015 13:46:54
27-Oct-2015 13:46:54 access: access allowed ("java.util.PropertyPermission" "os.version" "read")
27-Oct-2015 13:46:54 java.lang.Exception: Stack trace
27-Oct-2015 13:46:54         at java.lang.Thread.dumpStack(Thread.java:1333)
27-Oct-2015 13:46:54         at java.security.AccessControlContext.checkPermission(AccessControlContext.java:415)
27-Oct-2015 13:46:54         at java.security.AccessController.checkPermission(AccessController.java:894)
27-Oct-2015 13:46:54         at java.lang.SecurityManager.checkPermission(SecurityManager.java:541)
27-Oct-2015 13:46:54         at java.lang.SecurityManager.checkPropertyAccess(SecurityManager.java:1285)
27-Oct-2015 13:46:54         at java.lang.System.getProperty(System.java:708)
27-Oct-2015 13:46:54         at com.carrotsearch.ant.tasks.junit4.events.BootstrapEvent.collectSystemProperties(BootstrapEvent.java:93)
27-Oct-2015 13:46:54         at com.carrotsearch.ant.tasks.junit4.events.BootstrapEvent.<init>(BootstrapEvent.java:68)
27-Oct-2015 13:46:54         at com.carrotsearch.ant.tasks.junit4.slave.SlaveMain.main(SlaveMain.java:337)
27-Oct-2015 13:46:54         at com.carrotsearch.ant.tasks.junit4.slave.SlaveMainSafe.main(SlaveMainSafe.java:10)
27-Oct-2015 13:46:54 policy: getPermissions:
27-Oct-2015 13:46:54         PD CodeSource: (file:/mnt/work/bamboo-home/xml-data/build-dir/RNDTEST-SOFTWARE-JDK19/junit4-ant/target/junit4-ant-2.2.0-SNAPSHOT.jar <no signer certificates>)
27-Oct-2015 13:46:54         PD ClassLoader: sun.misc.Launcher$AppClassLoader@5ccd43c2
27-Oct-2015 13:46:54         PD Principals: <no principals>
27-Oct-2015 13:46:54 policy: evaluate codesources:
27-Oct-2015 13:46:54         Policy CodeSource: (file:/mnt/work/bamboo-home/xml-data/build-dir/RNDTEST-SOFTWARE-JDK19/examples/security-manager/target/J0/$%7b%7bjava.ext.dirs%7d%7d/* <no signer certificates>)
27-Oct-2015 13:46:54         Active CodeSource: (file:/mnt/work/bamboo-home/xml-data/build-dir/RNDTEST-SOFTWARE-JDK19/junit4-ant/target/junit4-ant-2.2.0-SNAPSHOT.jar <no signer certificates>)
27-Oct-2015 13:46:54 policy: evaluation (codesource) failed
27-Oct-2015 13:46:54 policy: evaluate codesources:
27-Oct-2015 13:46:54         Policy CodeSource: (file:/mnt/work/bamboo-home/xml-data/build-dir/RNDTEST-SOFTWARE-JDK19/junit4-ant/target/junit4-ant-2.2.0-SNAPSHOT.jar <no signer certificates>)
27-Oct-2015 13:46:54         Active CodeSource: (file:/mnt/work/bamboo-home/xml-data/build-dir/RNDTEST-SOFTWARE-JDK19/junit4-ant/target/junit4-ant-2.2.0-SNAPSHOT.jar <no signer certificates>)
27-Oct-2015 13:46:54 policy: evaluate principals:
27-Oct-2015 13:46:54         Policy Principals: []
27-Oct-2015 13:46:54         Active Principals: []
27-Oct-2015 13:46:54 policy:   granting ("java.lang.RuntimePermission" "setIO")
27-Oct-2015 13:46:54 policy: evaluation (codesource/principals) passed
27-Oct-2015 13:46:54 policy: evaluate codesources:
27-Oct-2015 13:46:54         Policy CodeSource: (file:/mnt/work/bamboo-home/xml-data/build-dir/RNDTEST-SOFTWARE-JDK19/randomized-runner/target/randomizedtesting-runner-2.2.0-SNAPSHOT.jar <no signer certificates>)
27-Oct-2015 13:46:54         Active CodeSource: (file:/mnt/work/bamboo-home/xml-data/build-dir/RNDTEST-SOFTWARE-JDK19/junit4-ant/target/junit4-ant-2.2.0-SNAPSHOT.jar <no signer certificates>)
27-Oct-2015 13:46:54 policy: evaluation (codesource) failed
27-Oct-2015 13:46:54 policy: evaluate codesources:
27-Oct-2015 13:46:54         Policy CodeSource: (file:/mnt/work/bamboo-home/.m2/AGENT-1671170/repository/junit/junit/4.10/junit-4.10.jar <no signer certificates>)
27-Oct-2015 13:46:54         Active CodeSource: (file:/mnt/work/bamboo-home/xml-data/build-dir/RNDTEST-SOFTWARE-JDK19/junit4-ant/target/junit4-ant-2.2.0-SNAPSHOT.jar <no signer certificates>)
27-Oct-2015 13:46:54 policy: evaluation (codesource) failed
27-Oct-2015 13:46:54 policy: evaluate codesources:
27-Oct-2015 13:46:54         Policy CodeSource: (null <no signer certificates>)
27-Oct-2015 13:46:54         Active CodeSource: (file:/mnt/work/bamboo-home/xml-data/build-dir/RNDTEST-SOFTWARE-JDK19/junit4-ant/target/junit4-ant-2.2.0-SNAPSHOT.jar <no signer certificates>)
27-Oct-2015 13:46:54 policy: evaluate principals:
27-Oct-2015 13:46:54         Policy Principals: []
27-Oct-2015 13:46:54         Active Principals: []
27-Oct-2015 13:46:54 policy:   granting ("java.util.PropertyPermission" "*" "read")
27-Oct-2015 13:46:54 policy:   granting ("java.io.FilePermission" "<<ALL FILES>>" "read,write,execute,delete")
27-Oct-2015 13:46:54 policy: evaluation (codesource/principals) passed
27-Oct-2015 13:46:54 access: domain 0 ProtectionDomain  (file:/mnt/work/bamboo-home/xml-data/build-dir/RNDTEST-SOFTWARE-JDK19/junit4-ant/target/junit4-ant-2.2.0-SNAPSHOT.jar <no signer certificates>)
27-Oct-2015 13:46:54 sun.misc.Launcher$AppClassLoader@5ccd43c2
27-Oct-2015 13:46:54 <no principals>
27-Oct-2015 13:46:54 java.security.Permissions@4dfa3a9d (
27-Oct-2015 13:46:54 ("java.lang.RuntimePermission" "exitVM")
27-Oct-2015 13:46:54 ("java.lang.RuntimePermission" "setIO")
27-Oct-2015 13:46:54 ("java.io.FilePermission" "<<ALL FILES>>" "read,write,execute,delete")
27-Oct-2015 13:46:54 ("java.io.FilePermission" "/mnt/work/bamboo-home/xml-data/build-dir/RNDTEST-SOFTWARE-JDK19/junit4-ant/target/junit4-ant-2.2.0-SNAPSHOT.jar" "read")
27-Oct-2015 13:46:54 ("java.util.PropertyPermission" "*" "read")
27-Oct-2015 13:46:54 )
27-Oct-2015 13:46:54
27-Oct-2015 13:46:54
27-Oct-2015 13:46:54 access: access allowed ("java.util.PropertyPermission" "file.separator" "read")
27-Oct-2015 13:46:54 java.lang.Exception: Stack trace
27-Oct-2015 13:46:54         at java.lang.Thread.dumpStack(Thread.java:1333)
27-Oct-2015 13:46:54         at java.security.AccessControlContext.checkPermission(AccessControlContext.java:415)
27-Oct-2015 13:46:54         at java.security.AccessController.checkPermission(AccessController.java:894)
27-Oct-2015 13:46:54         at java.lang.SecurityManager.checkPermission(SecurityManager.java:541)
27-Oct-2015 13:46:54         at java.lang.SecurityManager.checkPropertyAccess(SecurityManager.java:1285)
27-Oct-2015 13:46:54         at java.lang.System.getProperty(System.java:708)
27-Oct-2015 13:46:54         at com.carrotsearch.ant.tasks.junit4.events.BootstrapEvent.collectSystemProperties(BootstrapEvent.java:93)
27-Oct-2015 13:46:54         at com.carrotsearch.ant.tasks.junit4.events.BootstrapEvent.<init>(BootstrapEvent.java:68)
27-Oct-2015 13:46:54         at com.carrotsearch.ant.tasks.junit4.slave.SlaveMain.main(SlaveMain.java:337)
27-Oct-2015 13:46:54         at com.carrotsearch.ant.tasks.junit4.slave.SlaveMainSafe.main(SlaveMainSafe.java:10)
27-Oct-2015 13:46:54 policy: getPermissions:
27-Oct-2015 13:46:54         PD CodeSource: (file:/mnt/work/bamboo-home/xml-data/build-dir/RNDTEST-SOFTWARE-JDK19/junit4-ant/target/junit4-ant-2.2.0-SNAPSHOT.jar <no signer certificates>)
27-Oct-2015 13:46:54         PD ClassLoader: sun.misc.Launcher$AppClassLoader@5ccd43c2
27-Oct-2015 13:46:54         PD Principals: <no principals>
27-Oct-2015 13:46:54 policy: evaluate codesources:
27-Oct-2015 13:46:54         Policy CodeSource: (file:/mnt/work/bamboo-home/xml-data/build-dir/RNDTEST-SOFTWARE-JDK19/examples/security-manager/target/J0/$%7b%7bjava.ext.dirs%7d%7d/* <no signer certificates>)
27-Oct-2015 13:46:54         Active CodeSource: (file:/mnt/work/bamboo-home/xml-data/build-dir/RNDTEST-SOFTWARE-JDK19/junit4-ant/target/junit4-ant-2.2.0-SNAPSHOT.jar <no signer certificates>)
27-Oct-2015 13:46:54 policy: evaluation (codesource) failed
27-Oct-2015 13:46:54 policy: evaluate codesources:
27-Oct-2015 13:46:54         Policy CodeSource: (file:/mnt/work/bamboo-home/xml-data/build-dir/RNDTEST-SOFTWARE-JDK19/junit4-ant/target/junit4-ant-2.2.0-SNAPSHOT.jar <no signer certificates>)
27-Oct-2015 13:46:54         Active CodeSource: (file:/mnt/work/bamboo-home/xml-data/build-dir/RNDTEST-SOFTWARE-JDK19/junit4-ant/target/junit4-ant-2.2.0-SNAPSHOT.jar <no signer certificates>)
27-Oct-2015 13:46:54 policy: evaluate principals:
27-Oct-2015 13:46:54         Policy Principals: []
27-Oct-2015 13:46:54         Active Principals: []
27-Oct-2015 13:46:54 policy:   granting ("java.lang.RuntimePermission" "setIO")
27-Oct-2015 13:46:54 policy: evaluation (codesource/principals) passed
27-Oct-2015 13:46:54 policy: evaluate codesources:
27-Oct-2015 13:46:54         Policy CodeSource: (file:/mnt/work/bamboo-home/xml-data/build-dir/RNDTEST-SOFTWARE-JDK19/randomized-runner/target/randomizedtesting-runner-2.2.0-SNAPSHOT.jar <no signer certificates>)
27-Oct-2015 13:46:54         Active CodeSource: (file:/mnt/work/bamboo-home/xml-data/build-dir/RNDTEST-SOFTWARE-JDK19/junit4-ant/target/junit4-ant-2.2.0-SNAPSHOT.jar <no signer certificates>)
27-Oct-2015 13:46:54 policy: evaluation (codesource) failed
27-Oct-2015 13:46:54 policy: evaluate codesources:
27-Oct-2015 13:46:54         Policy CodeSource: (file:/mnt/work/bamboo-home/.m2/AGENT-1671170/repository/junit/junit/4.10/junit-4.10.jar <no signer certificates>)
27-Oct-2015 13:46:54         Active CodeSource: (file:/mnt/work/bamboo-home/xml-data/build-dir/RNDTEST-SOFTWARE-JDK19/junit4-ant/target/junit4-ant-2.2.0-SNAPSHOT.jar <no signer certificates>)
27-Oct-2015 13:46:54 policy: evaluation (codesource) failed
27-Oct-2015 13:46:54 policy: evaluate codesources:
27-Oct-2015 13:46:54         Policy CodeSource: (null <no signer certificates>)
27-Oct-2015 13:46:54         Active CodeSource: (file:/mnt/work/bamboo-home/xml-data/build-dir/RNDTEST-SOFTWARE-JDK19/junit4-ant/target/junit4-ant-2.2.0-SNAPSHOT.jar <no signer certificates>)
27-Oct-2015 13:46:54 policy: evaluate principals:
27-Oct-2015 13:46:54         Policy Principals: []
27-Oct-2015 13:46:54         Active Principals: []
27-Oct-2015 13:46:54 policy:   granting ("java.util.PropertyPermission" "*" "read")
27-Oct-2015 13:46:54 policy:   granting ("java.io.FilePermission" "<<ALL FILES>>" "read,write,execute,delete")
27-Oct-2015 13:46:54 policy: evaluation (codesource/principals) passed
27-Oct-2015 13:46:54 access: domain 0 ProtectionDomain  (file:/mnt/work/bamboo-home/xml-data/build-dir/RNDTEST-SOFTWARE-JDK19/junit4-ant/target/junit4-ant-2.2.0-SNAPSHOT.jar <no signer certificates>)
27-Oct-2015 13:46:54 sun.misc.Launcher$AppClassLoader@5ccd43c2
27-Oct-2015 13:46:54 <no principals>
27-Oct-2015 13:46:54 java.security.Permissions@464bee09 (
27-Oct-2015 13:46:54 ("java.lang.RuntimePermission" "exitVM")
27-Oct-2015 13:46:54 ("java.lang.RuntimePermission" "setIO")
27-Oct-2015 13:46:54 ("java.io.FilePermission" "<<ALL FILES>>" "read,write,execute,delete")
27-Oct-2015 13:46:54 ("java.io.FilePermission" "/mnt/work/bamboo-home/xml-data/build-dir/RNDTEST-SOFTWARE-JDK19/junit4-ant/target/junit4-ant-2.2.0-SNAPSHOT.jar" "read")
27-Oct-2015 13:46:54 ("java.util.PropertyPermission" "*" "read")
27-Oct-2015 13:46:54 )
27-Oct-2015 13:46:54
27-Oct-2015 13:46:54
27-Oct-2015 13:46:54 access: access allowed ("java.util.PropertyPermission" "path.separator" "read")
27-Oct-2015 13:46:54 java.lang.Exception: Stack trace
27-Oct-2015 13:46:54         at java.lang.Thread.dumpStack(Thread.java:1333)
27-Oct-2015 13:46:54         at java.security.AccessControlContext.checkPermission(AccessControlContext.java:415)
27-Oct-2015 13:46:54         at java.security.AccessController.checkPermission(AccessController.java:894)
27-Oct-2015 13:46:54         at java.lang.SecurityManager.checkPermission(SecurityManager.java:541)
27-Oct-2015 13:46:54         at java.lang.SecurityManager.checkPropertyAccess(SecurityManager.java:1285)
27-Oct-2015 13:46:54         at java.lang.System.getProperty(System.java:708)
27-Oct-2015 13:46:54         at com.carrotsearch.ant.tasks.junit4.events.BootstrapEvent.collectSystemProperties(BootstrapEvent.java:93)
27-Oct-2015 13:46:54         at com.carrotsearch.ant.tasks.junit4.events.BootstrapEvent.<init>(BootstrapEvent.java:68)
27-Oct-2015 13:46:54         at com.carrotsearch.ant.tasks.junit4.slave.SlaveMain.main(SlaveMain.java:337)
27-Oct-2015 13:46:54         at com.carrotsearch.ant.tasks.junit4.slave.SlaveMainSafe.main(SlaveMainSafe.java:10)
27-Oct-2015 13:46:54 policy: getPermissions:
27-Oct-2015 13:46:54         PD CodeSource: (file:/mnt/work/bamboo-home/xml-data/build-dir/RNDTEST-SOFTWARE-JDK19/junit4-ant/target/junit4-ant-2.2.0-SNAPSHOT.jar <no signer certificates>)
27-Oct-2015 13:46:54         PD ClassLoader: sun.misc.Launcher$AppClassLoader@5ccd43c2
27-Oct-2015 13:46:54         PD Principals: <no principals>
27-Oct-2015 13:46:54 policy: evaluate codesources:
27-Oct-2015 13:46:54         Policy CodeSource: (file:/mnt/work/bamboo-home/xml-data/build-dir/RNDTEST-SOFTWARE-JDK19/examples/security-manager/target/J0/$%7b%7bjava.ext.dirs%7d%7d/* <no signer certificates>)
27-Oct-2015 13:46:54         Active CodeSource: (file:/mnt/work/bamboo-home/xml-data/build-dir/RNDTEST-SOFTWARE-JDK19/junit4-ant/target/junit4-ant-2.2.0-SNAPSHOT.jar <no signer certificates>)
27-Oct-2015 13:46:54 policy: evaluation (codesource) failed
27-Oct-2015 13:46:54 policy: evaluate codesources:
27-Oct-2015 13:46:54         Policy CodeSource: (file:/mnt/work/bamboo-home/xml-data/build-dir/RNDTEST-SOFTWARE-JDK19/junit4-ant/target/junit4-ant-2.2.0-SNAPSHOT.jar <no signer certificates>)
27-Oct-2015 13:46:54         Active CodeSource: (file:/mnt/work/bamboo-home/xml-data/build-dir/RNDTEST-SOFTWARE-JDK19/junit4-ant/target/junit4-ant-2.2.0-SNAPSHOT.jar <no signer certificates>)
27-Oct-2015 13:46:54 policy: evaluate principals:
27-Oct-2015 13:46:54         Policy Principals: []
27-Oct-2015 13:46:54         Active Principals: []
27-Oct-2015 13:46:54 policy:   granting ("java.lang.RuntimePermission" "setIO")
27-Oct-2015 13:46:54 policy: evaluation (codesource/principals) passed
27-Oct-2015 13:46:54 policy: evaluate codesources:
27-Oct-2015 13:46:54         Policy CodeSource: (file:/mnt/work/bamboo-home/xml-data/build-dir/RNDTEST-SOFTWARE-JDK19/randomized-runner/target/randomizedtesting-runner-2.2.0-SNAPSHOT.jar <no signer certificates>)
27-Oct-2015 13:46:54         Active CodeSource: (file:/mnt/work/bamboo-home/xml-data/build-dir/RNDTEST-SOFTWARE-JDK19/junit4-ant/target/junit4-ant-2.2.0-SNAPSHOT.jar <no signer certificates>)
27-Oct-2015 13:46:54 policy: evaluation (codesource) failed
27-Oct-2015 13:46:54 policy: evaluate codesources:
27-Oct-2015 13:46:54         Policy CodeSource: (file:/mnt/work/bamboo-home/.m2/AGENT-1671170/repository/junit/junit/4.10/junit-4.10.jar <no signer certificates>)
27-Oct-2015 13:46:54         Active CodeSource: (file:/mnt/work/bamboo-home/xml-data/build-dir/RNDTEST-SOFTWARE-JDK19/junit4-ant/target/junit4-ant-2.2.0-SNAPSHOT.jar <no signer certificates>)
27-Oct-2015 13:46:54 policy: evaluation (codesource) failed
27-Oct-2015 13:46:54 policy: evaluate codesources:
27-Oct-2015 13:46:54         Policy CodeSource: (null <no signer certificates>)
27-Oct-2015 13:46:54         Active CodeSource: (file:/mnt/work/bamboo-home/xml-data/build-dir/RNDTEST-SOFTWARE-JDK19/junit4-ant/target/junit4-ant-2.2.0-SNAPSHOT.jar <no signer certificates>)
27-Oct-2015 13:46:54 policy: evaluate principals:
27-Oct-2015 13:46:54         Policy Principals: []
27-Oct-2015 13:46:54         Active Principals: []
27-Oct-2015 13:46:54 policy:   granting ("java.util.PropertyPermission" "*" "read")
27-Oct-2015 13:46:54 policy:   granting ("java.io.FilePermission" "<<ALL FILES>>" "read,write,execute,delete")
27-Oct-2015 13:46:54 policy: evaluation (codesource/principals) passed
27-Oct-2015 13:46:54 access: domain 0 ProtectionDomain  (file:/mnt/work/bamboo-home/xml-data/build-dir/RNDTEST-SOFTWARE-JDK19/junit4-ant/target/junit4-ant-2.2.0-SNAPSHOT.jar <no signer certificates>)
27-Oct-2015 13:46:54 sun.misc.Launcher$AppClassLoader@5ccd43c2
27-Oct-2015 13:46:54 <no principals>
27-Oct-2015 13:46:54 java.security.Permissions@13deb50e (
27-Oct-2015 13:46:54 ("java.lang.RuntimePermission" "exitVM")
27-Oct-2015 13:46:54 ("java.lang.RuntimePermission" "setIO")
27-Oct-2015 13:46:54 ("java.io.FilePermission" "<<ALL FILES>>" "read,write,execute,delete")
27-Oct-2015 13:46:54 ("java.io.FilePermission" "/mnt/work/bamboo-home/xml-data/build-dir/RNDTEST-SOFTWARE-JDK19/junit4-ant/target/junit4-ant-2.2.0-SNAPSHOT.jar" "read")
27-Oct-2015 13:46:54 ("java.util.PropertyPermission" "*" "read")
27-Oct-2015 13:46:54 )
27-Oct-2015 13:46:54
27-Oct-2015 13:46:54
27-Oct-2015 13:46:54 access: access allowed ("java.util.PropertyPermission" "line.separator" "read")
27-Oct-2015 13:46:54 java.lang.Exception: Stack trace
27-Oct-2015 13:46:54         at java.lang.Thread.dumpStack(Thread.java:1333)
27-Oct-2015 13:46:54         at java.security.AccessControlContext.checkPermission(AccessControlContext.java:415)
27-Oct-2015 13:46:54         at java.security.AccessController.checkPermission(AccessController.java:894)
27-Oct-2015 13:46:54         at java.lang.SecurityManager.checkPermission(SecurityManager.java:541)
27-Oct-2015 13:46:54         at java.lang.SecurityManager.checkPropertyAccess(SecurityManager.java:1285)
27-Oct-2015 13:46:54         at java.lang.System.getProperty(System.java:708)
27-Oct-2015 13:46:54         at com.carrotsearch.ant.tasks.junit4.events.BootstrapEvent.collectSystemProperties(BootstrapEvent.java:93)
27-Oct-2015 13:46:54         at com.carrotsearch.ant.tasks.junit4.events.BootstrapEvent.<init>(BootstrapEvent.java:68)
27-Oct-2015 13:46:54         at com.carrotsearch.ant.tasks.junit4.slave.SlaveMain.main(SlaveMain.java:337)
27-Oct-2015 13:46:54         at com.carrotsearch.ant.tasks.junit4.slave.SlaveMainSafe.main(SlaveMainSafe.java:10)
27-Oct-2015 13:46:54 policy: getPermissions:
27-Oct-2015 13:46:54         PD CodeSource: (file:/mnt/work/bamboo-home/xml-data/build-dir/RNDTEST-SOFTWARE-JDK19/junit4-ant/target/junit4-ant-2.2.0-SNAPSHOT.jar <no signer certificates>)
27-Oct-2015 13:46:54         PD ClassLoader: sun.misc.Launcher$AppClassLoader@5ccd43c2
27-Oct-2015 13:46:54         PD Principals: <no principals>
27-Oct-2015 13:46:54 policy: evaluate codesources:
27-Oct-2015 13:46:54         Policy CodeSource: (file:/mnt/work/bamboo-home/xml-data/build-dir/RNDTEST-SOFTWARE-JDK19/examples/security-manager/target/J0/$%7b%7bjava.ext.dirs%7d%7d/* <no signer certificates>)
27-Oct-2015 13:46:54         Active CodeSource: (file:/mnt/work/bamboo-home/xml-data/build-dir/RNDTEST-SOFTWARE-JDK19/junit4-ant/target/junit4-ant-2.2.0-SNAPSHOT.jar <no signer certificates>)
27-Oct-2015 13:46:54 policy: evaluation (codesource) failed
27-Oct-2015 13:46:54 policy: evaluate codesources:
27-Oct-2015 13:46:54         Policy CodeSource: (file:/mnt/work/bamboo-home/xml-data/build-dir/RNDTEST-SOFTWARE-JDK19/junit4-ant/target/junit4-ant-2.2.0-SNAPSHOT.jar <no signer certificates>)
27-Oct-2015 13:46:54         Active CodeSource: (file:/mnt/work/bamboo-home/xml-data/build-dir/RNDTEST-SOFTWARE-JDK19/junit4-ant/target/junit4-ant-2.2.0-SNAPSHOT.jar <no signer certificates>)
27-Oct-2015 13:46:54 policy: evaluate principals:
27-Oct-2015 13:46:54         Policy Principals: []
27-Oct-2015 13:46:54         Active Principals: []
27-Oct-2015 13:46:54 policy:   granting ("java.lang.RuntimePermission" "setIO")
27-Oct-2015 13:46:54 policy: evaluation (codesource/principals) passed
27-Oct-2015 13:46:54 policy: evaluate codesources:
27-Oct-2015 13:46:54         Policy CodeSource: (file:/mnt/work/bamboo-home/xml-data/build-dir/RNDTEST-SOFTWARE-JDK19/randomized-runner/target/randomizedtesting-runner-2.2.0-SNAPSHOT.jar <no signer certificates>)
27-Oct-2015 13:46:54         Active CodeSource: (file:/mnt/work/bamboo-home/xml-data/build-dir/RNDTEST-SOFTWARE-JDK19/junit4-ant/target/junit4-ant-2.2.0-SNAPSHOT.jar <no signer certificates>)
27-Oct-2015 13:46:54 policy: evaluation (codesource) failed
27-Oct-2015 13:46:54 policy: evaluate codesources:
27-Oct-2015 13:46:54         Policy CodeSource: (file:/mnt/work/bamboo-home/.m2/AGENT-1671170/repository/junit/junit/4.10/junit-4.10.jar <no signer certificates>)
27-Oct-2015 13:46:54         Active CodeSource: (file:/mnt/work/bamboo-home/xml-data/build-dir/RNDTEST-SOFTWARE-JDK19/junit4-ant/target/junit4-ant-2.2.0-SNAPSHOT.jar <no signer certificates>)
27-Oct-2015 13:46:54 policy: evaluation (codesource) failed
27-Oct-2015 13:46:54 policy: evaluate codesources:
27-Oct-2015 13:46:54         Policy CodeSource: (null <no signer certificates>)
27-Oct-2015 13:46:54         Active CodeSource: (file:/mnt/work/bamboo-home/xml-data/build-dir/RNDTEST-SOFTWARE-JDK19/junit4-ant/target/junit4-ant-2.2.0-SNAPSHOT.jar <no signer certificates>)
27-Oct-2015 13:46:54 policy: evaluate principals:
27-Oct-2015 13:46:54         Policy Principals: []
27-Oct-2015 13:46:54         Active Principals: []
27-Oct-2015 13:46:54 policy:   granting ("java.util.PropertyPermission" "*" "read")
27-Oct-2015 13:46:54 policy:   granting ("java.io.FilePermission" "<<ALL FILES>>" "read,write,execute,delete")
27-Oct-2015 13:46:54 policy: evaluation (codesource/principals) passed
27-Oct-2015 13:46:54 access: domain 0 ProtectionDomain  (file:/mnt/work/bamboo-home/xml-data/build-dir/RNDTEST-SOFTWARE-JDK19/junit4-ant/target/junit4-ant-2.2.0-SNAPSHOT.jar <no signer certificates>)
27-Oct-2015 13:46:54 sun.misc.Launcher$AppClassLoader@5ccd43c2
27-Oct-2015 13:46:54 <no principals>
27-Oct-2015 13:46:54 java.security.Permissions@3abbfa04 (
27-Oct-2015 13:46:54 ("java.lang.RuntimePermission" "exitVM")
27-Oct-2015 13:46:54 ("java.lang.RuntimePermission" "setIO")
27-Oct-2015 13:46:54 ("java.io.FilePermission" "<<ALL FILES>>" "read,write,execute,delete")
27-Oct-2015 13:46:54 ("java.io.FilePermission" "/mnt/work/bamboo-home/xml-data/build-dir/RNDTEST-SOFTWARE-JDK19/junit4-ant/target/junit4-ant-2.2.0-SNAPSHOT.jar" "read")
27-Oct-2015 13:46:54 ("java.util.PropertyPermission" "*" "read")
27-Oct-2015 13:46:54 )
27-Oct-2015 13:46:54
27-Oct-2015 13:46:54
27-Oct-2015 13:46:54 access: access allowed ("java.util.PropertyPermission" "user.name" "read")
27-Oct-2015 13:46:54 java.lang.Exception: Stack trace
27-Oct-2015 13:46:54         at java.lang.Thread.dumpStack(Thread.java:1333)
27-Oct-2015 13:46:54         at java.security.AccessControlContext.checkPermission(AccessControlContext.java:415)
27-Oct-2015 13:46:54         at java.security.AccessController.checkPermission(AccessController.java:894)
27-Oct-2015 13:46:54         at java.lang.SecurityManager.checkPermission(SecurityManager.java:541)
27-Oct-2015 13:46:54         at java.lang.SecurityManager.checkPropertyAccess(SecurityManager.java:1285)
27-Oct-2015 13:46:54         at java.lang.System.getProperty(System.java:708)
27-Oct-2015 13:46:54         at com.carrotsearch.ant.tasks.junit4.events.BootstrapEvent.collectSystemProperties(BootstrapEvent.java:93)
27-Oct-2015 13:46:54         at com.carrotsearch.ant.tasks.junit4.events.BootstrapEvent.<init>(BootstrapEvent.java:68)
27-Oct-2015 13:46:54         at com.carrotsearch.ant.tasks.junit4.slave.SlaveMain.main(SlaveMain.java:337)
27-Oct-2015 13:46:54         at com.carrotsearch.ant.tasks.junit4.slave.SlaveMainSafe.main(SlaveMainSafe.java:10)
27-Oct-2015 13:46:54 policy: getPermissions:
27-Oct-2015 13:46:54         PD CodeSource: (file:/mnt/work/bamboo-home/xml-data/build-dir/RNDTEST-SOFTWARE-JDK19/junit4-ant/target/junit4-ant-2.2.0-SNAPSHOT.jar <no signer certificates>)
27-Oct-2015 13:46:54         PD ClassLoader: sun.misc.Launcher$AppClassLoader@5ccd43c2
27-Oct-2015 13:46:54         PD Principals: <no principals>
27-Oct-2015 13:46:54 policy: evaluate codesources:
27-Oct-2015 13:46:54         Policy CodeSource: (file:/mnt/work/bamboo-home/xml-data/build-dir/RNDTEST-SOFTWARE-JDK19/examples/security-manager/target/J0/$%7b%7bjava.ext.dirs%7d%7d/* <no signer certificates>)
27-Oct-2015 13:46:54         Active CodeSource: (file:/mnt/work/bamboo-home/xml-data/build-dir/RNDTEST-SOFTWARE-JDK19/junit4-ant/target/junit4-ant-2.2.0-SNAPSHOT.jar <no signer certificates>)
27-Oct-2015 13:46:54 policy: evaluation (codesource) failed
27-Oct-2015 13:46:54 policy: evaluate codesources:
27-Oct-2015 13:46:54         Policy CodeSource: (file:/mnt/work/bamboo-home/xml-data/build-dir/RNDTEST-SOFTWARE-JDK19/junit4-ant/target/junit4-ant-2.2.0-SNAPSHOT.jar <no signer certificates>)
27-Oct-2015 13:46:54         Active CodeSource: (file:/mnt/work/bamboo-home/xml-data/build-dir/RNDTEST-SOFTWARE-JDK19/junit4-ant/target/junit4-ant-2.2.0-SNAPSHOT.jar <no signer certificates>)
27-Oct-2015 13:46:54 policy: evaluate principals:
27-Oct-2015 13:46:54         Policy Principals: []
27-Oct-2015 13:46:54         Active Principals: []
27-Oct-2015 13:46:54 policy:   granting ("java.lang.RuntimePermission" "setIO")
27-Oct-2015 13:46:54 policy: evaluation (codesource/principals) passed
27-Oct-2015 13:46:54 policy: evaluate codesources:
27-Oct-2015 13:46:54         Policy CodeSource: (file:/mnt/work/bamboo-home/xml-data/build-dir/RNDTEST-SOFTWARE-JDK19/randomized-runner/target/randomizedtesting-runner-2.2.0-SNAPSHOT.jar <no signer certificates>)
27-Oct-2015 13:46:54         Active CodeSource: (file:/mnt/work/bamboo-home/xml-data/build-dir/RNDTEST-SOFTWARE-JDK19/junit4-ant/target/junit4-ant-2.2.0-SNAPSHOT.jar <no signer certificates>)
27-Oct-2015 13:46:54 policy: evaluation (codesource) failed
27-Oct-2015 13:46:54 policy: evaluate codesources:
27-Oct-2015 13:46:54         Policy CodeSource: (file:/mnt/work/bamboo-home/.m2/AGENT-1671170/repository/junit/junit/4.10/junit-4.10.jar <no signer certificates>)
27-Oct-2015 13:46:54         Active CodeSource: (file:/mnt/work/bamboo-home/xml-data/build-dir/RNDTEST-SOFTWARE-JDK19/junit4-ant/target/junit4-ant-2.2.0-SNAPSHOT.jar <no signer certificates>)
27-Oct-2015 13:46:54 policy: evaluation (codesource) failed
27-Oct-2015 13:46:54 policy: evaluate codesources:
27-Oct-2015 13:46:54         Policy CodeSource: (null <no signer certificates>)
27-Oct-2015 13:46:54         Active CodeSource: (file:/mnt/work/bamboo-home/xml-data/build-dir/RNDTEST-SOFTWARE-JDK19/junit4-ant/target/junit4-ant-2.2.0-SNAPSHOT.jar <no signer certificates>)
27-Oct-2015 13:46:54 policy: evaluate principals:
27-Oct-2015 13:46:54         Policy Principals: []
27-Oct-2015 13:46:54         Active Principals: []
27-Oct-2015 13:46:54 policy:   granting ("java.util.PropertyPermission" "*" "read")
27-Oct-2015 13:46:54 policy:   granting ("java.io.FilePermission" "<<ALL FILES>>" "read,write,execute,delete")
27-Oct-2015 13:46:54 policy: evaluation (codesource/principals) passed
27-Oct-2015 13:46:54 access: domain 0 ProtectionDomain  (file:/mnt/work/bamboo-home/xml-data/build-dir/RNDTEST-SOFTWARE-JDK19/junit4-ant/target/junit4-ant-2.2.0-SNAPSHOT.jar <no signer certificates>)
27-Oct-2015 13:46:54 sun.misc.Launcher$AppClassLoader@5ccd43c2
27-Oct-2015 13:46:54 <no principals>
27-Oct-2015 13:46:54 java.security.Permissions@31ef45e3 (
27-Oct-2015 13:46:54 ("java.lang.RuntimePermission" "exitVM")
27-Oct-2015 13:46:54 ("java.lang.RuntimePermission" "setIO")
27-Oct-2015 13:46:54 ("java.io.FilePermission" "<<ALL FILES>>" "read,write,execute,delete")
27-Oct-2015 13:46:54 ("java.io.FilePermission" "/mnt/work/bamboo-home/xml-data/build-dir/RNDTEST-SOFTWARE-JDK19/junit4-ant/target/junit4-ant-2.2.0-SNAPSHOT.jar" "read")
27-Oct-2015 13:46:54 ("java.util.PropertyPermission" "*" "read")
27-Oct-2015 13:46:54 )
27-Oct-2015 13:46:54
27-Oct-2015 13:46:54
27-Oct-2015 13:46:54 access: access allowed ("java.util.PropertyPermission" "user.home" "read")
27-Oct-2015 13:46:54 java.lang.Exception: Stack trace
27-Oct-2015 13:46:54         at java.lang.Thread.dumpStack(Thread.java:1333)
27-Oct-2015 13:46:54         at java.security.AccessControlContext.checkPermission(AccessControlContext.java:415)
27-Oct-2015 13:46:54         at java.security.AccessController.checkPermission(AccessController.java:894)
27-Oct-2015 13:46:54         at java.lang.SecurityManager.checkPermission(SecurityManager.java:541)
27-Oct-2015 13:46:54         at java.lang.SecurityManager.checkPropertyAccess(SecurityManager.java:1285)
27-Oct-2015 13:46:54         at java.lang.System.getProperty(System.java:708)
27-Oct-2015 13:46:54         at com.carrotsearch.ant.tasks.junit4.events.BootstrapEvent.collectSystemProperties(BootstrapEvent.java:93)
27-Oct-2015 13:46:54         at com.carrotsearch.ant.tasks.junit4.events.BootstrapEvent.<init>(BootstrapEvent.java:68)
27-Oct-2015 13:46:54         at com.carrotsearch.ant.tasks.junit4.slave.SlaveMain.main(SlaveMain.java:337)
27-Oct-2015 13:46:54         at com.carrotsearch.ant.tasks.junit4.slave.SlaveMainSafe.main(SlaveMainSafe.java:10)
27-Oct-2015 13:46:54 policy: getPermissions:
27-Oct-2015 13:46:54         PD CodeSource: (file:/mnt/work/bamboo-home/xml-data/build-dir/RNDTEST-SOFTWARE-JDK19/junit4-ant/target/junit4-ant-2.2.0-SNAPSHOT.jar <no signer certificates>)
27-Oct-2015 13:46:54         PD ClassLoader: sun.misc.Launcher$AppClassLoader@5ccd43c2
27-Oct-2015 13:46:54         PD Principals: <no principals>
27-Oct-2015 13:46:54 policy: evaluate codesources:
27-Oct-2015 13:46:54         Policy CodeSource: (file:/mnt/work/bamboo-home/xml-data/build-dir/RNDTEST-SOFTWARE-JDK19/examples/security-manager/target/J0/$%7b%7bjava.ext.dirs%7d%7d/* <no signer certificates>)
27-Oct-2015 13:46:54         Active CodeSource: (file:/mnt/work/bamboo-home/xml-data/build-dir/RNDTEST-SOFTWARE-JDK19/junit4-ant/target/junit4-ant-2.2.0-SNAPSHOT.jar <no signer certificates>)
27-Oct-2015 13:46:54 policy: evaluation (codesource) failed
27-Oct-2015 13:46:54 policy: evaluate codesources:
27-Oct-2015 13:46:54         Policy CodeSource: (file:/mnt/work/bamboo-home/xml-data/build-dir/RNDTEST-SOFTWARE-JDK19/junit4-ant/target/junit4-ant-2.2.0-SNAPSHOT.jar <no signer certificates>)
27-Oct-2015 13:46:54         Active CodeSource: (file:/mnt/work/bamboo-home/xml-data/build-dir/RNDTEST-SOFTWARE-JDK19/junit4-ant/target/junit4-ant-2.2.0-SNAPSHOT.jar <no signer certificates>)
27-Oct-2015 13:46:54 policy: evaluate principals:
27-Oct-2015 13:46:54         Policy Principals: []
27-Oct-2015 13:46:54         Active Principals: []
27-Oct-2015 13:46:54 policy:   granting ("java.lang.RuntimePermission" "setIO")
27-Oct-2015 13:46:54 policy: evaluation (codesource/principals) passed
27-Oct-2015 13:46:54 policy: evaluate codesources:
27-Oct-2015 13:46:54         Policy CodeSource: (file:/mnt/work/bamboo-home/xml-data/build-dir/RNDTEST-SOFTWARE-JDK19/randomized-runner/target/randomizedtesting-runner-2.2.0-SNAPSHOT.jar <no signer certificates>)
27-Oct-2015 13:46:54         Active CodeSource: (file:/mnt/work/bamboo-home/xml-data/build-dir/RNDTEST-SOFTWARE-JDK19/junit4-ant/target/junit4-ant-2.2.0-SNAPSHOT.jar <no signer certificates>)
27-Oct-2015 13:46:54 policy: evaluation (codesource) failed
27-Oct-2015 13:46:54 policy: evaluate codesources:
27-Oct-2015 13:46:54         Policy CodeSource: (file:/mnt/work/bamboo-home/.m2/AGENT-1671170/repository/junit/junit/4.10/junit-4.10.jar <no signer certificates>)
27-Oct-2015 13:46:54         Active CodeSource: (file:/mnt/work/bamboo-home/xml-data/build-dir/RNDTEST-SOFTWARE-JDK19/junit4-ant/target/junit4-ant-2.2.0-SNAPSHOT.jar <no signer certificates>)
27-Oct-2015 13:46:54 policy: evaluation (codesource) failed
27-Oct-2015 13:46:54 policy: evaluate codesources:
27-Oct-2015 13:46:54         Policy CodeSource: (null <no signer certificates>)
27-Oct-2015 13:46:54         Active CodeSource: (file:/mnt/work/bamboo-home/xml-data/build-dir/RNDTEST-SOFTWARE-JDK19/junit4-ant/target/junit4-ant-2.2.0-SNAPSHOT.jar <no signer certificates>)
27-Oct-2015 13:46:54 policy: evaluate principals:
27-Oct-2015 13:46:54         Policy Principals: []
27-Oct-2015 13:46:54         Active Principals: []
27-Oct-2015 13:46:54 policy:   granting ("java.util.PropertyPermission" "*" "read")
27-Oct-2015 13:46:54 policy:   granting ("java.io.FilePermission" "<<ALL FILES>>" "read,write,execute,delete")
27-Oct-2015 13:46:54 policy: evaluation (codesource/principals) passed
27-Oct-2015 13:46:54 access: domain 0 ProtectionDomain  (file:/mnt/work/bamboo-home/xml-data/build-dir/RNDTEST-SOFTWARE-JDK19/junit4-ant/target/junit4-ant-2.2.0-SNAPSHOT.jar <no signer certificates>)
27-Oct-2015 13:46:54 sun.misc.Launcher$AppClassLoader@5ccd43c2
27-Oct-2015 13:46:54 <no principals>
27-Oct-2015 13:46:54 java.security.Permissions@3c0ecd4b (
27-Oct-2015 13:46:54 ("java.lang.RuntimePermission" "exitVM")
27-Oct-2015 13:46:54 ("java.lang.RuntimePermission" "setIO")
27-Oct-2015 13:46:54 ("java.io.FilePermission" "<<ALL FILES>>" "read,write,execute,delete")
27-Oct-2015 13:46:54 ("java.io.FilePermission" "/mnt/work/bamboo-home/xml-data/build-dir/RNDTEST-SOFTWARE-JDK19/junit4-ant/target/junit4-ant-2.2.0-SNAPSHOT.jar" "read")
27-Oct-2015 13:46:54 ("java.util.PropertyPermission" "*" "read")
27-Oct-2015 13:46:54 )
27-Oct-2015 13:46:54
27-Oct-2015 13:46:54
27-Oct-2015 13:46:54 access: access allowed ("java.util.PropertyPermission" "user.dir" "read")
27-Oct-2015 13:46:54 java.lang.Exception: Stack trace
27-Oct-2015 13:46:54         at java.lang.Thread.dumpStack(Thread.java:1333)
27-Oct-2015 13:46:54         at java.security.AccessControlContext.checkPermission(AccessControlContext.java:415)
27-Oct-2015 13:46:54         at java.security.AccessController.checkPermission(AccessController.java:894)
27-Oct-2015 13:46:54         at java.lang.SecurityManager.checkPermission(SecurityManager.java:541)
27-Oct-2015 13:46:54         at java.lang.System.checkIO(System.java:252)
27-Oct-2015 13:46:54         at java.lang.System.setOut(System.java:174)
27-Oct-2015 13:46:54         at com.carrotsearch.ant.tasks.junit4.slave.SlaveMain$3.run(SlaveMain.java:440)
27-Oct-2015 13:46:54         at com.carrotsearch.ant.tasks.junit4.slave.SlaveMain$3.run(SlaveMain.java:437)
27-Oct-2015 13:46:54         at java.security.AccessController.doPrivileged(Native Method)
27-Oct-2015 13:46:54         at com.carrotsearch.ant.tasks.junit4.slave.SlaveMain.redirectStreams(SlaveMain.java:437)
27-Oct-2015 13:46:54         at com.carrotsearch.ant.tasks.junit4.slave.SlaveMain.main(SlaveMain.java:342)
27-Oct-2015 13:46:54         at com.carrotsearch.ant.tasks.junit4.slave.SlaveMainSafe.main(SlaveMainSafe.java:10)
27-Oct-2015 13:46:54 policy: getPermissions:
27-Oct-2015 13:46:54         PD CodeSource: (file:/mnt/work/bamboo-home/xml-data/build-dir/RNDTEST-SOFTWARE-JDK19/junit4-ant/target/junit4-ant-2.2.0-SNAPSHOT.jar <no signer certificates>)
27-Oct-2015 13:46:54         PD ClassLoader: sun.misc.Launcher$AppClassLoader@5ccd43c2
27-Oct-2015 13:46:54         PD Principals: <no principals>
27-Oct-2015 13:46:54 policy: evaluate codesources:
27-Oct-2015 13:46:54         Policy CodeSource: (file:/mnt/work/bamboo-home/xml-data/build-dir/RNDTEST-SOFTWARE-JDK19/examples/security-manager/target/J0/$%7b%7bjava.ext.dirs%7d%7d/* <no signer certificates>)
27-Oct-2015 13:46:54         Active CodeSource: (file:/mnt/work/bamboo-home/xml-data/build-dir/RNDTEST-SOFTWARE-JDK19/junit4-ant/target/junit4-ant-2.2.0-SNAPSHOT.jar <no signer certificates>)
27-Oct-2015 13:46:54 policy: evaluation (codesource) failed
27-Oct-2015 13:46:54 policy: evaluate codesources:
27-Oct-2015 13:46:54         Policy CodeSource: (file:/mnt/work/bamboo-home/xml-data/build-dir/RNDTEST-SOFTWARE-JDK19/junit4-ant/target/junit4-ant-2.2.0-SNAPSHOT.jar <no signer certificates>)
27-Oct-2015 13:46:54         Active CodeSource: (file:/mnt/work/bamboo-home/xml-data/build-dir/RNDTEST-SOFTWARE-JDK19/junit4-ant/target/junit4-ant-2.2.0-SNAPSHOT.jar <no signer certificates>)
27-Oct-2015 13:46:54 policy: evaluate principals:
27-Oct-2015 13:46:54         Policy Principals: []
27-Oct-2015 13:46:54         Active Principals: []
27-Oct-2015 13:46:54 policy:   granting ("java.lang.RuntimePermission" "setIO")
27-Oct-2015 13:46:54 policy: evaluation (codesource/principals) passed
27-Oct-2015 13:46:54 policy: evaluate codesources:
27-Oct-2015 13:46:54         Policy CodeSource: (file:/mnt/work/bamboo-home/xml-data/build-dir/RNDTEST-SOFTWARE-JDK19/randomized-runner/target/randomizedtesting-runner-2.2.0-SNAPSHOT.jar <no signer certificates>)
27-Oct-2015 13:46:54         Active CodeSource: (file:/mnt/work/bamboo-home/xml-data/build-dir/RNDTEST-SOFTWARE-JDK19/junit4-ant/target/junit4-ant-2.2.0-SNAPSHOT.jar <no signer certificates>)
27-Oct-2015 13:46:54 policy: evaluation (codesource) failed
27-Oct-2015 13:46:54 policy: evaluate codesources:
27-Oct-2015 13:46:54         Policy CodeSource: (file:/mnt/work/bamboo-home/.m2/AGENT-1671170/repository/junit/junit/4.10/junit-4.10.jar <no signer certificates>)
27-Oct-2015 13:46:54         Active CodeSource: (file:/mnt/work/bamboo-home/xml-data/build-dir/RNDTEST-SOFTWARE-JDK19/junit4-ant/target/junit4-ant-2.2.0-SNAPSHOT.jar <no signer certificates>)
27-Oct-2015 13:46:54 policy: evaluation (codesource) failed
27-Oct-2015 13:46:54 policy: evaluate codesources:
27-Oct-2015 13:46:54         Policy CodeSource: (null <no signer certificates>)
27-Oct-2015 13:46:54         Active CodeSource: (file:/mnt/work/bamboo-home/xml-data/build-dir/RNDTEST-SOFTWARE-JDK19/junit4-ant/target/junit4-ant-2.2.0-SNAPSHOT.jar <no signer certificates>)
27-Oct-2015 13:46:54 policy: evaluate principals:
27-Oct-2015 13:46:54         Policy Principals: []
27-Oct-2015 13:46:54         Active Principals: []
27-Oct-2015 13:46:54 policy:   granting ("java.util.PropertyPermission" "*" "read")
27-Oct-2015 13:46:54 policy:   granting ("java.io.FilePermission" "<<ALL FILES>>" "read,write,execute,delete")
27-Oct-2015 13:46:54 policy: evaluation (codesource/principals) passed
27-Oct-2015 13:46:54 access: domain 0 ProtectionDomain  (file:/mnt/work/bamboo-home/xml-data/build-dir/RNDTEST-SOFTWARE-JDK19/junit4-ant/target/junit4-ant-2.2.0-SNAPSHOT.jar <no signer certificates>)
27-Oct-2015 13:46:54 sun.misc.Launcher$AppClassLoader@5ccd43c2
27-Oct-2015 13:46:54 <no principals>
27-Oct-2015 13:46:54 java.security.Permissions@5bcab519 (
27-Oct-2015 13:46:54 ("java.lang.RuntimePermission" "exitVM")
27-Oct-2015 13:46:54 ("java.lang.RuntimePermission" "setIO")
27-Oct-2015 13:46:54 ("java.io.FilePermission" "<<ALL FILES>>" "read,write,execute,delete")
27-Oct-2015 13:46:54 ("java.io.FilePermission" "/mnt/work/bamboo-home/xml-data/build-dir/RNDTEST-SOFTWARE-JDK19/junit4-ant/target/junit4-ant-2.2.0-SNAPSHOT.jar" "read")
27-Oct-2015 13:46:54 ("java.util.PropertyPermission" "*" "read")
27-Oct-2015 13:46:54 )
27-Oct-2015 13:46:54
27-Oct-2015 13:46:54
27-Oct-2015 13:46:54 access: access allowed ("java.lang.RuntimePermission" "setIO")
27-Oct-2015 13:46:54 java.lang.Exception: Stack trace
27-Oct-2015 13:46:54         at java.lang.Thread.dumpStack(Thread.java:1333)
27-Oct-2015 13:46:54         at java.security.AccessControlContext.checkPermission(AccessControlContext.java:415)
27-Oct-2015 13:46:54         at java.security.AccessController.checkPermission(AccessController.java:894)
27-Oct-2015 13:46:54         at java.lang.SecurityManager.checkPermission(SecurityManager.java:541)
27-Oct-2015 13:46:54         at java.lang.System.checkIO(System.java:252)
27-Oct-2015 13:46:54         at java.lang.System.setErr(System.java:198)
27-Oct-2015 13:46:54         at com.carrotsearch.ant.tasks.junit4.slave.SlaveMain$3.run(SlaveMain.java:451)
27-Oct-2015 13:46:54         at com.carrotsearch.ant.tasks.junit4.slave.SlaveMain$3.run(SlaveMain.java:437)
27-Oct-2015 13:46:54         at java.security.AccessController.doPrivileged(Native Method)
27-Oct-2015 13:46:54         at com.carrotsearch.ant.tasks.junit4.slave.SlaveMain.redirectStreams(SlaveMain.java:437)
27-Oct-2015 13:46:54         at com.carrotsearch.ant.tasks.junit4.slave.SlaveMain.main(SlaveMain.java:342)
27-Oct-2015 13:46:54         at com.carrotsearch.ant.tasks.junit4.slave.SlaveMainSafe.main(SlaveMainSafe.java:10)
27-Oct-2015 13:46:54 policy: getPermissions:
27-Oct-2015 13:46:54         PD CodeSource: (file:/mnt/work/bamboo-home/xml-data/build-dir/RNDTEST-SOFTWARE-JDK19/junit4-ant/target/junit4-ant-2.2.0-SNAPSHOT.jar <no signer certificates>)
27-Oct-2015 13:46:54         PD ClassLoader: sun.misc.Launcher$AppClassLoader@5ccd43c2
27-Oct-2015 13:46:54         PD Principals: <no principals>
27-Oct-2015 13:46:54 policy: evaluate codesources:
27-Oct-2015 13:46:54         Policy CodeSource: (file:/mnt/work/bamboo-home/xml-data/build-dir/RNDTEST-SOFTWARE-JDK19/examples/security-manager/target/J0/$%7b%7bjava.ext.dirs%7d%7d/* <no signer certificates>)
27-Oct-2015 13:46:54         Active CodeSource: (file:/mnt/work/bamboo-home/xml-data/build-dir/RNDTEST-SOFTWARE-JDK19/junit4-ant/target/junit4-ant-2.2.0-SNAPSHOT.jar <no signer certificates>)
27-Oct-2015 13:46:54 policy: evaluation (codesource) failed
27-Oct-2015 13:46:54 policy: evaluate codesources:
27-Oct-2015 13:46:54         Policy CodeSource: (file:/mnt/work/bamboo-home/xml-data/build-dir/RNDTEST-SOFTWARE-JDK19/junit4-ant/target/junit4-ant-2.2.0-SNAPSHOT.jar <no signer certificates>)
27-Oct-2015 13:46:54         Active CodeSource: (file:/mnt/work/bamboo-home/xml-data/build-dir/RNDTEST-SOFTWARE-JDK19/junit4-ant/target/junit4-ant-2.2.0-SNAPSHOT.jar <no signer certificates>)
27-Oct-2015 13:46:54 policy: evaluate principals:
27-Oct-2015 13:46:54         Policy Principals: []
27-Oct-2015 13:46:54         Active Principals: []
27-Oct-2015 13:46:54 policy:   granting ("java.lang.RuntimePermission" "setIO")
27-Oct-2015 13:46:54 policy: evaluation (codesource/principals) passed
27-Oct-2015 13:46:54 policy: evaluate codesources:
27-Oct-2015 13:46:54         Policy CodeSource: (file:/mnt/work/bamboo-home/xml-data/build-dir/RNDTEST-SOFTWARE-JDK19/randomized-runner/target/randomizedtesting-runner-2.2.0-SNAPSHOT.jar <no signer certificates>)
27-Oct-2015 13:46:54         Active CodeSource: (file:/mnt/work/bamboo-home/xml-data/build-dir/RNDTEST-SOFTWARE-JDK19/junit4-ant/target/junit4-ant-2.2.0-SNAPSHOT.jar <no signer certificates>)
27-Oct-2015 13:46:54 policy: evaluation (codesource) failed
27-Oct-2015 13:46:54 policy: evaluate codesources:
27-Oct-2015 13:46:54         Policy CodeSource: (file:/mnt/work/bamboo-home/.m2/AGENT-1671170/repository/junit/junit/4.10/junit-4.10.jar <no signer certificates>)
27-Oct-2015 13:46:54         Active CodeSource: (file:/mnt/work/bamboo-home/xml-data/build-dir/RNDTEST-SOFTWARE-JDK19/junit4-ant/target/junit4-ant-2.2.0-SNAPSHOT.jar <no signer certificates>)
27-Oct-2015 13:46:54 policy: evaluation (codesource) failed
27-Oct-2015 13:46:54 policy: evaluate codesources:
27-Oct-2015 13:46:54         Policy CodeSource: (null <no signer certificates>)
27-Oct-2015 13:46:54         Active CodeSource: (file:/mnt/work/bamboo-home/xml-data/build-dir/RNDTEST-SOFTWARE-JDK19/junit4-ant/target/junit4-ant-2.2.0-SNAPSHOT.jar <no signer certificates>)
27-Oct-2015 13:46:54 policy: evaluate principals:
27-Oct-2015 13:46:54         Policy Principals: []
27-Oct-2015 13:46:54         Active Principals: []
27-Oct-2015 13:46:54 policy:   granting ("java.util.PropertyPermission" "*" "read")
27-Oct-2015 13:46:54 policy:   granting ("java.io.FilePermission" "<<ALL FILES>>" "read,write,execute,delete")
27-Oct-2015 13:46:54 policy: evaluation (codesource/principals) passed
27-Oct-2015 13:46:54 access: domain 0 ProtectionDomain  (file:/mnt/work/bamboo-home/xml-data/build-dir/RNDTEST-SOFTWARE-JDK19/junit4-ant/target/junit4-ant-2.2.0-SNAPSHOT.jar <no signer certificates>)
27-Oct-2015 13:46:54 sun.misc.Launcher$AppClassLoader@5ccd43c2
27-Oct-2015 13:46:54 <no principals>
27-Oct-2015 13:46:54 java.security.Permissions@31a5c39e (
27-Oct-2015 13:46:54 ("java.lang.RuntimePermission" "exitVM")
27-Oct-2015 13:46:54 ("java.lang.RuntimePermission" "setIO")
27-Oct-2015 13:46:54 ("java.io.FilePermission" "<<ALL FILES>>" "read,write,execute,delete")
27-Oct-2015 13:46:54 ("java.io.FilePermission" "/mnt/work/bamboo-home/xml-data/build-dir/RNDTEST-SOFTWARE-JDK19/junit4-ant/target/junit4-ant-2.2.0-SNAPSHOT.jar" "read")
27-Oct-2015 13:46:54 ("java.util.PropertyPermission" "*" "read")
27-Oct-2015 13:46:54 )
27-Oct-2015 13:46:54
27-Oct-2015 13:46:54
27-Oct-2015 13:46:54 access: access allowed ("java.lang.RuntimePermission" "setIO")
27-Oct-2015 13:46:54 [INFO] <<< JVM J0: EOF ----
27-Oct-2015 13:46:54 [INFO] JVM J0:     0.26 ..     0.78 =     0.52s
27-Oct-2015 13:46:54 [INFO] Execution time total: 0.80 sec.
27-Oct-2015 13:46:54 [INFO] Tests summary: 1 suite, 2 tests
27-Oct-2015 13:46:54 [INFO] ------------------------------------------------------------------------
27-Oct-2015 13:46:54 [INFO] Reactor Summary:
27-Oct-2015 13:46:54 [INFO]
27-Oct-2015 13:46:54 [INFO] RandomizedTesting Parent POM ....................... SUCCESS [  0.108 s]
27-Oct-2015 13:46:54 [INFO] RandomizedTesting Randomized Runner ................ SUCCESS [ 42.383 s]
27-Oct-2015 13:46:54 [INFO] RandomizedTesting JUnit4 ANT Task .................. SUCCESS [01:57 min]
27-Oct-2015 13:46:54 [INFO] RandomizedTesting JUnit4 Maven Plugin .............. SUCCESS [  2.634 s]
27-Oct-2015 13:46:54 [INFO] RandomizedTesting JUnit4 Maven Plugin Tests ........ SUCCESS [  9.633 s]
27-Oct-2015 13:46:54 [INFO] RandomizedTesting Examples ......................... SUCCESS [  6.181 s]
27-Oct-2015 13:46:54 [INFO] RandomizedTesting ANT Examples ..................... SUCCESS [  6.656 s]
27-Oct-2015 13:46:54 [INFO] RandomizedTesting Security Manager Example ......... SUCCESS [  0.905 s]
27-Oct-2015 13:46:54 [INFO] ------------------------------------------------------------------------
27-Oct-2015 13:46:54 [INFO] BUILD SUCCESS
27-Oct-2015 13:46:54 [INFO] ------------------------------------------------------------------------
27-Oct-2015 13:46:54 [INFO] Total time: 03:06 min
27-Oct-2015 13:46:54 [INFO] Finished at: 2015-10-27T13:46:54+01:00
27-Oct-2015 13:46:54 [INFO] Final Memory: 69M/1049M
27-Oct-2015 13:46:54 [INFO] ------------------------------------------------------------------------
27-Oct-2015 13:46:54 Parsing test results under /mnt/work/bamboo-home/xml-data/build-dir/RNDTEST-SOFTWARE-JDK19...
27-Oct-2015 13:46:54 Finished task 'Maven 3.x' with result: Success
27-Oct-2015 13:46:54 Running post build plugin 'Clover Results Collector'
27-Oct-2015 13:46:54 Running post build plugin 'Artifact Copier'
27-Oct-2015 13:46:54 Running post build plugin 'Docker Container Cleanup'
27-Oct-2015 13:46:54 Running post build plugin 'NCover Results Collector'
27-Oct-2015 13:46:54 Running post build plugin 'npm Cache Cleanup'
27-Oct-2015 13:46:54 Finalising the build...
27-Oct-2015 13:46:54 Stopping timer.
27-Oct-2015 13:46:54 Build RNDTEST-SOFTWARE-JDK19-84 completed.
27-Oct-2015 13:46:54 Running on server: post build plugin 'Clover Delta Calculator'
27-Oct-2015 13:46:54 Running on server: post build plugin 'Build Hanging Detection Configuration'
27-Oct-2015 13:46:54 Running on server: post build plugin 'NCover Results Collector'
27-Oct-2015 13:46:54 Running on server: post build plugin 'Maven Dependencies Postprocessor'
27-Oct-2015 13:46:54 All post build plugins have finished
27-Oct-2015 13:46:54 Generating build results summary...
27-Oct-2015 13:46:55 Saving build results to disk...
27-Oct-2015 13:46:55 Logging substituted variables...
27-Oct-2015 13:46:55 Indexing build results...
27-Oct-2015 13:46:55 Finished building RNDTEST-SOFTWARE-JDK19-84.