Build #225

Build: #225 failed

Job: JDK 9 failed

Stages & jobs

  1. Compile and test

  2. Package

Build log

The build generated 3,415 lines of output.The output is too long and has been truncated to the last 1,000 lines. Download or view full build log

20-Nov-2018 10:01:01         at app//com.carrotsearch.randomizedtesting.timeouts.Test012RunawayThreadsKilledAtOnce$NestedClass$1.run(Test012RunawayThreadsKilledAtOnce.java:29)
20-Nov-2018 10:01:01   41) Thread[id=5776, name=stubborn-40, state=TIMED_WAITING, group=TGRP-Test012RunawayThreadsKilledAtOnce$NestedClass]
20-Nov-2018 10:01:01         at java.base@9.0.4/java.lang.Thread.sleep(Native Method)
20-Nov-2018 10:01:01         at app//com.carrotsearch.randomizedtesting.timeouts.Test012RunawayThreadsKilledAtOnce$NestedClass$1.run(Test012RunawayThreadsKilledAtOnce.java:29)
20-Nov-2018 10:01:01   42) Thread[id=5780, name=stubborn-44, state=TIMED_WAITING, group=TGRP-Test012RunawayThreadsKilledAtOnce$NestedClass]
20-Nov-2018 10:01:01         at java.base@9.0.4/java.lang.Thread.sleep(Native Method)
20-Nov-2018 10:01:01         at app//com.carrotsearch.randomizedtesting.timeouts.Test012RunawayThreadsKilledAtOnce$NestedClass$1.run(Test012RunawayThreadsKilledAtOnce.java:29)
20-Nov-2018 10:01:01   43) Thread[id=5757, name=stubborn-21, state=TIMED_WAITING, group=TGRP-Test012RunawayThreadsKilledAtOnce$NestedClass]
20-Nov-2018 10:01:01         at java.base@9.0.4/java.lang.Thread.sleep(Native Method)
20-Nov-2018 10:01:01         at app//com.carrotsearch.randomizedtesting.timeouts.Test012RunawayThreadsKilledAtOnce$NestedClass$1.run(Test012RunawayThreadsKilledAtOnce.java:29)
20-Nov-2018 10:01:01   44) Thread[id=5759, name=stubborn-23, state=TIMED_WAITING, group=TGRP-Test012RunawayThreadsKilledAtOnce$NestedClass]
20-Nov-2018 10:01:01         at java.base@9.0.4/java.lang.Thread.sleep(Native Method)
20-Nov-2018 10:01:01         at app//com.carrotsearch.randomizedtesting.timeouts.Test012RunawayThreadsKilledAtOnce$NestedClass$1.run(Test012RunawayThreadsKilledAtOnce.java:29)
20-Nov-2018 10:01:01   45) Thread[id=5756, name=stubborn-20, state=TIMED_WAITING, group=TGRP-Test012RunawayThreadsKilledAtOnce$NestedClass]
20-Nov-2018 10:01:01         at java.base@9.0.4/java.lang.Thread.sleep(Native Method)
20-Nov-2018 10:01:01         at app//com.carrotsearch.randomizedtesting.timeouts.Test012RunawayThreadsKilledAtOnce$NestedClass$1.run(Test012RunawayThreadsKilledAtOnce.java:29)
20-Nov-2018 10:01:01   46) Thread[id=5743, name=stubborn-7, state=TIMED_WAITING, group=TGRP-Test012RunawayThreadsKilledAtOnce$NestedClass]
20-Nov-2018 10:01:01         at java.base@9.0.4/java.lang.Thread.sleep(Native Method)
20-Nov-2018 10:01:01         at app//com.carrotsearch.randomizedtesting.timeouts.Test012RunawayThreadsKilledAtOnce$NestedClass$1.run(Test012RunawayThreadsKilledAtOnce.java:29)
20-Nov-2018 10:01:01   47) Thread[id=5752, name=stubborn-16, state=TIMED_WAITING, group=TGRP-Test012RunawayThreadsKilledAtOnce$NestedClass]
20-Nov-2018 10:01:01         at java.base@9.0.4/java.lang.Thread.sleep(Native Method)
20-Nov-2018 10:01:01         at app//com.carrotsearch.randomizedtesting.timeouts.Test012RunawayThreadsKilledAtOnce$NestedClass$1.run(Test012RunawayThreadsKilledAtOnce.java:29)
20-Nov-2018 10:01:01   48) Thread[id=5745, name=stubborn-9, state=TIMED_WAITING, group=TGRP-Test012RunawayThreadsKilledAtOnce$NestedClass]
20-Nov-2018 10:01:01         at java.base@9.0.4/java.lang.Thread.sleep(Native Method)
20-Nov-2018 10:01:01         at app//com.carrotsearch.randomizedtesting.timeouts.Test012RunawayThreadsKilledAtOnce$NestedClass$1.run(Test012RunawayThreadsKilledAtOnce.java:29)
20-Nov-2018 10:01:01   49) Thread[id=5774, name=stubborn-38, state=TIMED_WAITING, group=TGRP-Test012RunawayThreadsKilledAtOnce$NestedClass]
20-Nov-2018 10:01:01         at java.base@9.0.4/java.lang.Thread.sleep(Native Method)
20-Nov-2018 10:01:01         at app//com.carrotsearch.randomizedtesting.timeouts.Test012RunawayThreadsKilledAtOnce$NestedClass$1.run(Test012RunawayThreadsKilledAtOnce.java:29)
20-Nov-2018 10:01:01   50) Thread[id=5782, name=stubborn-46, state=TIMED_WAITING, group=TGRP-Test012RunawayThreadsKilledAtOnce$NestedClass]
20-Nov-2018 10:01:01         at java.base@9.0.4/java.lang.Thread.sleep(Native Method)
20-Nov-2018 10:01:01         at app//com.carrotsearch.randomizedtesting.timeouts.Test012RunawayThreadsKilledAtOnce$NestedClass$1.run(Test012RunawayThreadsKilledAtOnce.java:29)
20-Nov-2018 10:01:01 Finished: lotsOfStubbornThreads
20-Nov-2018 10:01:01 Run finished: run=1, ignored=0, failures=1, assumptions=0
20-Nov-2018 10:01:01
20-Nov-2018 10:01:01 Tests run: 1, Failures: 0, Errors: 0, Skipped: 0, Time elapsed: 0.035 sec - in com.carrotsearch.randomizedtesting.timeouts.Test012RunawayThreadsKilledAtOnce
20-Nov-2018 10:01:01 Running com.carrotsearch.randomizedtesting.timeouts.Test008SeedsAnnotation
20-Nov-2018 10:01:01 Run started.
20-Nov-2018 10:01:01 Started : testMe {seed=[A772DBEA946DDBF5:CAFEBABE]}
20-Nov-2018 10:01:01 Finished: testMe {seed=[A772DBEA946DDBF5:CAFEBABE]}
20-Nov-2018 10:01:01 Started : testMe {seed=[A772DBEA946DDBF5:CAFEBABE] #2}
20-Nov-2018 10:01:01 Finished: testMe {seed=[A772DBEA946DDBF5:CAFEBABE] #2}
20-Nov-2018 10:01:01 Started : testMe {seed=[A772DBEA946DDBF5:DEADBEEF]}
20-Nov-2018 10:01:01 Finished: testMe {seed=[A772DBEA946DDBF5:DEADBEEF]}
20-Nov-2018 10:01:01 Started : testMe {seed=[A772DBEA946DDBF5:DEADBEEF] #2}
20-Nov-2018 10:01:01 Finished: testMe {seed=[A772DBEA946DDBF5:DEADBEEF] #2}
20-Nov-2018 10:01:01 Started : testMe {seed=[A772DBEA946DDBF5:B5DA438C681A492B]}
20-Nov-2018 10:01:01 Finished: testMe {seed=[A772DBEA946DDBF5:B5DA438C681A492B]}
20-Nov-2018 10:01:01 Started : testMe {seed=[A772DBEA946DDBF5:B5DA438C681A492B] #2}
20-Nov-2018 10:01:01 Finished: testMe {seed=[A772DBEA946DDBF5:B5DA438C681A492B] #2}
20-Nov-2018 10:01:01 Run finished: run=6, ignored=0, failures=0, assumptions=0
20-Nov-2018 10:01:01
20-Nov-2018 10:01:01 Run started.
20-Nov-2018 10:01:01 Started : testMe {seed=[40527AC3F7ED6E62:CAFEBABE]}
20-Nov-2018 10:01:01 Finished: testMe {seed=[40527AC3F7ED6E62:CAFEBABE]}
20-Nov-2018 10:01:01 Started : testMe {seed=[40527AC3F7ED6E62:CAFEBABE] #2}
20-Nov-2018 10:01:01 Finished: testMe {seed=[40527AC3F7ED6E62:CAFEBABE] #2}
20-Nov-2018 10:01:01 Started : testMe {seed=[40527AC3F7ED6E62:DEADBEEF]}
20-Nov-2018 10:01:01 Finished: testMe {seed=[40527AC3F7ED6E62:DEADBEEF]}
20-Nov-2018 10:01:01 Started : testMe {seed=[40527AC3F7ED6E62:DEADBEEF] #2}
20-Nov-2018 10:01:01 Finished: testMe {seed=[40527AC3F7ED6E62:DEADBEEF] #2}
20-Nov-2018 10:01:01 Started : testMe {seed=[40527AC3F7ED6E62:52FAE2A50B9AFCBC]}
20-Nov-2018 10:01:01 Finished: testMe {seed=[40527AC3F7ED6E62:52FAE2A50B9AFCBC]}
20-Nov-2018 10:01:01 Started : testMe {seed=[40527AC3F7ED6E62:52FAE2A50B9AFCBC] #2}
20-Nov-2018 10:01:01 Finished: testMe {seed=[40527AC3F7ED6E62:52FAE2A50B9AFCBC] #2}
20-Nov-2018 10:01:01 Run finished: run=6, ignored=0, failures=0, assumptions=0
20-Nov-2018 10:01:01
20-Nov-2018 10:01:01 Run started.
20-Nov-2018 10:01:01 Started : testMe {seed=[377198997F137324:CAFEBABE]}
20-Nov-2018 10:01:01 Finished: testMe {seed=[377198997F137324:CAFEBABE]}
20-Nov-2018 10:01:01 Started : testMe {seed=[377198997F137324:CAFEBABE] #2}
20-Nov-2018 10:01:01 Finished: testMe {seed=[377198997F137324:CAFEBABE] #2}
20-Nov-2018 10:01:01 Started : testMe {seed=[377198997F137324:DEADBEEF]}
20-Nov-2018 10:01:01 Finished: testMe {seed=[377198997F137324:DEADBEEF]}
20-Nov-2018 10:01:01 Started : testMe {seed=[377198997F137324:DEADBEEF] #2}
20-Nov-2018 10:01:01 Finished: testMe {seed=[377198997F137324:DEADBEEF] #2}
20-Nov-2018 10:01:01 Started : testMe {seed=[377198997F137324:25D900FF8364E1FA]}
20-Nov-2018 10:01:01 Finished: testMe {seed=[377198997F137324:25D900FF8364E1FA]}
20-Nov-2018 10:01:01 Started : testMe {seed=[377198997F137324:25D900FF8364E1FA] #2}
20-Nov-2018 10:01:01 Finished: testMe {seed=[377198997F137324:25D900FF8364E1FA] #2}
20-Nov-2018 10:01:01 Run finished: run=6, ignored=0, failures=0, assumptions=0
20-Nov-2018 10:01:01
20-Nov-2018 10:01:01 Run started.
20-Nov-2018 10:01:01 Started : testMe {seed=[2834E62F06635996:CAFEBABE]}
20-Nov-2018 10:01:01 Finished: testMe {seed=[2834E62F06635996:CAFEBABE]}
20-Nov-2018 10:01:01 Started : testMe {seed=[2834E62F06635996:CAFEBABE] #2}
20-Nov-2018 10:01:01 Finished: testMe {seed=[2834E62F06635996:CAFEBABE] #2}
20-Nov-2018 10:01:01 Started : testMe {seed=[2834E62F06635996:DEADBEEF]}
20-Nov-2018 10:01:01 Finished: testMe {seed=[2834E62F06635996:DEADBEEF]}
20-Nov-2018 10:01:01 Started : testMe {seed=[2834E62F06635996:DEADBEEF] #2}
20-Nov-2018 10:01:01 Finished: testMe {seed=[2834E62F06635996:DEADBEEF] #2}
20-Nov-2018 10:01:01 Started : testMe {seed=[2834E62F06635996:3A9C7E49FA14CB48]}
20-Nov-2018 10:01:01 Finished: testMe {seed=[2834E62F06635996:3A9C7E49FA14CB48]}
20-Nov-2018 10:01:01 Started : testMe {seed=[2834E62F06635996:3A9C7E49FA14CB48] #2}
20-Nov-2018 10:01:01 Finished: testMe {seed=[2834E62F06635996:3A9C7E49FA14CB48] #2}
20-Nov-2018 10:01:01 Run finished: run=6, ignored=0, failures=0, assumptions=0
20-Nov-2018 10:01:01
20-Nov-2018 10:01:01 Tests run: 1, Failures: 0, Errors: 0, Skipped: 0, Time elapsed: 0.03 sec - in com.carrotsearch.randomizedtesting.timeouts.Test008SeedsAnnotation
20-Nov-2018 10:01:01 Running com.carrotsearch.randomizedtesting.timeouts.Test020SuiteTimeoutStopsTests
20-Nov-2018 10:01:01 Run started.
20-Nov-2018 10:01:01 Started : test002
20-Nov-2018 10:01:01 before timeout(2)
20-Nov-2018 10:01:01 Failure : test002(com.carrotsearch.randomizedtesting.timeouts.Test020SuiteTimeoutStopsTests$Nested1): Test abandoned because suite timeout was reached.
20-Nov-2018 10:01:01 Finished: test002
20-Nov-2018 10:01:01 suite timeout(2)
20-Nov-2018 10:01:01 Failure : com.carrotsearch.randomizedtesting.timeouts.Test020SuiteTimeoutStopsTests$Nested1: Suite timeout exceeded (>= 500 msec).
20-Nov-2018 10:01:01 Run finished: run=1, ignored=0, failures=2, assumptions=0
20-Nov-2018 10:01:01
20-Nov-2018 10:01:01 Nov 20, 2018 10:01:01 AM com.carrotsearch.randomizedtesting.ThreadLeakControl$2 evaluate
20-Nov-2018 10:01:01 WARNING: Suite execution timed out: com.carrotsearch.randomizedtesting.timeouts.Test020SuiteTimeoutStopsTests$Nested1
20-Nov-2018 10:01:01 ==== jstack at approximately timeout time ====
20-Nov-2018 10:01:01 "TEST-Test020SuiteTimeoutStopsTests$Nested1.test002-seed#[65C54DF42CA67F35]" ID=5796 TIMED_WAITING
20-Nov-2018 10:01:01         at java.base@9.0.4/java.lang.Thread.sleep(Native Method)
20-Nov-2018 10:01:01         at app//com.carrotsearch.randomizedtesting.timeouts.Test020SuiteTimeoutStopsTests$Nested1.idle(Test020SuiteTimeoutStopsTests.java:49)
20-Nov-2018 10:01:01         at app//com.carrotsearch.randomizedtesting.timeouts.Test020SuiteTimeoutStopsTests$Nested1.test002(Test020SuiteTimeoutStopsTests.java:27)
20-Nov-2018 10:01:01         at java.base@9.0.4/jdk.internal.reflect.NativeMethodAccessorImpl.invoke0(Native Method)
20-Nov-2018 10:01:01         at java.base@9.0.4/jdk.internal.reflect.NativeMethodAccessorImpl.invoke(NativeMethodAccessorImpl.java:62)
20-Nov-2018 10:01:01         at java.base@9.0.4/jdk.internal.reflect.DelegatingMethodAccessorImpl.invoke(DelegatingMethodAccessorImpl.java:43)
20-Nov-2018 10:01:01         at java.base@9.0.4/java.lang.reflect.Method.invoke(Method.java:564)
20-Nov-2018 10:01:01         at app//com.carrotsearch.randomizedtesting.RandomizedRunner.invoke(RandomizedRunner.java:1750)
20-Nov-2018 10:01:01         at app//com.carrotsearch.randomizedtesting.RandomizedRunner$8.evaluate(RandomizedRunner.java:938)
20-Nov-2018 10:01:01         at app//com.carrotsearch.randomizedtesting.rules.StatementAdapter.evaluate(StatementAdapter.java:36)
20-Nov-2018 10:01:01         at app//com.carrotsearch.randomizedtesting.ThreadLeakControl$StatementRunner.run(ThreadLeakControl.java:368)
20-Nov-2018 10:01:01         at app//com.carrotsearch.randomizedtesting.ThreadLeakControl.forkTimeoutingTask(ThreadLeakControl.java:817)
20-Nov-2018 10:01:01         at app//com.carrotsearch.randomizedtesting.ThreadLeakControl$3.evaluate(ThreadLeakControl.java:468)
20-Nov-2018 10:01:01         at app//com.carrotsearch.randomizedtesting.RandomizedRunner.runSingleTest(RandomizedRunner.java:947)
20-Nov-2018 10:01:01         at app//com.carrotsearch.randomizedtesting.RandomizedRunner$5.evaluate(RandomizedRunner.java:832)
20-Nov-2018 10:01:01         at app//com.carrotsearch.randomizedtesting.RandomizedRunner$6.evaluate(RandomizedRunner.java:883)
20-Nov-2018 10:01:01         at app//com.carrotsearch.randomizedtesting.RandomizedRunner$7.evaluate(RandomizedRunner.java:894)
20-Nov-2018 10:01:01         at app//com.carrotsearch.randomizedtesting.rules.StatementAdapter.evaluate(StatementAdapter.java:36)
20-Nov-2018 10:01:01         at app//com.carrotsearch.randomizedtesting.ThreadLeakControl$StatementRunner.run(ThreadLeakControl.java:368)
20-Nov-2018 10:01:01         at java.base@9.0.4/java.lang.Thread.run(Thread.java:844)
20-Nov-2018 10:01:01
20-Nov-2018 10:01:01 "SUITE-Test020SuiteTimeoutStopsTests$Nested1-seed#[65C54DF42CA67F35]" ID=5795 RUNNABLE
20-Nov-2018 10:01:01         at java.management@9.0.4/sun.management.ThreadImpl.dumpThreads0(Native Method)
20-Nov-2018 10:01:01         at java.management@9.0.4/sun.management.ThreadImpl.dumpAllThreads(ThreadImpl.java:479)
20-Nov-2018 10:01:01         at app//com.carrotsearch.randomizedtesting.ThreadLeakControl.formatThreadStacksFull(ThreadLeakControl.java:681)
20-Nov-2018 10:01:01         at app//com.carrotsearch.randomizedtesting.ThreadLeakControl.access$1000(ThreadLeakControl.java:65)
20-Nov-2018 10:01:01         at app//com.carrotsearch.randomizedtesting.ThreadLeakControl$2.evaluate(ThreadLeakControl.java:415)
20-Nov-2018 10:01:01         - locked java.lang.Object@6baf3fdb
20-Nov-2018 10:01:01         at app//com.carrotsearch.randomizedtesting.RandomizedRunner.runSuite(RandomizedRunner.java:708)
20-Nov-2018 10:01:01         at app//com.carrotsearch.randomizedtesting.RandomizedRunner.access$200(RandomizedRunner.java:138)
20-Nov-2018 10:01:01         at app//com.carrotsearch.randomizedtesting.RandomizedRunner$2.run(RandomizedRunner.java:629)
20-Nov-2018 10:01:01
20-Nov-2018 10:01:01 "Thread-5258" ID=5794 WAITING on com.carrotsearch.randomizedtesting.RandomizedRunner$2@4153605d
20-Nov-2018 10:01:01         at java.base@9.0.4/java.lang.Object.wait(Native Method)
20-Nov-2018 10:01:01         - waiting on com.carrotsearch.randomizedtesting.RandomizedRunner$2@4153605d
20-Nov-2018 10:01:01         at java.base@9.0.4/java.lang.Thread.join(Thread.java:1353)
20-Nov-2018 10:01:01         at java.base@9.0.4/java.lang.Thread.join(Thread.java:1427)
20-Nov-2018 10:01:01         at app//com.carrotsearch.randomizedtesting.RandomizedRunner.runSuite(RandomizedRunner.java:639)
20-Nov-2018 10:01:01         at app//com.carrotsearch.randomizedtesting.RandomizedRunner.run(RandomizedRunner.java:496)
20-Nov-2018 10:01:01         at app//org.junit.runners.Suite.runChild(Suite.java:128)
20-Nov-2018 10:01:01         at app//org.junit.runners.Suite.runChild(Suite.java:27)
20-Nov-2018 10:01:01         at app//org.junit.runners.ParentRunner$3.run(ParentRunner.java:290)
20-Nov-2018 10:01:01         at app//org.junit.runners.ParentRunner$1.schedule(ParentRunner.java:71)
20-Nov-2018 10:01:01         at app//org.junit.runners.ParentRunner.runChildren(ParentRunner.java:288)
20-Nov-2018 10:01:01         at app//org.junit.runners.ParentRunner.access$000(ParentRunner.java:58)
20-Nov-2018 10:01:01         at app//org.junit.runners.ParentRunner$2.evaluate(ParentRunner.java:268)
20-Nov-2018 10:01:01         at app//org.junit.runners.ParentRunner.run(ParentRunner.java:363)
20-Nov-2018 10:01:01         at app//org.junit.runner.JUnitCore.run(JUnitCore.java:137)
20-Nov-2018 10:01:01         at app//org.junit.runner.JUnitCore.run(JUnitCore.java:115)
20-Nov-2018 10:01:01         at app//org.junit.runner.JUnitCore.run(JUnitCore.java:105)
20-Nov-2018 10:01:01         at app//org.junit.runner.JUnitCore.run(JUnitCore.java:94)
20-Nov-2018 10:01:01         at app//com.carrotsearch.randomizedtesting.WithNestedTestClass$5.run(WithNestedTestClass.java:336)
20-Nov-2018 10:01:01
20-Nov-2018 10:01:01 "surefire-forkedjvm-command-thread" ID=13 RUNNABLE (in native code)
20-Nov-2018 10:01:01         at java.base@9.0.4/java.io.FileInputStream.readBytes(Native Method)
20-Nov-2018 10:01:01         at java.base@9.0.4/java.io.FileInputStream.read(FileInputStream.java:256)
20-Nov-2018 10:01:01         at java.base@9.0.4/java.io.BufferedInputStream.fill(BufferedInputStream.java:246)
20-Nov-2018 10:01:01         at java.base@9.0.4/java.io.BufferedInputStream.read(BufferedInputStream.java:265)
20-Nov-2018 10:01:01         - locked java.io.BufferedInputStream@7d30f20d
20-Nov-2018 10:01:01         at java.base@9.0.4/java.io.DataInputStream.readInt(DataInputStream.java:392)
20-Nov-2018 10:01:01         at app//org.apache.maven.surefire.booter.MasterProcessCommand.decode(MasterProcessCommand.java:117)
20-Nov-2018 10:01:01         at app//org.apache.maven.surefire.booter.CommandReader$CommandRunnable.run(CommandReader.java:360)
20-Nov-2018 10:01:01         at java.base@9.0.4/java.lang.Thread.run(Thread.java:844)
20-Nov-2018 10:01:01
20-Nov-2018 10:01:01 "last-ditch-daemon-shutdown-thread-30sec" ID=12 TIMED_WAITING on java.util.concurrent.locks.AbstractQueuedSynchronizer$ConditionObject@4f68f6a0
20-Nov-2018 10:01:01         at java.base@9.0.4/jdk.internal.misc.Unsafe.park(Native Method)
20-Nov-2018 10:01:01         - timed waiting on java.util.concurrent.locks.AbstractQueuedSynchronizer$ConditionObject@4f68f6a0
20-Nov-2018 10:01:01         at java.base@9.0.4/java.util.concurrent.locks.LockSupport.parkNanos(LockSupport.java:234)
20-Nov-2018 10:01:01         at java.base@9.0.4/java.util.concurrent.locks.AbstractQueuedSynchronizer$ConditionObject.awaitNanos(AbstractQueuedSynchronizer.java:2104)
20-Nov-2018 10:01:01         at java.base@9.0.4/java.util.concurrent.ScheduledThreadPoolExecutor$DelayedWorkQueue.take(ScheduledThreadPoolExecutor.java:1131)
20-Nov-2018 10:01:01         at java.base@9.0.4/java.util.concurrent.ScheduledThreadPoolExecutor$DelayedWorkQueue.take(ScheduledThreadPoolExecutor.java:848)
20-Nov-2018 10:01:01         at java.base@9.0.4/java.util.concurrent.ThreadPoolExecutor.getTask(ThreadPoolExecutor.java:1092)
20-Nov-2018 10:01:01         at java.base@9.0.4/java.util.concurrent.ThreadPoolExecutor.runWorker(ThreadPoolExecutor.java:1152)
20-Nov-2018 10:01:01         at java.base@9.0.4/java.util.concurrent.ThreadPoolExecutor$Worker.run(ThreadPoolExecutor.java:641)
20-Nov-2018 10:01:01         at java.base@9.0.4/java.lang.Thread.run(Thread.java:844)
20-Nov-2018 10:01:01
20-Nov-2018 10:01:01 "Common-Cleaner" ID=10 TIMED_WAITING on java.lang.ref.ReferenceQueue$Lock@5eef151
20-Nov-2018 10:01:01         at java.base@9.0.4/java.lang.Object.wait(Native Method)
20-Nov-2018 10:01:01         - timed waiting on java.lang.ref.ReferenceQueue$Lock@5eef151
20-Nov-2018 10:01:01         at java.base@9.0.4/java.lang.ref.ReferenceQueue.remove(ReferenceQueue.java:151)
20-Nov-2018 10:01:01         at java.base@9.0.4/jdk.internal.ref.CleanerImpl.run(CleanerImpl.java:148)
20-Nov-2018 10:01:01         at java.base@9.0.4/java.lang.Thread.run(Thread.java:844)
20-Nov-2018 10:01:01         at java.base@9.0.4/jdk.internal.misc.InnocuousThread.run(InnocuousThread.java:122)
20-Nov-2018 10:01:01
20-Nov-2018 10:01:01 "Signal Dispatcher" ID=4 RUNNABLE
20-Nov-2018 10:01:01
20-Nov-2018 10:01:01 "Finalizer" ID=3 WAITING on java.lang.ref.ReferenceQueue$Lock@1e73540e
20-Nov-2018 10:01:01         at java.base@9.0.4/java.lang.Object.wait(Native Method)
20-Nov-2018 10:01:01         - waiting on java.lang.ref.ReferenceQueue$Lock@1e73540e
20-Nov-2018 10:01:01         at java.base@9.0.4/java.lang.ref.ReferenceQueue.remove(ReferenceQueue.java:151)
20-Nov-2018 10:01:01         at java.base@9.0.4/java.lang.ref.ReferenceQueue.remove(ReferenceQueue.java:172)
20-Nov-2018 10:01:01         at java.base@9.0.4/java.lang.ref.Finalizer$FinalizerThread.run(Finalizer.java:216)
20-Nov-2018 10:01:01
20-Nov-2018 10:01:01 "Reference Handler" ID=2 RUNNABLE
20-Nov-2018 10:01:01         at java.base@9.0.4/java.lang.ref.Reference.waitForReferencePendingList(Native Method)
20-Nov-2018 10:01:01         at java.base@9.0.4/java.lang.ref.Reference.processPendingReferences(Reference.java:174)
20-Nov-2018 10:01:01         at java.base@9.0.4/java.lang.ref.Reference.access$000(Reference.java:44)
20-Nov-2018 10:01:01         at java.base@9.0.4/java.lang.ref.Reference$ReferenceHandler.run(Reference.java:138)
20-Nov-2018 10:01:01
20-Nov-2018 10:01:01 "main" ID=1 WAITING on com.carrotsearch.randomizedtesting.WithNestedTestClass$5@456cfcaf
20-Nov-2018 10:01:01         at java.base@9.0.4/java.lang.Object.wait(Native Method)
20-Nov-2018 10:01:01         - waiting on com.carrotsearch.randomizedtesting.WithNestedTestClass$5@456cfcaf
20-Nov-2018 10:01:01         at java.base@9.0.4/java.lang.Thread.join(Thread.java:1353)
20-Nov-2018 10:01:01         at java.base@9.0.4/java.lang.Thread.join(Thread.java:1427)
20-Nov-2018 10:01:01         at app//com.carrotsearch.randomizedtesting.WithNestedTestClass.runTests(WithNestedTestClass.java:341)
20-Nov-2018 10:01:01         at app//com.carrotsearch.randomizedtesting.timeouts.Test020SuiteTimeoutStopsTests.testExceptionInFilter(Test020SuiteTimeoutStopsTests.java:63)
20-Nov-2018 10:01:01         at java.base@9.0.4/jdk.internal.reflect.NativeMethodAccessorImpl.invoke0(Native Method)
20-Nov-2018 10:01:01         at java.base@9.0.4/jdk.internal.reflect.NativeMethodAccessorImpl.invoke(NativeMethodAccessorImpl.java:62)
20-Nov-2018 10:01:01         at java.base@9.0.4/jdk.internal.reflect.DelegatingMethodAccessorImpl.invoke(DelegatingMethodAccessorImpl.java:43)
20-Nov-2018 10:01:01         at java.base@9.0.4/java.lang.reflect.Method.invoke(Method.java:564)
20-Nov-2018 10:01:01         at app//org.junit.runners.model.FrameworkMethod$1.runReflectiveCall(FrameworkMethod.java:50)
20-Nov-2018 10:01:01         at app//org.junit.internal.runners.model.ReflectiveCallable.run(ReflectiveCallable.java:12)
20-Nov-2018 10:01:01         at app//org.junit.runners.model.FrameworkMethod.invokeExplosively(FrameworkMethod.java:47)
20-Nov-2018 10:01:01         at app//org.junit.internal.runners.statements.InvokeMethod.evaluate(InvokeMethod.java:17)
20-Nov-2018 10:01:01         at app//org.junit.internal.runners.statements.RunBefores.evaluate(RunBefores.java:26)
20-Nov-2018 10:01:01         at app//org.junit.internal.runners.statements.RunAfters.evaluate(RunAfters.java:27)
20-Nov-2018 10:01:01         at app//org.junit.runners.ParentRunner.runLeaf(ParentRunner.java:325)
20-Nov-2018 10:01:01         at app//org.junit.runners.BlockJUnit4ClassRunner.runChild(BlockJUnit4ClassRunner.java:78)
20-Nov-2018 10:01:01         at app//org.junit.runners.BlockJUnit4ClassRunner.runChild(BlockJUnit4ClassRunner.java:57)
20-Nov-2018 10:01:01         at app//org.junit.runners.ParentRunner$3.run(ParentRunner.java:290)
20-Nov-2018 10:01:01         at app//org.junit.runners.ParentRunner$1.schedule(ParentRunner.java:71)
20-Nov-2018 10:01:01         at app//org.junit.runners.ParentRunner.runChildren(ParentRunner.java:288)
20-Nov-2018 10:01:01         at app//org.junit.runners.ParentRunner.access$000(ParentRunner.java:58)
20-Nov-2018 10:01:01         at app//org.junit.runners.ParentRunner$2.evaluate(ParentRunner.java:268)
20-Nov-2018 10:01:01         at app//org.junit.internal.runners.statements.RunBefores.evaluate(RunBefores.java:26)
20-Nov-2018 10:01:01         at app//org.junit.internal.runners.statements.RunAfters.evaluate(RunAfters.java:27)
20-Nov-2018 10:01:01         at app//com.carrotsearch.randomizedtesting.rules.StatementAdapter.evaluate(StatementAdapter.java:36)
20-Nov-2018 10:01:01         at app//com.carrotsearch.randomizedtesting.rules.SystemPropertiesInvariantRule$1.evaluate(SystemPropertiesInvariantRule.java:59)
20-Nov-2018 10:01:01         at app//org.junit.rules.RunRules.evaluate(RunRules.java:20)
20-Nov-2018 10:01:01         at app//org.junit.runners.ParentRunner.run(ParentRunner.java:363)
20-Nov-2018 10:01:01         at app//org.apache.maven.surefire.junit4.JUnit4Provider.execute(JUnit4Provider.java:367)
20-Nov-2018 10:01:01         at app//org.apache.maven.surefire.junit4.JUnit4Provider.executeWithRerun(JUnit4Provider.java:274)
20-Nov-2018 10:01:01         at app//org.apache.maven.surefire.junit4.JUnit4Provider.executeTestSet(JUnit4Provider.java:238)
20-Nov-2018 10:01:01         at app//org.apache.maven.surefire.junit4.JUnit4Provider.invoke(JUnit4Provider.java:161)
20-Nov-2018 10:01:01         at app//org.apache.maven.surefire.booter.ForkedBooter.invokeProviderInSameClassLoader(ForkedBooter.java:290)
20-Nov-2018 10:01:01         at app//org.apache.maven.surefire.booter.ForkedBooter.runSuitesInProcess(ForkedBooter.java:242)
20-Nov-2018 10:01:01         at app//org.apache.maven.surefire.booter.ForkedBooter.main(ForkedBooter.java:121)
20-Nov-2018 10:01:01
20-Nov-2018 10:01:01 ^^==============================================
20-Nov-2018 10:01:01
20-Nov-2018 10:01:01
20-Nov-2018 10:01:01 Nov 20, 2018 10:01:01 AM com.carrotsearch.randomizedtesting.ThreadLeakControl checkThreadLeaks
20-Nov-2018 10:01:01 SEVERE: 1 thread leaked from SUITE scope at com.carrotsearch.randomizedtesting.timeouts.Test020SuiteTimeoutStopsTests$Nested1:
20-Nov-2018 10:01:01    1) Thread[id=5796, name=TEST-Test020SuiteTimeoutStopsTests$Nested1.test002-seed#[65C54DF42CA67F35], state=TIMED_WAITING, group=TGRP-Test020SuiteTimeoutStopsTests$Nested1]
20-Nov-2018 10:01:01         at java.base@9.0.4/java.lang.Thread.sleep(Native Method)
20-Nov-2018 10:01:01         at app//com.carrotsearch.randomizedtesting.timeouts.Test020SuiteTimeoutStopsTests$Nested1.idle(Test020SuiteTimeoutStopsTests.java:49)
20-Nov-2018 10:01:01         at app//com.carrotsearch.randomizedtesting.timeouts.Test020SuiteTimeoutStopsTests$Nested1.test002(Test020SuiteTimeoutStopsTests.java:27)
20-Nov-2018 10:01:01         at java.base@9.0.4/jdk.internal.reflect.NativeMethodAccessorImpl.invoke0(Native Method)
20-Nov-2018 10:01:01         at java.base@9.0.4/jdk.internal.reflect.NativeMethodAccessorImpl.invoke(NativeMethodAccessorImpl.java:62)
20-Nov-2018 10:01:01         at java.base@9.0.4/jdk.internal.reflect.DelegatingMethodAccessorImpl.invoke(DelegatingMethodAccessorImpl.java:43)
20-Nov-2018 10:01:01         at java.base@9.0.4/java.lang.reflect.Method.invoke(Method.java:564)
20-Nov-2018 10:01:01         at app//com.carrotsearch.randomizedtesting.RandomizedRunner.invoke(RandomizedRunner.java:1750)
20-Nov-2018 10:01:01         at app//com.carrotsearch.randomizedtesting.RandomizedRunner$8.evaluate(RandomizedRunner.java:938)
20-Nov-2018 10:01:01         at app//com.carrotsearch.randomizedtesting.rules.StatementAdapter.evaluate(StatementAdapter.java:36)
20-Nov-2018 10:01:01         at app//com.carrotsearch.randomizedtesting.ThreadLeakControl$StatementRunner.run(ThreadLeakControl.java:368)
20-Nov-2018 10:01:01         at app//com.carrotsearch.randomizedtesting.ThreadLeakControl.forkTimeoutingTask(ThreadLeakControl.java:817)
20-Nov-2018 10:01:01         at app//com.carrotsearch.randomizedtesting.ThreadLeakControl$3.evaluate(ThreadLeakControl.java:468)
20-Nov-2018 10:01:01         at app//com.carrotsearch.randomizedtesting.RandomizedRunner.runSingleTest(RandomizedRunner.java:947)
20-Nov-2018 10:01:01         at app//com.carrotsearch.randomizedtesting.RandomizedRunner$5.evaluate(RandomizedRunner.java:832)
20-Nov-2018 10:01:01         at app//com.carrotsearch.randomizedtesting.RandomizedRunner$6.evaluate(RandomizedRunner.java:883)
20-Nov-2018 10:01:01         at app//com.carrotsearch.randomizedtesting.RandomizedRunner$7.evaluate(RandomizedRunner.java:894)
20-Nov-2018 10:01:01         at app//com.carrotsearch.randomizedtesting.rules.StatementAdapter.evaluate(StatementAdapter.java:36)
20-Nov-2018 10:01:01         at app//com.carrotsearch.randomizedtesting.ThreadLeakControl$StatementRunner.run(ThreadLeakControl.java:368)
20-Nov-2018 10:01:01         at java.base@9.0.4/java.lang.Thread.run(Thread.java:844)
20-Nov-2018 10:01:01
20-Nov-2018 10:01:01 Nov 20, 2018 10:01:01 AM com.carrotsearch.randomizedtesting.ThreadLeakControl tryToInterruptAll
20-Nov-2018 10:01:01 INFO: Starting to interrupt leaked threads:
20-Nov-2018 10:01:01    1) Thread[id=5796, name=TEST-Test020SuiteTimeoutStopsTests$Nested1.test002-seed#[65C54DF42CA67F35], state=TIMED_WAITING, group=TGRP-Test020SuiteTimeoutStopsTests$Nested1]
20-Nov-2018 10:01:01
20-Nov-2018 10:01:01 Nov 20, 2018 10:01:01 AM com.carrotsearch.randomizedtesting.ThreadLeakControl tryToInterruptAll
20-Nov-2018 10:01:01 INFO: All leaked threads terminated.
20-Nov-2018 10:01:01
20-Nov-2018 10:01:01
20-Nov-2018 10:01:01 Tests run: 1, Failures: 0, Errors: 0, Skipped: 0, Time elapsed: 0.592 sec - in com.carrotsearch.randomizedtesting.timeouts.Test020SuiteTimeoutStopsTests
20-Nov-2018 10:01:01 Running com.carrotsearch.randomizedtesting.timeouts.Test019ThreadLeakGroup
20-Nov-2018 10:01:01 Run started.
20-Nov-2018 10:01:01 Started : testLeakOutsideOfGroup
20-Nov-2018 10:01:01 Failure : testLeakOutsideOfGroup(com.carrotsearch.randomizedtesting.timeouts.Test019ThreadLeakGroup$Nested3): 1 thread leaked from TEST scope at testLeakOutsideOfGroup(com.carrotsearch.randomizedtesting.timeouts.Test019ThreadLeakGroup$Nested3):
20-Nov-2018 10:01:01    1) Thread[id=5799, name=foobar, state=TIMED_WAITING, group=foobar-group]
20-Nov-2018 10:01:01         at java.base@9.0.4/java.lang.Thread.sleep(Native Method)
20-Nov-2018 10:01:01         at app//com.carrotsearch.randomizedtesting.timeouts.Test019ThreadLeakGroup$Nested1$1.run(Test019ThreadLeakGroup.java:37)
20-Nov-2018 10:01:01 Finished: testLeakOutsideOfGroup
20-Nov-2018 10:01:01 Run finished: run=1, ignored=0, failures=1, assumptions=0
20-Nov-2018 10:01:01
20-Nov-2018 10:01:01 Run started.
20-Nov-2018 10:01:01 Started : testLeakOutsideOfGroup
20-Nov-2018 10:01:01 Finished: testLeakOutsideOfGroup
20-Nov-2018 10:01:01 Run finished: run=1, ignored=0, failures=0, assumptions=0
20-Nov-2018 10:01:01
20-Nov-2018 10:01:01 Run started.
20-Nov-2018 10:01:01 Started : testLeakOutsideOfGroup
20-Nov-2018 10:01:01 Finished: testLeakOutsideOfGroup
20-Nov-2018 10:01:01 Run finished: run=1, ignored=0, failures=0, assumptions=0
20-Nov-2018 10:01:01
20-Nov-2018 10:01:01 Tests run: 3, Failures: 0, Errors: 0, Skipped: 0, Time elapsed: 0.009 sec - in com.carrotsearch.randomizedtesting.timeouts.Test019ThreadLeakGroup
20-Nov-2018 10:01:01 Running com.carrotsearch.randomizedtesting.timeouts.Test001TimeoutSuite
20-Nov-2018 10:01:01 Run started.
20-Nov-2018 10:01:02 Failure : com.carrotsearch.randomizedtesting.timeouts.Test001TimeoutSuite$Nested: Suite timeout exceeded (>= 500 msec).
20-Nov-2018 10:01:02 Run finished: run=0, ignored=0, failures=1, assumptions=0
20-Nov-2018 10:01:02
20-Nov-2018 10:01:02 Run started.
20-Nov-2018 10:01:02 Started : testMethod
20-Nov-2018 10:01:03 Failure : testMethod(com.carrotsearch.randomizedtesting.timeouts.Test001TimeoutSuite$Nested): Test abandoned because suite timeout was reached.
20-Nov-2018 10:01:03 Finished: testMethod
20-Nov-2018 10:01:03 Failure : com.carrotsearch.randomizedtesting.timeouts.Test001TimeoutSuite$Nested: Suite timeout exceeded (>= 500 msec).
20-Nov-2018 10:01:03 Run finished: run=1, ignored=0, failures=2, assumptions=0
20-Nov-2018 10:01:03
20-Nov-2018 10:01:03 Run started.
20-Nov-2018 10:01:03 Started : testMethod
20-Nov-2018 10:01:03 Failure : testMethod(com.carrotsearch.randomizedtesting.timeouts.Test001TimeoutSuite$Nested): Test abandoned because suite timeout was reached.
20-Nov-2018 10:01:03 Finished: testMethod
20-Nov-2018 10:01:03 Failure : com.carrotsearch.randomizedtesting.timeouts.Test001TimeoutSuite$Nested: Suite timeout exceeded (>= 500 msec).
20-Nov-2018 10:01:03 Run finished: run=1, ignored=0, failures=2, assumptions=0
20-Nov-2018 10:01:03
20-Nov-2018 10:01:03 Run started.
20-Nov-2018 10:01:03 Started : testMethod
20-Nov-2018 10:01:04 Failure : testMethod(com.carrotsearch.randomizedtesting.timeouts.Test001TimeoutSuite$Nested): Test abandoned because suite timeout was reached.
20-Nov-2018 10:01:04 Finished: testMethod
20-Nov-2018 10:01:04 Failure : com.carrotsearch.randomizedtesting.timeouts.Test001TimeoutSuite$Nested: Suite timeout exceeded (>= 500 msec).
20-Nov-2018 10:01:04 Run finished: run=1, ignored=0, failures=2, assumptions=0
20-Nov-2018 10:01:04
20-Nov-2018 10:01:04 Run started.
20-Nov-2018 10:01:04 Failure : com.carrotsearch.randomizedtesting.timeouts.Test001TimeoutSuite$Nested: Suite timeout exceeded (>= 500 msec).
20-Nov-2018 10:01:04 Run finished: run=0, ignored=0, failures=1, assumptions=0
20-Nov-2018 10:01:04
20-Nov-2018 10:01:04 Run started.
20-Nov-2018 10:01:04 Started : testMethod
20-Nov-2018 10:01:04 Finished: testMethod
20-Nov-2018 10:01:05 Failure : com.carrotsearch.randomizedtesting.timeouts.Test001TimeoutSuite$Nested: Suite timeout exceeded (>= 500 msec).
20-Nov-2018 10:01:05 Run finished: run=1, ignored=0, failures=1, assumptions=0
20-Nov-2018 10:01:05
20-Nov-2018 10:01:05 Run started.
20-Nov-2018 10:01:05 Started : testMethod
20-Nov-2018 10:01:05 Failure : testMethod(com.carrotsearch.randomizedtesting.timeouts.Test001TimeoutSuite$Nested): Test abandoned because suite timeout was reached.
20-Nov-2018 10:01:05 Finished: testMethod
20-Nov-2018 10:01:05 Failure : com.carrotsearch.randomizedtesting.timeouts.Test001TimeoutSuite$Nested: Suite timeout exceeded (>= 500 msec).
20-Nov-2018 10:01:05 Run finished: run=1, ignored=0, failures=2, assumptions=0
20-Nov-2018 10:01:05
20-Nov-2018 10:01:05 Run started.
20-Nov-2018 10:01:05 Started : testMethod
20-Nov-2018 10:01:06 Failure : testMethod(com.carrotsearch.randomizedtesting.timeouts.Test001TimeoutSuite$Nested): Test abandoned because suite timeout was reached.
20-Nov-2018 10:01:06 Finished: testMethod
20-Nov-2018 10:01:06 Failure : com.carrotsearch.randomizedtesting.timeouts.Test001TimeoutSuite$Nested: Suite timeout exceeded (>= 500 msec).
20-Nov-2018 10:01:06 Run finished: run=1, ignored=0, failures=2, assumptions=0
20-Nov-2018 10:01:06
20-Nov-2018 10:01:06 Tests run: 8, Failures: 0, Errors: 0, Skipped: 0, Time elapsed: 4.646 sec - in com.carrotsearch.randomizedtesting.timeouts.Test001TimeoutSuite
20-Nov-2018 10:01:06 Running com.carrotsearch.randomizedtesting.timeouts.Test007UncaughtExceptions
20-Nov-2018 10:01:06 Run started.
20-Nov-2018 10:01:06 Started : checkGlobal
20-Nov-2018 10:01:06 Failure : checkGlobal(com.carrotsearch.randomizedtesting.timeouts.Test007UncaughtExceptions$Nested): Captured an uncaught exception in thread: Thread[id=5837, name=XYZ, state=RUNNABLE, group=system]
20-Nov-2018 10:01:06 Finished: checkGlobal
20-Nov-2018 10:01:06 Run finished: run=1, ignored=0, failures=1, assumptions=0
20-Nov-2018 10:01:06
20-Nov-2018 10:01:06 Run started.
20-Nov-2018 10:01:06 Started : checkGlobal
20-Nov-2018 10:01:06 Failure : checkGlobal(com.carrotsearch.randomizedtesting.timeouts.Test007UncaughtExceptions$Nested): Captured an uncaught exception in thread: Thread[id=5840, name=XYZ, state=RUNNABLE, group=TGRP-Test007UncaughtExceptions$Nested]
20-Nov-2018 10:01:06 Finished: checkGlobal
20-Nov-2018 10:01:06 Run finished: run=1, ignored=0, failures=1, assumptions=0
20-Nov-2018 10:01:06
20-Nov-2018 10:01:06 Tests run: 2, Failures: 0, Errors: 0, Skipped: 0, Time elapsed: 0.008 sec - in com.carrotsearch.randomizedtesting.timeouts.Test007UncaughtExceptions
20-Nov-2018 10:01:06 Running com.carrotsearch.randomizedtesting.timeouts.Test003ThreadLeaksMethod
20-Nov-2018 10:01:06 Run started.
20-Nov-2018 10:01:06 Started : testMethod
20-Nov-2018 10:01:06 Finished: testMethod
20-Nov-2018 10:01:06 Failure : com.carrotsearch.randomizedtesting.timeouts.Test003ThreadLeaksMethod$Nested: 1 thread leaked from SUITE scope at com.carrotsearch.randomizedtesting.timeouts.Test003ThreadLeaksMethod$Nested:
20-Nov-2018 10:01:06    1) Thread[id=5843, name=foobar, state=TIMED_WAITING, group=TGRP-Test003ThreadLeaksMethod$Nested]
20-Nov-2018 10:01:06         at java.base@9.0.4/java.lang.Thread.sleep(Native Method)
20-Nov-2018 10:01:06         at app//com.carrotsearch.randomizedtesting.RandomizedTest.sleep(RandomizedTest.java:681)
20-Nov-2018 10:01:06         at app//com.carrotsearch.randomizedtesting.WithNestedTestClass$4.sleepForever(WithNestedTestClass.java:278)
20-Nov-2018 10:01:06         at app//com.carrotsearch.randomizedtesting.WithNestedTestClass$4.run(WithNestedTestClass.java:274)
20-Nov-2018 10:01:06 Run finished: run=1, ignored=0, failures=1, assumptions=0
20-Nov-2018 10:01:06
20-Nov-2018 10:01:06 Run started.
20-Nov-2018 10:01:06 Started : testMethod
20-Nov-2018 10:01:06 Failure : testMethod(com.carrotsearch.randomizedtesting.timeouts.Test003ThreadLeaksMethod$Nested): 1 thread leaked from TEST scope at testMethod(com.carrotsearch.randomizedtesting.timeouts.Test003ThreadLeaksMethod$Nested):
20-Nov-2018 10:01:06    1) Thread[id=5846, name=foobar, state=TIMED_WAITING, group=TGRP-Test003ThreadLeaksMethod$Nested]
20-Nov-2018 10:01:06         at java.base@9.0.4/java.lang.Thread.sleep(Native Method)
20-Nov-2018 10:01:06         at app//com.carrotsearch.randomizedtesting.RandomizedTest.sleep(RandomizedTest.java:681)
20-Nov-2018 10:01:06         at app//com.carrotsearch.randomizedtesting.WithNestedTestClass$4.sleepForever(WithNestedTestClass.java:278)
20-Nov-2018 10:01:06         at app//com.carrotsearch.randomizedtesting.WithNestedTestClass$4.run(WithNestedTestClass.java:274)
20-Nov-2018 10:01:06 Finished: testMethod
20-Nov-2018 10:01:06 Run finished: run=1, ignored=0, failures=1, assumptions=0
20-Nov-2018 10:01:06
20-Nov-2018 10:01:06 Run started.
20-Nov-2018 10:01:06 Started : testMethod
20-Nov-2018 10:01:06 Failure : testMethod(com.carrotsearch.randomizedtesting.timeouts.Test003ThreadLeaksMethod$Nested): 1 thread leaked from TEST scope at testMethod(com.carrotsearch.randomizedtesting.timeouts.Test003ThreadLeaksMethod$Nested):
20-Nov-2018 10:01:06    1) Thread[id=5849, name=foobar, state=TIMED_WAITING, group=TGRP-Test003ThreadLeaksMethod$Nested]
20-Nov-2018 10:01:06         at java.base@9.0.4/java.lang.Thread.sleep(Native Method)
20-Nov-2018 10:01:06         at app//com.carrotsearch.randomizedtesting.RandomizedTest.sleep(RandomizedTest.java:681)
20-Nov-2018 10:01:06         at app//com.carrotsearch.randomizedtesting.WithNestedTestClass$4.sleepForever(WithNestedTestClass.java:278)
20-Nov-2018 10:01:06         at app//com.carrotsearch.randomizedtesting.WithNestedTestClass$4.run(WithNestedTestClass.java:274)
20-Nov-2018 10:01:06 Finished: testMethod
20-Nov-2018 10:01:06 Run finished: run=1, ignored=0, failures=1, assumptions=0
20-Nov-2018 10:01:06
20-Nov-2018 10:01:06 Run started.
20-Nov-2018 10:01:06 Started : testMethod
20-Nov-2018 10:01:06 Failure : testMethod(com.carrotsearch.randomizedtesting.timeouts.Test003ThreadLeaksMethod$Nested): 1 thread leaked from TEST scope at testMethod(com.carrotsearch.randomizedtesting.timeouts.Test003ThreadLeaksMethod$Nested):
20-Nov-2018 10:01:06    1) Thread[id=5852, name=foobar, state=TIMED_WAITING, group=TGRP-Test003ThreadLeaksMethod$Nested]
20-Nov-2018 10:01:06         at java.base@9.0.4/java.lang.Thread.sleep(Native Method)
20-Nov-2018 10:01:06         at app//com.carrotsearch.randomizedtesting.RandomizedTest.sleep(RandomizedTest.java:681)
20-Nov-2018 10:01:06         at app//com.carrotsearch.randomizedtesting.WithNestedTestClass$4.sleepForever(WithNestedTestClass.java:278)
20-Nov-2018 10:01:06         at app//com.carrotsearch.randomizedtesting.WithNestedTestClass$4.run(WithNestedTestClass.java:274)
20-Nov-2018 10:01:06 Finished: testMethod
20-Nov-2018 10:01:06 Run finished: run=1, ignored=0, failures=1, assumptions=0
20-Nov-2018 10:01:06
20-Nov-2018 10:01:06 Run started.
20-Nov-2018 10:01:06 Started : testMethod
20-Nov-2018 10:01:06 Finished: testMethod
20-Nov-2018 10:01:06 Failure : com.carrotsearch.randomizedtesting.timeouts.Test003ThreadLeaksMethod$Nested: 1 thread leaked from SUITE scope at com.carrotsearch.randomizedtesting.timeouts.Test003ThreadLeaksMethod$Nested:
20-Nov-2018 10:01:06    1) Thread[id=5855, name=foobar, state=TIMED_WAITING, group=TGRP-Test003ThreadLeaksMethod$Nested]
20-Nov-2018 10:01:06         at java.base@9.0.4/java.lang.Thread.sleep(Native Method)
20-Nov-2018 10:01:06         at app//com.carrotsearch.randomizedtesting.RandomizedTest.sleep(RandomizedTest.java:681)
20-Nov-2018 10:01:06         at app//com.carrotsearch.randomizedtesting.WithNestedTestClass$4.sleepForever(WithNestedTestClass.java:278)
20-Nov-2018 10:01:06         at app//com.carrotsearch.randomizedtesting.WithNestedTestClass$4.run(WithNestedTestClass.java:274)
20-Nov-2018 10:01:06 Run finished: run=1, ignored=0, failures=1, assumptions=0
20-Nov-2018 10:01:06
20-Nov-2018 10:01:06 Run started.
20-Nov-2018 10:01:06 Started : testMethod
20-Nov-2018 10:01:06 Finished: testMethod
20-Nov-2018 10:01:06 Failure : com.carrotsearch.randomizedtesting.timeouts.Test003ThreadLeaksMethod$Nested: 1 thread leaked from SUITE scope at com.carrotsearch.randomizedtesting.timeouts.Test003ThreadLeaksMethod$Nested:
20-Nov-2018 10:01:06    1) Thread[id=5858, name=foobar, state=TIMED_WAITING, group=TGRP-Test003ThreadLeaksMethod$Nested]
20-Nov-2018 10:01:06         at java.base@9.0.4/java.lang.Thread.sleep(Native Method)
20-Nov-2018 10:01:06         at app//com.carrotsearch.randomizedtesting.RandomizedTest.sleep(RandomizedTest.java:681)
20-Nov-2018 10:01:06         at app//com.carrotsearch.randomizedtesting.WithNestedTestClass$4.sleepForever(WithNestedTestClass.java:278)
20-Nov-2018 10:01:06         at app//com.carrotsearch.randomizedtesting.WithNestedTestClass$4.run(WithNestedTestClass.java:274)
20-Nov-2018 10:01:06 Run finished: run=1, ignored=0, failures=1, assumptions=0
20-Nov-2018 10:01:06
20-Nov-2018 10:01:06 Run started.
20-Nov-2018 10:01:06 Started : testMethod
20-Nov-2018 10:01:06 Failure : testMethod(com.carrotsearch.randomizedtesting.timeouts.Test003ThreadLeaksMethod$Nested): 1 thread leaked from TEST scope at testMethod(com.carrotsearch.randomizedtesting.timeouts.Test003ThreadLeaksMethod$Nested):
20-Nov-2018 10:01:06    1) Thread[id=5861, name=foobar, state=TIMED_WAITING, group=TGRP-Test003ThreadLeaksMethod$Nested]
20-Nov-2018 10:01:06         at java.base@9.0.4/java.lang.Thread.sleep(Native Method)
20-Nov-2018 10:01:06         at app//com.carrotsearch.randomizedtesting.RandomizedTest.sleep(RandomizedTest.java:681)
20-Nov-2018 10:01:06         at app//com.carrotsearch.randomizedtesting.WithNestedTestClass$4.sleepForever(WithNestedTestClass.java:278)
20-Nov-2018 10:01:06         at app//com.carrotsearch.randomizedtesting.WithNestedTestClass$4.run(WithNestedTestClass.java:274)
20-Nov-2018 10:01:06 Finished: testMethod
20-Nov-2018 10:01:06 Run finished: run=1, ignored=0, failures=1, assumptions=0
20-Nov-2018 10:01:06
20-Nov-2018 10:01:06 Run started.
20-Nov-2018 10:01:06 Started : testMethod
20-Nov-2018 10:01:06 Finished: testMethod
20-Nov-2018 10:01:06 Failure : com.carrotsearch.randomizedtesting.timeouts.Test003ThreadLeaksMethod$Nested: 1 thread leaked from SUITE scope at com.carrotsearch.randomizedtesting.timeouts.Test003ThreadLeaksMethod$Nested:
20-Nov-2018 10:01:06    1) Thread[id=5864, name=foobar, state=TIMED_WAITING, group=TGRP-Test003ThreadLeaksMethod$Nested]
20-Nov-2018 10:01:06         at java.base@9.0.4/java.lang.Thread.sleep(Native Method)
20-Nov-2018 10:01:06         at app//com.carrotsearch.randomizedtesting.RandomizedTest.sleep(RandomizedTest.java:681)
20-Nov-2018 10:01:06         at app//com.carrotsearch.randomizedtesting.WithNestedTestClass$4.sleepForever(WithNestedTestClass.java:278)
20-Nov-2018 10:01:06         at app//com.carrotsearch.randomizedtesting.WithNestedTestClass$4.run(WithNestedTestClass.java:274)
20-Nov-2018 10:01:06 Run finished: run=1, ignored=0, failures=1, assumptions=0
20-Nov-2018 10:01:06
20-Nov-2018 10:01:06 Tests run: 8, Failures: 0, Errors: 0, Skipped: 0, Time elapsed: 0.052 sec - in com.carrotsearch.randomizedtesting.timeouts.Test003ThreadLeaksMethod
20-Nov-2018 10:01:06 Running com.carrotsearch.randomizedtesting.TestRandomizedContext
20-Nov-2018 10:01:06 Tests run: 1, Failures: 0, Errors: 0, Skipped: 0, Time elapsed: 0.005 sec - in com.carrotsearch.randomizedtesting.TestRandomizedContext
20-Nov-2018 10:01:06 Running com.carrotsearch.randomizedtesting.TestExpected
20-Nov-2018 10:01:06 Run started.
20-Nov-2018 10:01:06 Started : testMethod1
20-Nov-2018 10:01:06 Failure : testMethod1(com.carrotsearch.randomizedtesting.TestExpected$Nested2): Expected an exception but the test passed: java.lang.RuntimeException
20-Nov-2018 10:01:06 Finished: testMethod1
20-Nov-2018 10:01:06 Run finished: run=1, ignored=0, failures=1, assumptions=0
20-Nov-2018 10:01:06
20-Nov-2018 10:01:06 Run started.
20-Nov-2018 10:01:06 Started : testMethod2
20-Nov-2018 10:01:06 Failure : testMethod2(com.carrotsearch.randomizedtesting.TestExpected$Nested1): null
20-Nov-2018 10:01:06 Finished: testMethod2
20-Nov-2018 10:01:06 Started : testMethod1
20-Nov-2018 10:01:06 Finished: testMethod1
20-Nov-2018 10:01:06 Run finished: run=2, ignored=0, failures=1, assumptions=0
20-Nov-2018 10:01:06
20-Nov-2018 10:01:06 Tests run: 2, Failures: 0, Errors: 0, Skipped: 0, Time elapsed: 0.013 sec - in com.carrotsearch.randomizedtesting.TestExpected
20-Nov-2018 10:01:06 Running com.carrotsearch.randomizedtesting.TestValidation
20-Nov-2018 10:01:06 Tests run: 1, Failures: 0, Errors: 0, Skipped: 0, Time elapsed: 0 sec - in com.carrotsearch.randomizedtesting.TestValidation
20-Nov-2018 10:01:06 Running com.carrotsearch.randomizedtesting.TestBiasedNumbers
20-Nov-2018 10:01:06       6066        551        516        555        542       8179        619        540        525        550       6161
20-Nov-2018 10:01:06        500         38         48         42         44        740         42         52         47         39        544
20-Nov-2018 10:01:06        481         56         53         37         48        793         39         57         42         55        551
20-Nov-2018 10:01:06        561         47         57         55         52        724         46         40         42         50        522
20-Nov-2018 10:01:06        538         36         48         52         52        740         53         44         45         40        543
20-Nov-2018 10:01:06       8141        742        708        750        763      10815        746        737        744        691       8327
20-Nov-2018 10:01:06        543         35         40         45         60        833         42         41         50         47        526
20-Nov-2018 10:01:06        563         51         57         55         43        730         44         58         35         44        563
20-Nov-2018 10:01:06        529         47         48         59         50        663         56         58         38         47        503
20-Nov-2018 10:01:06        515         45         42         51         47        713         59         48         58         45        528
20-Nov-2018 10:01:06       5840        501        515        582        579       8188        590        556        570        567       6055
20-Nov-2018 10:01:06 Tests run: 201, Failures: 0, Errors: 0, Skipped: 0, Time elapsed: 0.296 sec - in com.carrotsearch.randomizedtesting.TestBiasedNumbers
20-Nov-2018 10:01:06 Running com.carrotsearch.randomizedtesting.TestSetSeedLocked
20-Nov-2018 10:01:06 Tests run: 1, Failures: 0, Errors: 0, Skipped: 0, Time elapsed: 0 sec - in com.carrotsearch.randomizedtesting.TestSetSeedLocked
20-Nov-2018 10:01:06 Running com.carrotsearch.randomizedtesting.TestTestCaseOrdering
20-Nov-2018 10:01:06 Run started.
20-Nov-2018 10:01:06 Started : a {seed=[3A381F6676BD45D2:5267C03693A2ECA5]}
20-Nov-2018 10:01:06 Finished: a {seed=[3A381F6676BD45D2:5267C03693A2ECA5]}
20-Nov-2018 10:01:06 Started : a {seed=[3A381F6676BD45D2:E6317CCAA7602789]}
20-Nov-2018 10:01:06 Finished: a {seed=[3A381F6676BD45D2:E6317CCAA7602789]}
20-Nov-2018 10:01:06 Started : a {seed=[3A381F6676BD45D2:68D8EA16F6A46F42]}
20-Nov-2018 10:01:06 Finished: a {seed=[3A381F6676BD45D2:68D8EA16F6A46F42]}
20-Nov-2018 10:01:06 Started : b {seed=[3A381F6676BD45D2:965AF25A03F4F3A6]}
20-Nov-2018 10:01:06 Finished: b {seed=[3A381F6676BD45D2:965AF25A03F4F3A6]}
20-Nov-2018 10:01:06 Started : b {seed=[3A381F6676BD45D2:220C4EA63736388A]}
20-Nov-2018 10:01:06 Finished: b {seed=[3A381F6676BD45D2:220C4EA63736388A]}
20-Nov-2018 10:01:06 Started : b {seed=[3A381F6676BD45D2:ACE5D87A66F27041]}
20-Nov-2018 10:01:06 Finished: b {seed=[3A381F6676BD45D2:ACE5D87A66F27041]}
20-Nov-2018 10:01:06 Started : c {seed=[3A381F6676BD45D2:5CCEB72304B02EB5]}
20-Nov-2018 10:01:06 Finished: c {seed=[3A381F6676BD45D2:5CCEB72304B02EB5]}
20-Nov-2018 10:01:06 Started : c {seed=[3A381F6676BD45D2:E8980BDF3072E599]}
20-Nov-2018 10:01:06 Finished: c {seed=[3A381F6676BD45D2:E8980BDF3072E599]}
20-Nov-2018 10:01:06 Started : c {seed=[3A381F6676BD45D2:66719D0361B6AD52]}
20-Nov-2018 10:01:06 Finished: c {seed=[3A381F6676BD45D2:66719D0361B6AD52]}
20-Nov-2018 10:01:06 Started : d {seed=[3A381F6676BD45D2:DC8633F2D3F769B0]}
20-Nov-2018 10:01:06 Finished: d {seed=[3A381F6676BD45D2:DC8633F2D3F769B0]}
20-Nov-2018 10:01:06 Started : d {seed=[3A381F6676BD45D2:68D08F0EE735A29C]}
20-Nov-2018 10:01:06 Finished: d {seed=[3A381F6676BD45D2:68D08F0EE735A29C]}
20-Nov-2018 10:01:06 Started : d {seed=[3A381F6676BD45D2:E63919D2B6F1EA57]}
20-Nov-2018 10:01:06 Finished: d {seed=[3A381F6676BD45D2:E63919D2B6F1EA57]}
20-Nov-2018 10:01:06 Run finished: run=12, ignored=0, failures=0, assumptions=0
20-Nov-2018 10:01:06
20-Nov-2018 10:01:06 Run started.
20-Nov-2018 10:01:06 Started : a {p0=1}
20-Nov-2018 10:01:06 Finished: a {p0=1}
20-Nov-2018 10:01:06 Started : a {p0=2}
20-Nov-2018 10:01:06 Finished: a {p0=2}
20-Nov-2018 10:01:06 Started : a {p0=3}
20-Nov-2018 10:01:06 Finished: a {p0=3}
20-Nov-2018 10:01:06 Started : b {p0=1}
20-Nov-2018 10:01:06 Finished: b {p0=1}
20-Nov-2018 10:01:06 Started : b {p0=2}
20-Nov-2018 10:01:06 Finished: b {p0=2}
20-Nov-2018 10:01:06 Started : b {p0=3}
20-Nov-2018 10:01:06 Finished: b {p0=3}
20-Nov-2018 10:01:06 Started : c {p0=1}
20-Nov-2018 10:01:06 Finished: c {p0=1}
20-Nov-2018 10:01:06 Started : c {p0=2}
20-Nov-2018 10:01:06 Finished: c {p0=2}
20-Nov-2018 10:01:06 Started : c {p0=3}
20-Nov-2018 10:01:06 Finished: c {p0=3}
20-Nov-2018 10:01:06 Started : d {p0=1}
20-Nov-2018 10:01:06 Finished: d {p0=1}
20-Nov-2018 10:01:06 Started : d {p0=2}
20-Nov-2018 10:01:06 Finished: d {p0=2}
20-Nov-2018 10:01:06 Started : d {p0=3}
20-Nov-2018 10:01:06 Finished: d {p0=3}
20-Nov-2018 10:01:06 Run finished: run=12, ignored=0, failures=0, assumptions=0
20-Nov-2018 10:01:06
20-Nov-2018 10:01:06 Run started.
20-Nov-2018 10:01:06 Started : a
20-Nov-2018 10:01:06 Finished: a
20-Nov-2018 10:01:06 Started : b
20-Nov-2018 10:01:06 Finished: b
20-Nov-2018 10:01:06 Started : c
20-Nov-2018 10:01:06 Finished: c
20-Nov-2018 10:01:06 Started : d
20-Nov-2018 10:01:06 Finished: d
20-Nov-2018 10:01:06 Run finished: run=4, ignored=0, failures=0, assumptions=0
20-Nov-2018 10:01:06
20-Nov-2018 10:01:06 Tests run: 3, Failures: 0, Errors: 0, Skipped: 0, Time elapsed: 0.046 sec - in com.carrotsearch.randomizedtesting.TestTestCaseOrdering
20-Nov-2018 10:01:06 Running com.carrotsearch.randomizedtesting.TestTargetMethod
20-Nov-2018 10:01:06 Run started.
20-Nov-2018 10:01:06 Started : testOne {seed=[764D80BAF8439244:A24FA879213A40D4]}
20-Nov-2018 10:01:06 Finished: testOne {seed=[764D80BAF8439244:A24FA879213A40D4]}
20-Nov-2018 10:01:06 Started : testOne {seed=[764D80BAF8439244:1619148515F88BF8]}
20-Nov-2018 10:01:07 Finished: testOne {seed=[764D80BAF8439244:1619148515F88BF8]}
20-Nov-2018 10:01:07 Started : testOne {seed=[764D80BAF8439244:98F08259443CC333]}
20-Nov-2018 10:01:07 Finished: testOne {seed=[764D80BAF8439244:98F08259443CC333]}
20-Nov-2018 10:01:07 Started : testTwo
20-Nov-2018 10:01:07 Finished: testTwo
20-Nov-2018 10:01:07 Run finished: run=4, ignored=0, failures=0, assumptions=0
20-Nov-2018 10:01:07
20-Nov-2018 10:01:07 Tests run: 1, Failures: 0, Errors: 0, Skipped: 0, Time elapsed: 0.007 sec - in com.carrotsearch.randomizedtesting.TestTargetMethod
20-Nov-2018 10:01:07 Running com.carrotsearch.randomizedtesting.TestRules
20-Nov-2018 10:01:07 Run started.
20-Nov-2018 10:01:07 Started : passing
20-Nov-2018 10:01:07 Finished: passing
20-Nov-2018 10:01:07 Run finished: run=1, ignored=0, failures=0, assumptions=0
20-Nov-2018 10:01:07
20-Nov-2018 10:01:07 Run started.
20-Nov-2018 10:01:07 Started : passing
20-Nov-2018 10:01:07 Finished: passing
20-Nov-2018 10:01:07 Run finished: run=1, ignored=0, failures=0, assumptions=0
20-Nov-2018 10:01:07
20-Nov-2018 10:01:07 Run started.
20-Nov-2018 10:01:07 Started : failing
20-Nov-2018 10:01:07 Failure : failing(com.carrotsearch.randomizedtesting.TestRules$NewRuleSupportFailing): null
20-Nov-2018 10:01:07 Finished: failing
20-Nov-2018 10:01:07 Run finished: run=1, ignored=0, failures=1, assumptions=0
20-Nov-2018 10:01:07
20-Nov-2018 10:01:07 Run started.
20-Nov-2018 10:01:07 Ignored : ignored
20-Nov-2018 10:01:07 Run finished: run=0, ignored=1, failures=0, assumptions=0
20-Nov-2018 10:01:07
20-Nov-2018 10:01:07 Tests run: 2, Failures: 0, Errors: 0, Skipped: 0, Time elapsed: 0.012 sec - in com.carrotsearch.randomizedtesting.TestRules
20-Nov-2018 10:01:07 Running com.carrotsearch.randomizedtesting.TestUncaughtExceptionsDuplicated
20-Nov-2018 10:01:07 Run started.
20-Nov-2018 10:01:07 Started : test1
20-Nov-2018 10:01:07 Failure : test1(com.carrotsearch.randomizedtesting.TestUncaughtExceptionsDuplicated$Nested3): Captured an uncaught exception in thread: Thread[id=5890, name=Thread-5291, state=RUNNABLE, group=TGRP-TestUncaughtExceptionsDuplicated$Nested3]
20-Nov-2018 10:01:07 Finished: test1
20-Nov-2018 10:01:07 Run finished: run=1, ignored=0, failures=1, assumptions=0
20-Nov-2018 10:01:07
20-Nov-2018 10:01:07 Run started.
20-Nov-2018 10:01:07 Started : test3
20-Nov-2018 10:01:07 Failure : test3(com.carrotsearch.randomizedtesting.TestUncaughtExceptionsDuplicated$Nested2): Captured an uncaught exception in thread: Thread[id=5893, name=Thread-5293, state=RUNNABLE, group=TGRP-TestUncaughtExceptionsDuplicated$Nested2]
20-Nov-2018 10:01:07 Finished: test3
20-Nov-2018 10:01:07 Started : test2
20-Nov-2018 10:01:07 Failure : test2(com.carrotsearch.randomizedtesting.TestUncaughtExceptionsDuplicated$Nested2): Captured an uncaught exception in thread: Thread[id=5894, name=Thread-5294, state=RUNNABLE, group=TGRP-TestUncaughtExceptionsDuplicated$Nested2]
20-Nov-2018 10:01:07 Finished: test2
20-Nov-2018 10:01:07 Started : test1
20-Nov-2018 10:01:07 Failure : test1(com.carrotsearch.randomizedtesting.TestUncaughtExceptionsDuplicated$Nested2): Captured an uncaught exception in thread: Thread[id=5895, name=Thread-5295, state=RUNNABLE, group=TGRP-TestUncaughtExceptionsDuplicated$Nested2]
20-Nov-2018 10:01:07 Finished: test1
20-Nov-2018 10:01:07 Run finished: run=3, ignored=0, failures=3, assumptions=0
20-Nov-2018 10:01:07
20-Nov-2018 10:01:07 Run started.
20-Nov-2018 10:01:07 Started : test
20-Nov-2018 10:01:07 Failure : test(com.carrotsearch.randomizedtesting.TestUncaughtExceptionsDuplicated$Nested1): Captured an uncaught exception in thread: Thread[id=5898, name=Thread-5297, state=RUNNABLE, group=TGRP-TestUncaughtExceptionsDuplicated$Nested1]
20-Nov-2018 10:01:07 Finished: test
20-Nov-2018 10:01:07 Run finished: run=1, ignored=0, failures=1, assumptions=0
20-Nov-2018 10:01:07
20-Nov-2018 10:01:07 Tests run: 3, Failures: 0, Errors: 0, Skipped: 0, Time elapsed: 0.021 sec - in com.carrotsearch.randomizedtesting.TestUncaughtExceptionsDuplicated
20-Nov-2018 10:01:07 Running com.carrotsearch.randomizedtesting.TestResourceDisposal
20-Nov-2018 10:01:07 Run started.
20-Nov-2018 10:01:07 Started : testScope
20-Nov-2018 10:01:07 Failure : testScope(com.carrotsearch.randomizedtesting.TestResourceDisposal$Nested2): Resource in scope TEST failed to close. Resource was registered from thread Thread[id=5900, name=TEST-TestResourceDisposal$Nested2.testScope-seed#[7793A1F97E847216], state=RUNNABLE, group=TGRP-TestResourceDisposal$Nested2], registration stack trace below.
20-Nov-2018 10:01:07 Finished: testScope
20-Nov-2018 10:01:07 Run finished: run=1, ignored=0, failures=1, assumptions=0
20-Nov-2018 10:01:07
20-Nov-2018 10:01:07 Run started.
20-Nov-2018 10:01:07 Started : testScopeResourceWithFailures
20-Nov-2018 10:01:07 Failure : testScopeResourceWithFailures(com.carrotsearch.randomizedtesting.TestResourceDisposal$Nested): null
20-Nov-2018 10:01:07 Finished: testScopeResourceWithFailures
20-Nov-2018 10:01:07 Started : testScopeResource
20-Nov-2018 10:01:07 Finished: testScopeResource
20-Nov-2018 10:01:07 Started : suiteScopeFromTest
20-Nov-2018 10:01:07 Finished: suiteScopeFromTest
20-Nov-2018 10:01:07 Run finished: run=3, ignored=0, failures=1, assumptions=0
20-Nov-2018 10:01:07
20-Nov-2018 10:01:07 Run started.
20-Nov-2018 10:01:07 Started : suiteScopeFromTest
20-Nov-2018 10:01:07 Finished: suiteScopeFromTest
20-Nov-2018 10:01:07 Started : testScopeResource
20-Nov-2018 10:01:07 Finished: testScopeResource
20-Nov-2018 10:01:07 Started : testScopeResourceWithFailures
20-Nov-2018 10:01:07 Failure : testScopeResourceWithFailures(com.carrotsearch.randomizedtesting.TestResourceDisposal$Nested): null
20-Nov-2018 10:01:07 Finished: testScopeResourceWithFailures
20-Nov-2018 10:01:07 Run finished: run=3, ignored=0, failures=1, assumptions=0
20-Nov-2018 10:01:07
20-Nov-2018 10:01:07 Tests run: 3, Failures: 0, Errors: 0, Skipped: 0, Time elapsed: 0.026 sec - in com.carrotsearch.randomizedtesting.TestResourceDisposal
20-Nov-2018 10:01:07 Running com.carrotsearch.randomizedtesting.TestHookMethodOrderWithExceptions
20-Nov-2018 10:01:07 Run started.
20-Nov-2018 10:01:07 Started : testMethod
20-Nov-2018 10:01:07 Finished: testMethod
20-Nov-2018 10:01:07 Run finished: run=1, ignored=0, failures=0, assumptions=0
20-Nov-2018 10:01:07
20-Nov-2018 10:01:07 Run started.
20-Nov-2018 10:01:07 Started : testMethod
20-Nov-2018 10:01:07 Finished: testMethod
20-Nov-2018 10:01:07 Run finished: run=1, ignored=0, failures=0, assumptions=0
20-Nov-2018 10:01:07
20-Nov-2018 10:01:07 Run started.
20-Nov-2018 10:01:07 Started : testMethod
20-Nov-2018 10:01:07 Finished: testMethod
20-Nov-2018 10:01:07 Failure : com.carrotsearch.randomizedtesting.TestHookMethodOrderWithExceptions$WithRegularRunner: null
20-Nov-2018 10:01:07 Run finished: run=1, ignored=0, failures=1, assumptions=0
20-Nov-2018 10:01:07
20-Nov-2018 10:01:07 Run started.
20-Nov-2018 10:01:07 Started : testMethod
20-Nov-2018 10:01:07 Finished: testMethod
20-Nov-2018 10:01:07 Failure : com.carrotsearch.randomizedtesting.TestHookMethodOrderWithExceptions$WithRandomizedRunner: null
20-Nov-2018 10:01:07 Run finished: run=1, ignored=0, failures=1, assumptions=0
20-Nov-2018 10:01:07
20-Nov-2018 10:01:07 Run started.
20-Nov-2018 10:01:07 Started : testMethod
20-Nov-2018 10:01:07 Finished: testMethod
20-Nov-2018 10:01:07 Run finished: run=1, ignored=0, failures=0, assumptions=0
20-Nov-2018 10:01:07
20-Nov-2018 10:01:07 Run started.
20-Nov-2018 10:01:07 Started : testMethod
20-Nov-2018 10:01:07 Finished: testMethod
20-Nov-2018 10:01:07 Run finished: run=1, ignored=0, failures=0, assumptions=0
20-Nov-2018 10:01:07
20-Nov-2018 10:01:07 Run started.
20-Nov-2018 10:01:07 Failure : com.carrotsearch.randomizedtesting.TestHookMethodOrderWithExceptions$WithRegularRunner: null
20-Nov-2018 10:01:07 Run finished: run=0, ignored=0, failures=1, assumptions=0
20-Nov-2018 10:01:07
20-Nov-2018 10:01:07 Run started.
20-Nov-2018 10:01:07 Failure : com.carrotsearch.randomizedtesting.TestHookMethodOrderWithExceptions$WithRandomizedRunner: null
20-Nov-2018 10:01:07 Run finished: run=0, ignored=0, failures=1, assumptions=0
20-Nov-2018 10:01:07
20-Nov-2018 10:01:07 Run started.
20-Nov-2018 10:01:07 Started : testMethod
20-Nov-2018 10:01:07 Failure : testMethod(com.carrotsearch.randomizedtesting.TestHookMethodOrderWithExceptions$WithRegularRunner): null
20-Nov-2018 10:01:07 Finished: testMethod
20-Nov-2018 10:01:07 Run finished: run=1, ignored=0, failures=1, assumptions=0
20-Nov-2018 10:01:07
20-Nov-2018 10:01:07 Run started.
20-Nov-2018 10:01:07 Started : testMethod
20-Nov-2018 10:01:07 Failure : testMethod(com.carrotsearch.randomizedtesting.TestHookMethodOrderWithExceptions$WithRandomizedRunner): null
20-Nov-2018 10:01:07 Finished: testMethod
20-Nov-2018 10:01:07 Run finished: run=1, ignored=0, failures=1, assumptions=0
20-Nov-2018 10:01:07
20-Nov-2018 10:01:07 Run started.
20-Nov-2018 10:01:07 Started : testMethod
20-Nov-2018 10:01:07 Finished: testMethod
20-Nov-2018 10:01:07 Run finished: run=1, ignored=0, failures=0, assumptions=0
20-Nov-2018 10:01:07
20-Nov-2018 10:01:07 Run started.
20-Nov-2018 10:01:07 Started : testMethod
20-Nov-2018 10:01:07 Finished: testMethod
20-Nov-2018 10:01:07 Run finished: run=1, ignored=0, failures=0, assumptions=0
20-Nov-2018 10:01:07
20-Nov-2018 10:01:07 Run started.
20-Nov-2018 10:01:07 Started : testMethod
20-Nov-2018 10:01:07 Finished: testMethod
20-Nov-2018 10:01:07 Run finished: run=1, ignored=0, failures=0, assumptions=0
20-Nov-2018 10:01:07
20-Nov-2018 10:01:07 Run started.
20-Nov-2018 10:01:07 Started : testMethod
20-Nov-2018 10:01:07 Finished: testMethod
20-Nov-2018 10:01:07 Run finished: run=1, ignored=0, failures=0, assumptions=0
20-Nov-2018 10:01:07
20-Nov-2018 10:01:07 Run started.
20-Nov-2018 10:01:07 Started : testMethod
20-Nov-2018 10:01:07 Failure : testMethod(com.carrotsearch.randomizedtesting.TestHookMethodOrderWithExceptions$WithRegularRunner): null
20-Nov-2018 10:01:07 Finished: testMethod
20-Nov-2018 10:01:07 Run finished: run=1, ignored=0, failures=1, assumptions=0
20-Nov-2018 10:01:07
20-Nov-2018 10:01:07 Run started.
20-Nov-2018 10:01:07 Started : testMethod
20-Nov-2018 10:01:07 Failure : testMethod(com.carrotsearch.randomizedtesting.TestHookMethodOrderWithExceptions$WithRandomizedRunner): null
20-Nov-2018 10:01:07 Finished: testMethod
20-Nov-2018 10:01:07 Run finished: run=1, ignored=0, failures=1, assumptions=0
20-Nov-2018 10:01:07
20-Nov-2018 10:01:07 Run started.
20-Nov-2018 10:01:07 Started : testMethod
20-Nov-2018 10:01:07 Finished: testMethod
20-Nov-2018 10:01:07 Run finished: run=1, ignored=0, failures=0, assumptions=0
20-Nov-2018 10:01:07
20-Nov-2018 10:01:07 Run started.
20-Nov-2018 10:01:07 Started : testMethod
20-Nov-2018 10:01:07 Finished: testMethod
20-Nov-2018 10:01:07 Run finished: run=1, ignored=0, failures=0, assumptions=0
20-Nov-2018 10:01:07
20-Nov-2018 10:01:07 Run started.
20-Nov-2018 10:01:07 Started : testMethod
20-Nov-2018 10:01:07 Finished: testMethod
20-Nov-2018 10:01:07 Failure : com.carrotsearch.randomizedtesting.TestHookMethodOrderWithExceptions$WithRegularRunner: null
20-Nov-2018 10:01:07 Run finished: run=1, ignored=0, failures=1, assumptions=0
20-Nov-2018 10:01:07
20-Nov-2018 10:01:07 Run started.
20-Nov-2018 10:01:07 Started : testMethod
20-Nov-2018 10:01:07 Finished: testMethod
20-Nov-2018 10:01:07 Failure : com.carrotsearch.randomizedtesting.TestHookMethodOrderWithExceptions$WithRandomizedRunner: null
20-Nov-2018 10:01:07 Run finished: run=1, ignored=0, failures=1, assumptions=0
20-Nov-2018 10:01:07
20-Nov-2018 10:01:07 Run started.
20-Nov-2018 10:01:07 Started : testMethod
20-Nov-2018 10:01:07 Finished: testMethod
20-Nov-2018 10:01:07 Run finished: run=1, ignored=0, failures=0, assumptions=0
20-Nov-2018 10:01:07
20-Nov-2018 10:01:07 Run started.
20-Nov-2018 10:01:07 Started : testMethod
20-Nov-2018 10:01:07 Finished: testMethod
20-Nov-2018 10:01:07 Run finished: run=1, ignored=0, failures=0, assumptions=0
20-Nov-2018 10:01:07
20-Nov-2018 10:01:07 Run started.
20-Nov-2018 10:01:07 Started : testMethod
20-Nov-2018 10:01:07 Finished: testMethod
20-Nov-2018 10:01:07 Run finished: run=1, ignored=0, failures=0, assumptions=0
20-Nov-2018 10:01:07
20-Nov-2018 10:01:07 Run started.
20-Nov-2018 10:01:07 Started : testMethod
20-Nov-2018 10:01:07 Finished: testMethod
20-Nov-2018 10:01:07 Run finished: run=1, ignored=0, failures=0, assumptions=0
20-Nov-2018 10:01:07
20-Nov-2018 10:01:07 Run started.
20-Nov-2018 10:01:07 Failure : com.carrotsearch.randomizedtesting.TestHookMethodOrderWithExceptions$WithRegularRunner: null
20-Nov-2018 10:01:07 Failure : com.carrotsearch.randomizedtesting.TestHookMethodOrderWithExceptions$WithRegularRunner: null
20-Nov-2018 10:01:07 Run finished: run=0, ignored=0, failures=2, assumptions=0
20-Nov-2018 10:01:07
20-Nov-2018 10:01:07 Run started.
20-Nov-2018 10:01:07 Failure : com.carrotsearch.randomizedtesting.TestHookMethodOrderWithExceptions$WithRandomizedRunner: null
20-Nov-2018 10:01:07 Failure : com.carrotsearch.randomizedtesting.TestHookMethodOrderWithExceptions$WithRandomizedRunner: null
20-Nov-2018 10:01:07 Run finished: run=0, ignored=0, failures=2, assumptions=0
20-Nov-2018 10:01:07
20-Nov-2018 10:01:07 Run started.
20-Nov-2018 10:01:07 Started : testMethod
20-Nov-2018 10:01:07 Failure : testMethod(com.carrotsearch.randomizedtesting.TestHookMethodOrderWithExceptions$WithRegularRunner): null
20-Nov-2018 10:01:07 Finished: testMethod
20-Nov-2018 10:01:07 Run finished: run=1, ignored=0, failures=1, assumptions=0
20-Nov-2018 10:01:07
20-Nov-2018 10:01:07 Run started.
20-Nov-2018 10:01:07 Started : testMethod
20-Nov-2018 10:01:07 Failure : testMethod(com.carrotsearch.randomizedtesting.TestHookMethodOrderWithExceptions$WithRandomizedRunner): null
20-Nov-2018 10:01:07 Finished: testMethod
20-Nov-2018 10:01:07 Run finished: run=1, ignored=0, failures=1, assumptions=0
20-Nov-2018 10:01:07
20-Nov-2018 10:01:07 Run started.
20-Nov-2018 10:01:07 Started : testMethod
20-Nov-2018 10:01:07 Finished: testMethod
20-Nov-2018 10:01:07 Run finished: run=1, ignored=0, failures=0, assumptions=0
20-Nov-2018 10:01:07
20-Nov-2018 10:01:07 Run started.
20-Nov-2018 10:01:07 Started : testMethod
20-Nov-2018 10:01:07 Finished: testMethod
20-Nov-2018 10:01:07 Run finished: run=1, ignored=0, failures=0, assumptions=0
20-Nov-2018 10:01:07
20-Nov-2018 10:01:07 Run started.
20-Nov-2018 10:01:07 Started : testMethod
20-Nov-2018 10:01:07 Failure : testMethod(com.carrotsearch.randomizedtesting.TestHookMethodOrderWithExceptions$WithRegularRunner): null
20-Nov-2018 10:01:07 Finished: testMethod
20-Nov-2018 10:01:07 Run finished: run=1, ignored=0, failures=1, assumptions=0
20-Nov-2018 10:01:07
20-Nov-2018 10:01:07 Run started.
20-Nov-2018 10:01:07 Started : testMethod
20-Nov-2018 10:01:07 Failure : testMethod(com.carrotsearch.randomizedtesting.TestHookMethodOrderWithExceptions$WithRandomizedRunner): null
20-Nov-2018 10:01:07 Finished: testMethod
20-Nov-2018 10:01:07 Run finished: run=1, ignored=0, failures=1, assumptions=0
20-Nov-2018 10:01:07
20-Nov-2018 10:01:07 Run started.
20-Nov-2018 10:01:07 Started : testMethod
20-Nov-2018 10:01:07 Finished: testMethod
20-Nov-2018 10:01:07 Run finished: run=1, ignored=0, failures=0, assumptions=0
20-Nov-2018 10:01:07
20-Nov-2018 10:01:07 Run started.
20-Nov-2018 10:01:07 Started : testMethod
20-Nov-2018 10:01:07 Finished: testMethod
20-Nov-2018 10:01:07 Run finished: run=1, ignored=0, failures=0, assumptions=0
20-Nov-2018 10:01:07
20-Nov-2018 10:01:07 Run started.
20-Nov-2018 10:01:07 Failure : com.carrotsearch.randomizedtesting.TestHookMethodOrderWithExceptions$WithRegularRunner: null
20-Nov-2018 10:01:07 Run finished: run=0, ignored=0, failures=1, assumptions=0
20-Nov-2018 10:01:07
20-Nov-2018 10:01:07 Run started.
20-Nov-2018 10:01:07 Failure : com.carrotsearch.randomizedtesting.TestHookMethodOrderWithExceptions$WithRandomizedRunner: null
20-Nov-2018 10:01:07 Run finished: run=0, ignored=0, failures=1, assumptions=0
20-Nov-2018 10:01:07
20-Nov-2018 10:01:07 Run started.
20-Nov-2018 10:01:07 Started : testMethod
20-Nov-2018 10:01:07 Finished: testMethod
20-Nov-2018 10:01:07 Failure : com.carrotsearch.randomizedtesting.TestHookMethodOrderWithExceptions$WithRegularRunner: null
20-Nov-2018 10:01:07 Run finished: run=1, ignored=0, failures=1, assumptions=0
20-Nov-2018 10:01:07
20-Nov-2018 10:01:07 Run started.
20-Nov-2018 10:01:07 Started : testMethod
20-Nov-2018 10:01:07 Finished: testMethod
20-Nov-2018 10:01:07 Failure : com.carrotsearch.randomizedtesting.TestHookMethodOrderWithExceptions$WithRandomizedRunner: null
20-Nov-2018 10:01:07 Run finished: run=1, ignored=0, failures=1, assumptions=0
20-Nov-2018 10:01:07
20-Nov-2018 10:01:07 Run started.
20-Nov-2018 10:01:07 Started : testMethod
20-Nov-2018 10:01:07 Failure : testMethod(com.carrotsearch.randomizedtesting.TestHookMethodOrderWithExceptions$WithRegularRunner): null
20-Nov-2018 10:01:07 Finished: testMethod
20-Nov-2018 10:01:07 Failure : com.carrotsearch.randomizedtesting.TestHookMethodOrderWithExceptions$WithRegularRunner: null
20-Nov-2018 10:01:07 Run finished: run=1, ignored=0, failures=2, assumptions=0
20-Nov-2018 10:01:07
20-Nov-2018 10:01:07 Run started.
20-Nov-2018 10:01:07 Started : testMethod
20-Nov-2018 10:01:07 Failure : testMethod(com.carrotsearch.randomizedtesting.TestHookMethodOrderWithExceptions$WithRandomizedRunner): null
20-Nov-2018 10:01:07 Finished: testMethod
20-Nov-2018 10:01:07 Failure : com.carrotsearch.randomizedtesting.TestHookMethodOrderWithExceptions$WithRandomizedRunner: null
20-Nov-2018 10:01:07 Run finished: run=1, ignored=0, failures=2, assumptions=0
20-Nov-2018 10:01:07
20-Nov-2018 10:01:07 Tests run: 20, Failures: 0, Errors: 0, Skipped: 0, Time elapsed: 0.071 sec - in com.carrotsearch.randomizedtesting.TestHookMethodOrderWithExceptions
20-Nov-2018 10:01:07 Running com.carrotsearch.randomizedtesting.TestThreadNameContainsTestName
20-Nov-2018 10:01:07 Tests run: 3, Failures: 0, Errors: 0, Skipped: 0, Time elapsed: 0.003 sec - in com.carrotsearch.randomizedtesting.TestThreadNameContainsTestName
20-Nov-2018 10:01:07 Running com.carrotsearch.randomizedtesting.TestCustomTestContextSupplier
20-Nov-2018 10:01:07 Tests run: 1, Failures: 0, Errors: 0, Skipped: 0, Time elapsed: 0.003 sec - in com.carrotsearch.randomizedtesting.TestCustomTestContextSupplier
20-Nov-2018 10:01:07 Running com.carrotsearch.randomizedtesting.TestClassMethodFiltering
20-Nov-2018 10:01:07 Run started.
20-Nov-2018 10:01:07 Started : method1
20-Nov-2018 10:01:07 Finished: method1
20-Nov-2018 10:01:07 Started : method2
20-Nov-2018 10:01:07 Finished: method2
20-Nov-2018 10:01:07 Run finished: run=2, ignored=0, failures=0, assumptions=0
20-Nov-2018 10:01:07
20-Nov-2018 10:01:07 Run started.
20-Nov-2018 10:01:07 Started : method2
20-Nov-2018 10:01:07 Finished: method2
20-Nov-2018 10:01:07 Run finished: run=1, ignored=0, failures=0, assumptions=0
20-Nov-2018 10:01:07
20-Nov-2018 10:01:07 Run started.
20-Nov-2018 10:01:07 Started : method1
20-Nov-2018 10:01:07 Finished: method1
20-Nov-2018 10:01:07 Started : method1
20-Nov-2018 10:01:07 Finished: method1
20-Nov-2018 10:01:07 Run finished: run=2, ignored=0, failures=0, assumptions=0
20-Nov-2018 10:01:07
20-Nov-2018 10:01:07 Run started.
20-Nov-2018 10:01:07 Started : method1
20-Nov-2018 10:01:07 Finished: method1
20-Nov-2018 10:01:07 Started : method2
20-Nov-2018 10:01:07 Finished: method2
20-Nov-2018 10:01:07 Run finished: run=2, ignored=0, failures=0, assumptions=0
20-Nov-2018 10:01:07
20-Nov-2018 10:01:07 Run started.
20-Nov-2018 10:01:07 Started : method1
20-Nov-2018 10:01:07 Finished: method1
20-Nov-2018 10:01:07 Started : method1
20-Nov-2018 10:01:07 Finished: method1
20-Nov-2018 10:01:07 Run finished: run=2, ignored=0, failures=0, assumptions=0
20-Nov-2018 10:01:07
20-Nov-2018 10:01:07 Tests run: 5, Failures: 0, Errors: 0, Skipped: 0, Time elapsed: 0.014 sec - in com.carrotsearch.randomizedtesting.TestClassMethodFiltering
20-Nov-2018 10:01:07
20-Nov-2018 10:01:07 Results :
20-Nov-2018 10:01:07
20-Nov-2018 10:01:07 Tests run: 2257, Failures: 0, Errors: 0, Skipped: 6
20-Nov-2018 10:01:07
20-Nov-2018 10:01:07 [INFO]
20-Nov-2018 10:01:07 [INFO] --- maven-jar-plugin:3.0.2:jar (default-jar) @ randomizedtesting-runner ---
20-Nov-2018 10:01:07 [INFO] Building jar: /home/bamboo/xml-data/build-dir/RNDTEST-SOFTWARE-JDK19/randomized-runner/target/randomizedtesting-runner-2.7.1.jar
20-Nov-2018 10:01:07 [INFO]
20-Nov-2018 10:01:07 [INFO] --- maven-site-plugin:3.5.1:attach-descriptor (attach-descriptor) @ randomizedtesting-runner ---
20-Nov-2018 10:01:07 [INFO]
20-Nov-2018 10:01:07 [INFO] --- forbiddenapis:2.5:check (check-forbidden-apis) @ randomizedtesting-runner ---
20-Nov-2018 10:01:07 [INFO] Scanning for classes to check...
20-Nov-2018 10:01:07 [INFO] Reading bundled API signatures: jdk-unsafe-1.8
20-Nov-2018 10:01:07 [INFO] Reading bundled API signatures: jdk-deprecated-1.8
20-Nov-2018 10:01:08 [INFO] Reading bundled API signatures: jdk-system-out
20-Nov-2018 10:01:08 [INFO] Reading bundled API signatures: jdk-non-portable
20-Nov-2018 10:01:08 [INFO] Loading classes to check...
20-Nov-2018 10:01:08 [INFO] Scanning classes for violations...
20-Nov-2018 10:01:08 [INFO] Scanned 190 class file(s) for forbidden API invocations (in 0.25s), 0 error(s).
20-Nov-2018 10:01:08 [INFO]
20-Nov-2018 10:01:08 [INFO] -----------< com.carrotsearch.randomizedtesting:junit4-ant >------------
20-Nov-2018 10:01:08 [INFO] Building RandomizedTesting JUnit4 ANT Task 2.7.1                   [3/8]
20-Nov-2018 10:01:08 [INFO] --------------------------------[ jar ]---------------------------------
20-Nov-2018 10:01:08 [INFO]
20-Nov-2018 10:01:08 [INFO] --- maven-clean-plugin:3.0.0:clean (default-clean) @ junit4-ant ---
20-Nov-2018 10:01:08 [INFO] Deleting /home/bamboo/xml-data/build-dir/RNDTEST-SOFTWARE-JDK19/junit4-ant/target (includes = [], excludes = [eclipse/**, idea/**])
20-Nov-2018 10:01:08 [INFO]
20-Nov-2018 10:01:08 [INFO] --- maven-enforcer-plugin:3.0.0-M1:enforce (enforce-proguard-java-home) @ junit4-ant ---
20-Nov-2018 10:01:08 [INFO]
20-Nov-2018 10:01:08 [INFO] --- maven-resources-plugin:3.0.1:resources (default-resources) @ junit4-ant ---
20-Nov-2018 10:01:08 [INFO] Using 'UTF-8' encoding to copy filtered resources.
20-Nov-2018 10:01:08 [INFO] Copying 15 resources
20-Nov-2018 10:01:08 [INFO]
20-Nov-2018 10:01:08 [INFO] --- maven-compiler-plugin:3.5.1:compile (default-compile) @ junit4-ant ---
20-Nov-2018 10:01:08 [INFO] Changes detected - recompiling the module!
20-Nov-2018 10:01:08 [INFO] Compiling 99 source files to /home/bamboo/xml-data/build-dir/RNDTEST-SOFTWARE-JDK19/junit4-ant/target/classes
20-Nov-2018 10:01:08 [INFO] -------------------------------------------------------------
20-Nov-2018 10:01:08 [ERROR] COMPILATION ERROR :
20-Nov-2018 10:01:08 [INFO] -------------------------------------------------------------
20-Nov-2018 10:01:08 [ERROR] /home/bamboo/xml-data/build-dir/RNDTEST-SOFTWARE-JDK19/junit4-ant/src/main/java/com/carrotsearch/ant/tasks/junit4/listeners/json/JsonReport.java:[267,9] ';' expected
20-Nov-2018 10:01:08 [INFO] 1 error
20-Nov-2018 10:01:08 [INFO] -------------------------------------------------------------
20-Nov-2018 10:01:08 [INFO] ------------------------------------------------------------------------
20-Nov-2018 10:01:08 [INFO] Reactor Summary:
20-Nov-2018 10:01:08 [INFO]
20-Nov-2018 10:01:08 [INFO] RandomizedTesting Parent POM 2.7.1 ................. SUCCESS [  1.074 s]
20-Nov-2018 10:01:08 [INFO] RandomizedTesting Randomized Runner ................ SUCCESS [ 33.968 s]
20-Nov-2018 10:01:08 [INFO] RandomizedTesting JUnit4 ANT Task .................. FAILURE [  0.453 s]
20-Nov-2018 10:01:08 [INFO] RandomizedTesting JUnit4 Maven Plugin .............. SKIPPED
20-Nov-2018 10:01:08 [INFO] RandomizedTesting JUnit4 Maven Plugin Tests ........ SKIPPED
20-Nov-2018 10:01:08 [INFO] RandomizedTesting Examples ......................... SKIPPED
20-Nov-2018 10:01:08 [INFO] RandomizedTesting ANT Examples ..................... SKIPPED
20-Nov-2018 10:01:08 [INFO] RandomizedTesting Security Manager Example 2.7.1 ... SKIPPED
20-Nov-2018 10:01:08 [INFO] ------------------------------------------------------------------------
20-Nov-2018 10:01:08 [INFO] BUILD FAILURE
20-Nov-2018 10:01:08 [INFO] ------------------------------------------------------------------------
20-Nov-2018 10:01:08 [INFO] Total time: 35.654 s
20-Nov-2018 10:01:08 [INFO] Finished at: 2018-11-20T10:01:08+01:00
20-Nov-2018 10:01:08 [INFO] ------------------------------------------------------------------------
20-Nov-2018 10:01:08 [ERROR] Failed to execute goal org.apache.maven.plugins:maven-compiler-plugin:3.5.1:compile (default-compile) on project junit4-ant: Compilation failure
20-Nov-2018 10:01:08 [ERROR] /home/bamboo/xml-data/build-dir/RNDTEST-SOFTWARE-JDK19/junit4-ant/src/main/java/com/carrotsearch/ant/tasks/junit4/listeners/json/JsonReport.java:[267,9] ';' expected
20-Nov-2018 10:01:08 [ERROR] -> [Help 1]
20-Nov-2018 10:01:08 [ERROR]
20-Nov-2018 10:01:08 [ERROR] To see the full stack trace of the errors, re-run Maven with the -e switch.
20-Nov-2018 10:01:08 [ERROR] Re-run Maven using the -X switch to enable full debug logging.
20-Nov-2018 10:01:08 [ERROR]
20-Nov-2018 10:01:08 [ERROR] For more information about the errors and possible solutions, please read the following articles:
20-Nov-2018 10:01:08 [ERROR] [Help 1] http://cwiki.apache.org/confluence/display/MAVEN/MojoFailureException
20-Nov-2018 10:01:08 [ERROR]
20-Nov-2018 10:01:08 [ERROR] After correcting the problems, you can resume the build with the command
20-Nov-2018 10:01:08 [ERROR]   mvn <goals> -rf :junit4-ant
20-Nov-2018 10:01:08 Failing task since return code of [/home/bamboo/jvms/maven/bin/mvn --batch-mode -Djava.io.tmpdir=/tmp/RNDTEST-SOFTWARE-JDK19 -Dmaven.repo.local=/home/bamboo/bamboo-agent-home-3/.m2/AGENT-61898766/repository clean verify -Dproguard.java.home=/home/bamboo/jvms/jdk8/jre] was 1 while expected 0
20-Nov-2018 10:01:08 Parsing test results under /home/bamboo/xml-data/build-dir/RNDTEST-SOFTWARE-JDK19...
20-Nov-2018 10:01:08 Finished task 'Maven 3.x' with result: Failed
20-Nov-2018 10:01:08 Running post build plugin 'Docker Container Cleanup'
20-Nov-2018 10:01:08 Running post build plugin 'NCover Results Collector'
20-Nov-2018 10:01:08 Running post build plugin 'Clover Results Collector'
20-Nov-2018 10:01:08 Running post build plugin 'npm Cache Cleanup'
20-Nov-2018 10:01:08 Running post build plugin 'Artifact Copier'
20-Nov-2018 10:01:08 Finalising the build...
20-Nov-2018 10:01:08 Stopping timer.
20-Nov-2018 10:01:08 Build RNDTEST-SOFTWARE-JDK19-225 completed.
20-Nov-2018 10:01:09 Running on server: post build plugin 'NCover Results Collector'
20-Nov-2018 10:01:09 Running on server: post build plugin 'Build Hanging Detection Configuration'
20-Nov-2018 10:01:09 Running on server: post build plugin 'Clover Delta Calculator'
20-Nov-2018 10:01:09 Running on server: post build plugin 'Maven Dependencies Postprocessor'
20-Nov-2018 10:01:09 All post build plugins have finished
20-Nov-2018 10:01:09 Generating build results summary...
20-Nov-2018 10:01:12 Saving build results to disk...
20-Nov-2018 10:01:12 Logging substituted variables...
20-Nov-2018 10:01:12 Indexing build results...
20-Nov-2018 10:01:12 Finished building RNDTEST-SOFTWARE-JDK19-225.