Build #225

Build: #225 failed

Job: JDK 1.8 failed

Stages & jobs

  1. Compile and test

  2. Package

Build log

The build generated 3,395 lines of output.The output is too long and has been truncated to the last 1,000 lines. Download or view full build log

20-Nov-2018 10:00:49 Started : testFoo {p0=9}
20-Nov-2018 10:00:49 Finished: testFoo {p0=9}
20-Nov-2018 10:00:49 Run finished: run=10, ignored=0, failures=0, assumptions=0
20-Nov-2018 10:00:49
20-Nov-2018 10:00:49 Run started.
20-Nov-2018 10:00:49 Started : testFoo {p0=0}
20-Nov-2018 10:00:49 Finished: testFoo {p0=0}
20-Nov-2018 10:00:49 Started : testFoo {p0=1}
20-Nov-2018 10:00:49 Finished: testFoo {p0=1}
20-Nov-2018 10:00:49 Started : testFoo {p0=2}
20-Nov-2018 10:00:49 Finished: testFoo {p0=2}
20-Nov-2018 10:00:49 Started : testFoo {p0=3}
20-Nov-2018 10:00:49 Finished: testFoo {p0=3}
20-Nov-2018 10:00:49 Started : testFoo {p0=4}
20-Nov-2018 10:00:49 Finished: testFoo {p0=4}
20-Nov-2018 10:00:49 Started : testFoo {p0=5}
20-Nov-2018 10:00:49 Finished: testFoo {p0=5}
20-Nov-2018 10:00:49 Started : testFoo {p0=6}
20-Nov-2018 10:00:49 Finished: testFoo {p0=6}
20-Nov-2018 10:00:49 Started : testFoo {p0=7}
20-Nov-2018 10:00:49 Finished: testFoo {p0=7}
20-Nov-2018 10:00:49 Started : testFoo {p0=8}
20-Nov-2018 10:00:49 Finished: testFoo {p0=8}
20-Nov-2018 10:00:49 Started : testFoo {p0=9}
20-Nov-2018 10:00:49 Finished: testFoo {p0=9}
20-Nov-2018 10:00:49 Run finished: run=10, ignored=0, failures=0, assumptions=0
20-Nov-2018 10:00:49
20-Nov-2018 10:00:49 Run started.
20-Nov-2018 10:00:49 Started : testFoo {p0=0}
20-Nov-2018 10:00:49 Finished: testFoo {p0=0}
20-Nov-2018 10:00:49 Started : testFoo {p0=1}
20-Nov-2018 10:00:49 Finished: testFoo {p0=1}
20-Nov-2018 10:00:49 Started : testFoo {p0=2}
20-Nov-2018 10:00:49 Finished: testFoo {p0=2}
20-Nov-2018 10:00:49 Started : testFoo {p0=3}
20-Nov-2018 10:00:49 Finished: testFoo {p0=3}
20-Nov-2018 10:00:49 Started : testFoo {p0=4}
20-Nov-2018 10:00:49 Finished: testFoo {p0=4}
20-Nov-2018 10:00:49 Started : testFoo {p0=5}
20-Nov-2018 10:00:49 Finished: testFoo {p0=5}
20-Nov-2018 10:00:49 Started : testFoo {p0=6}
20-Nov-2018 10:00:49 Finished: testFoo {p0=6}
20-Nov-2018 10:00:49 Started : testFoo {p0=7}
20-Nov-2018 10:00:49 Finished: testFoo {p0=7}
20-Nov-2018 10:00:49 Started : testFoo {p0=8}
20-Nov-2018 10:00:49 Finished: testFoo {p0=8}
20-Nov-2018 10:00:49 Started : testFoo {p0=9}
20-Nov-2018 10:00:49 Finished: testFoo {p0=9}
20-Nov-2018 10:00:49 Run finished: run=10, ignored=0, failures=0, assumptions=0
20-Nov-2018 10:00:49
20-Nov-2018 10:00:49 Run started.
20-Nov-2018 10:00:49 Started : testFoo {p0=0}
20-Nov-2018 10:00:49 Finished: testFoo {p0=0}
20-Nov-2018 10:00:49 Started : testFoo {p0=1}
20-Nov-2018 10:00:49 Finished: testFoo {p0=1}
20-Nov-2018 10:00:49 Started : testFoo {p0=2}
20-Nov-2018 10:00:49 Finished: testFoo {p0=2}
20-Nov-2018 10:00:49 Started : testFoo {p0=3}
20-Nov-2018 10:00:49 Finished: testFoo {p0=3}
20-Nov-2018 10:00:49 Started : testFoo {p0=4}
20-Nov-2018 10:00:49 Finished: testFoo {p0=4}
20-Nov-2018 10:00:49 Started : testFoo {p0=5}
20-Nov-2018 10:00:49 Finished: testFoo {p0=5}
20-Nov-2018 10:00:49 Started : testFoo {p0=6}
20-Nov-2018 10:00:49 Finished: testFoo {p0=6}
20-Nov-2018 10:00:49 Started : testFoo {p0=7}
20-Nov-2018 10:00:49 Finished: testFoo {p0=7}
20-Nov-2018 10:00:49 Started : testFoo {p0=8}
20-Nov-2018 10:00:49 Finished: testFoo {p0=8}
20-Nov-2018 10:00:49 Started : testFoo {p0=9}
20-Nov-2018 10:00:49 Finished: testFoo {p0=9}
20-Nov-2018 10:00:49 Run finished: run=10, ignored=0, failures=0, assumptions=0
20-Nov-2018 10:00:49
20-Nov-2018 10:00:49 Run started.
20-Nov-2018 10:00:49 Started : testFoo {p0=0}
20-Nov-2018 10:00:49 Finished: testFoo {p0=0}
20-Nov-2018 10:00:49 Started : testFoo {p0=1}
20-Nov-2018 10:00:49 Finished: testFoo {p0=1}
20-Nov-2018 10:00:49 Started : testFoo {p0=2}
20-Nov-2018 10:00:49 Finished: testFoo {p0=2}
20-Nov-2018 10:00:49 Started : testFoo {p0=3}
20-Nov-2018 10:00:49 Finished: testFoo {p0=3}
20-Nov-2018 10:00:49 Started : testFoo {p0=4}
20-Nov-2018 10:00:49 Finished: testFoo {p0=4}
20-Nov-2018 10:00:49 Started : testFoo {p0=5}
20-Nov-2018 10:00:49 Finished: testFoo {p0=5}
20-Nov-2018 10:00:49 Started : testFoo {p0=6}
20-Nov-2018 10:00:49 Finished: testFoo {p0=6}
20-Nov-2018 10:00:49 Started : testFoo {p0=7}
20-Nov-2018 10:00:49 Finished: testFoo {p0=7}
20-Nov-2018 10:00:49 Started : testFoo {p0=8}
20-Nov-2018 10:00:49 Finished: testFoo {p0=8}
20-Nov-2018 10:00:49 Started : testFoo {p0=9}
20-Nov-2018 10:00:49 Finished: testFoo {p0=9}
20-Nov-2018 10:00:49 Run finished: run=10, ignored=0, failures=0, assumptions=0
20-Nov-2018 10:00:49
20-Nov-2018 10:00:49 Run started.
20-Nov-2018 10:00:49 Started : testFoo {p0=0}
20-Nov-2018 10:00:49 Finished: testFoo {p0=0}
20-Nov-2018 10:00:49 Started : testFoo {p0=1}
20-Nov-2018 10:00:49 Finished: testFoo {p0=1}
20-Nov-2018 10:00:49 Started : testFoo {p0=2}
20-Nov-2018 10:00:49 Finished: testFoo {p0=2}
20-Nov-2018 10:00:49 Started : testFoo {p0=3}
20-Nov-2018 10:00:49 Finished: testFoo {p0=3}
20-Nov-2018 10:00:49 Started : testFoo {p0=4}
20-Nov-2018 10:00:49 Finished: testFoo {p0=4}
20-Nov-2018 10:00:49 Started : testFoo {p0=5}
20-Nov-2018 10:00:49 Finished: testFoo {p0=5}
20-Nov-2018 10:00:49 Started : testFoo {p0=6}
20-Nov-2018 10:00:49 Finished: testFoo {p0=6}
20-Nov-2018 10:00:49 Started : testFoo {p0=7}
20-Nov-2018 10:00:49 Finished: testFoo {p0=7}
20-Nov-2018 10:00:49 Started : testFoo {p0=8}
20-Nov-2018 10:00:49 Finished: testFoo {p0=8}
20-Nov-2018 10:00:49 Started : testFoo {p0=9}
20-Nov-2018 10:00:49 Finished: testFoo {p0=9}
20-Nov-2018 10:00:49 Run finished: run=10, ignored=0, failures=0, assumptions=0
20-Nov-2018 10:00:49
20-Nov-2018 10:00:49 Run started.
20-Nov-2018 10:00:49 Started : testFoo {p0=0}
20-Nov-2018 10:00:49 Finished: testFoo {p0=0}
20-Nov-2018 10:00:49 Started : testFoo {p0=1}
20-Nov-2018 10:00:49 Finished: testFoo {p0=1}
20-Nov-2018 10:00:49 Started : testFoo {p0=2}
20-Nov-2018 10:00:49 Finished: testFoo {p0=2}
20-Nov-2018 10:00:49 Started : testFoo {p0=3}
20-Nov-2018 10:00:49 Finished: testFoo {p0=3}
20-Nov-2018 10:00:49 Started : testFoo {p0=4}
20-Nov-2018 10:00:49 Finished: testFoo {p0=4}
20-Nov-2018 10:00:49 Started : testFoo {p0=5}
20-Nov-2018 10:00:49 Finished: testFoo {p0=5}
20-Nov-2018 10:00:49 Started : testFoo {p0=6}
20-Nov-2018 10:00:49 Finished: testFoo {p0=6}
20-Nov-2018 10:00:49 Started : testFoo {p0=7}
20-Nov-2018 10:00:49 Finished: testFoo {p0=7}
20-Nov-2018 10:00:49 Started : testFoo {p0=8}
20-Nov-2018 10:00:49 Finished: testFoo {p0=8}
20-Nov-2018 10:00:49 Started : testFoo {p0=9}
20-Nov-2018 10:00:49 Finished: testFoo {p0=9}
20-Nov-2018 10:00:49 Run finished: run=10, ignored=0, failures=0, assumptions=0
20-Nov-2018 10:00:49
20-Nov-2018 10:00:49 Run started.
20-Nov-2018 10:00:49 Started : testFoo {p0=0}
20-Nov-2018 10:00:49 Finished: testFoo {p0=0}
20-Nov-2018 10:00:49 Started : testFoo {p0=1}
20-Nov-2018 10:00:49 Finished: testFoo {p0=1}
20-Nov-2018 10:00:49 Started : testFoo {p0=2}
20-Nov-2018 10:00:49 Finished: testFoo {p0=2}
20-Nov-2018 10:00:49 Started : testFoo {p0=3}
20-Nov-2018 10:00:49 Finished: testFoo {p0=3}
20-Nov-2018 10:00:49 Started : testFoo {p0=4}
20-Nov-2018 10:00:49 Finished: testFoo {p0=4}
20-Nov-2018 10:00:49 Started : testFoo {p0=5}
20-Nov-2018 10:00:49 Finished: testFoo {p0=5}
20-Nov-2018 10:00:49 Started : testFoo {p0=6}
20-Nov-2018 10:00:49 Finished: testFoo {p0=6}
20-Nov-2018 10:00:49 Started : testFoo {p0=7}
20-Nov-2018 10:00:49 Finished: testFoo {p0=7}
20-Nov-2018 10:00:49 Started : testFoo {p0=8}
20-Nov-2018 10:00:49 Finished: testFoo {p0=8}
20-Nov-2018 10:00:49 Started : testFoo {p0=9}
20-Nov-2018 10:00:49 Finished: testFoo {p0=9}
20-Nov-2018 10:00:49 Run finished: run=10, ignored=0, failures=0, assumptions=0
20-Nov-2018 10:00:49
20-Nov-2018 10:00:49 Run started.
20-Nov-2018 10:00:49 Started : testFoo {p0=0}
20-Nov-2018 10:00:49 Finished: testFoo {p0=0}
20-Nov-2018 10:00:49 Started : testFoo {p0=1}
20-Nov-2018 10:00:49 Finished: testFoo {p0=1}
20-Nov-2018 10:00:49 Started : testFoo {p0=2}
20-Nov-2018 10:00:49 Finished: testFoo {p0=2}
20-Nov-2018 10:00:49 Started : testFoo {p0=3}
20-Nov-2018 10:00:49 Finished: testFoo {p0=3}
20-Nov-2018 10:00:49 Started : testFoo {p0=4}
20-Nov-2018 10:00:49 Finished: testFoo {p0=4}
20-Nov-2018 10:00:49 Started : testFoo {p0=5}
20-Nov-2018 10:00:49 Finished: testFoo {p0=5}
20-Nov-2018 10:00:49 Started : testFoo {p0=6}
20-Nov-2018 10:00:49 Finished: testFoo {p0=6}
20-Nov-2018 10:00:49 Started : testFoo {p0=7}
20-Nov-2018 10:00:49 Finished: testFoo {p0=7}
20-Nov-2018 10:00:49 Started : testFoo {p0=8}
20-Nov-2018 10:00:49 Finished: testFoo {p0=8}
20-Nov-2018 10:00:49 Started : testFoo {p0=9}
20-Nov-2018 10:00:49 Finished: testFoo {p0=9}
20-Nov-2018 10:00:49 Run finished: run=10, ignored=0, failures=0, assumptions=0
20-Nov-2018 10:00:49
20-Nov-2018 10:00:49 Tests run: 2, Failures: 0, Errors: 0, Skipped: 0, Time elapsed: 0.138 sec - in com.carrotsearch.randomizedtesting.TestParameterizedShufflesOrder
20-Nov-2018 10:00:49 Running com.carrotsearch.randomizedtesting.TestTestFiltering
20-Nov-2018 10:00:49 Run started.
20-Nov-2018 10:00:49 Started : test1
20-Nov-2018 10:00:49 Assumpt.: test1(com.carrotsearch.randomizedtesting.TestTestFiltering$Nested1): 'foo' test group is disabled (@Foo())
20-Nov-2018 10:00:49 Finished: test1
20-Nov-2018 10:00:49 Run finished: run=1, ignored=0, failures=0, assumptions=1
20-Nov-2018 10:00:49
20-Nov-2018 10:00:49 Run started.
20-Nov-2018 10:00:49 Started : test1
20-Nov-2018 10:00:49 Finished: test1
20-Nov-2018 10:00:49 Run finished: run=1, ignored=0, failures=0, assumptions=0
20-Nov-2018 10:00:49
20-Nov-2018 10:00:49 Run started.
20-Nov-2018 10:00:49 Run finished: run=0, ignored=0, failures=0, assumptions=0
20-Nov-2018 10:00:49
20-Nov-2018 10:00:49 Tests run: 1, Failures: 0, Errors: 0, Skipped: 0, Time elapsed: 0.01 sec - in com.carrotsearch.randomizedtesting.TestTestFiltering
20-Nov-2018 10:00:49 Running com.carrotsearch.randomizedtesting.TestManyThreadsOOM
20-Nov-2018 10:00:54 Tests run: 10, Failures: 0, Errors: 0, Skipped: 0, Time elapsed: 5.09 sec - in com.carrotsearch.randomizedtesting.TestManyThreadsOOM
20-Nov-2018 10:00:54 Running com.carrotsearch.randomizedtesting.TestParameterized
20-Nov-2018 10:00:54 Run started.
20-Nov-2018 10:00:54 Started : testMe
20-Nov-2018 10:00:54 Finished: testMe
20-Nov-2018 10:00:54 Started : testMe {#2}
20-Nov-2018 10:00:54 Finished: testMe {#2}
20-Nov-2018 10:00:54 Run finished: run=2, ignored=0, failures=0, assumptions=0
20-Nov-2018 10:00:54
20-Nov-2018 10:00:54 Run started.
20-Nov-2018 10:00:54 Started : testThree {value=1 string=abc seed=[E550F6F72E147AA:CAFEBABE]}
20-Nov-2018 10:00:54 Finished: testThree {value=1 string=abc seed=[E550F6F72E147AA:CAFEBABE]}
20-Nov-2018 10:00:54 Started : testThree {value=1 string=abc seed=[E550F6F72E147AA:CAFEBABE] #2}
20-Nov-2018 10:00:54 Finished: testThree {value=1 string=abc seed=[E550F6F72E147AA:CAFEBABE] #2}
20-Nov-2018 10:00:54 Started : testThree {value=1 string=abc seed=[E550F6F72E147AA:DEADBEEF]}
20-Nov-2018 10:00:54 Finished: testThree {value=1 string=abc seed=[E550F6F72E147AA:DEADBEEF]}
20-Nov-2018 10:00:54 Started : testThree {value=1 string=abc seed=[E550F6F72E147AA:DEADBEEF] #2}
20-Nov-2018 10:00:54 Finished: testThree {value=1 string=abc seed=[E550F6F72E147AA:DEADBEEF] #2}
20-Nov-2018 10:00:54 Started : testOne {value=1 string=abc seed=[E550F6F72E147AA:DA5727ACAB98953A]}
20-Nov-2018 10:00:54 Finished: testOne {value=1 string=abc seed=[E550F6F72E147AA:DA5727ACAB98953A]}
20-Nov-2018 10:00:54 Started : testOne {value=1 string=abc seed=[E550F6F72E147AA:6E019B509F5A5E16]}
20-Nov-2018 10:00:54 Finished: testOne {value=1 string=abc seed=[E550F6F72E147AA:6E019B509F5A5E16]}
20-Nov-2018 10:00:54 Started : testOne {value=1 string=abc seed=[E550F6F72E147AA:E0E80D8CCE9E16DD]}
20-Nov-2018 10:00:54 Finished: testOne {value=1 string=abc seed=[E550F6F72E147AA:E0E80D8CCE9E16DD]}
20-Nov-2018 10:00:54 Started : testTwo {value=1 string=abc}
20-Nov-2018 10:00:54 Finished: testTwo {value=1 string=abc}
20-Nov-2018 10:00:54 Started : testThree {value=2 string=def seed=[E550F6F72E147AA:CAFEBABE]}
20-Nov-2018 10:00:54 Finished: testThree {value=2 string=def seed=[E550F6F72E147AA:CAFEBABE]}
20-Nov-2018 10:00:54 Started : testThree {value=2 string=def seed=[E550F6F72E147AA:CAFEBABE] #2}
20-Nov-2018 10:00:54 Finished: testThree {value=2 string=def seed=[E550F6F72E147AA:CAFEBABE] #2}
20-Nov-2018 10:00:54 Started : testThree {value=2 string=def seed=[E550F6F72E147AA:DEADBEEF]}
20-Nov-2018 10:00:54 Finished: testThree {value=2 string=def seed=[E550F6F72E147AA:DEADBEEF]}
20-Nov-2018 10:00:54 Started : testThree {value=2 string=def seed=[E550F6F72E147AA:DEADBEEF] #2}
20-Nov-2018 10:00:54 Finished: testThree {value=2 string=def seed=[E550F6F72E147AA:DEADBEEF] #2}
20-Nov-2018 10:00:54 Started : testOne {value=2 string=def seed=[E550F6F72E147AA:DA5727ACAB98953A]}
20-Nov-2018 10:00:54 Finished: testOne {value=2 string=def seed=[E550F6F72E147AA:DA5727ACAB98953A]}
20-Nov-2018 10:00:54 Started : testOne {value=2 string=def seed=[E550F6F72E147AA:6E019B509F5A5E16]}
20-Nov-2018 10:00:54 Finished: testOne {value=2 string=def seed=[E550F6F72E147AA:6E019B509F5A5E16]}
20-Nov-2018 10:00:54 Started : testOne {value=2 string=def seed=[E550F6F72E147AA:E0E80D8CCE9E16DD]}
20-Nov-2018 10:00:54 Finished: testOne {value=2 string=def seed=[E550F6F72E147AA:E0E80D8CCE9E16DD]}
20-Nov-2018 10:00:54 Started : testTwo {value=2 string=def}
20-Nov-2018 10:00:54 Finished: testTwo {value=2 string=def}
20-Nov-2018 10:00:54 Run finished: run=16, ignored=0, failures=0, assumptions=0
20-Nov-2018 10:00:54
20-Nov-2018 10:00:54 Run started.
20-Nov-2018 10:00:54 Started : failing {paramName=xyz}
20-Nov-2018 10:00:54 Failure : failing {paramName=xyz}(com.carrotsearch.randomizedtesting.TestParameterized$Nested2): Constructor arguments do not match provider parameters?
20-Nov-2018 10:00:54 Finished: failing {paramName=xyz}
20-Nov-2018 10:00:54 Run finished: run=1, ignored=0, failures=1, assumptions=0
20-Nov-2018 10:00:54
20-Nov-2018 10:00:54 Run started.
20-Nov-2018 10:00:54 Run finished: run=0, ignored=0, failures=0, assumptions=0
20-Nov-2018 10:00:54
20-Nov-2018 10:00:54 Run started.
20-Nov-2018 10:00:54 Run finished: run=0, ignored=0, failures=0, assumptions=0
20-Nov-2018 10:00:54
20-Nov-2018 10:00:54 Tests run: 4, Failures: 0, Errors: 0, Skipped: 0, Time elapsed: 0.019 sec - in com.carrotsearch.randomizedtesting.TestParameterized
20-Nov-2018 10:00:54 Running com.carrotsearch.randomizedtesting.TestGlobFilter
20-Nov-2018 10:00:54 Tests run: 1, Failures: 0, Errors: 0, Skipped: 0, Time elapsed: 0 sec - in com.carrotsearch.randomizedtesting.TestGlobFilter
20-Nov-2018 10:00:54 Running com.carrotsearch.randomizedtesting.TestFailurePropagationCompatibility
20-Nov-2018 10:00:54 Tests run: 1, Failures: 0, Errors: 0, Skipped: 0, Time elapsed: 0.142 sec - in com.carrotsearch.randomizedtesting.TestFailurePropagationCompatibility
20-Nov-2018 10:00:54 Running com.carrotsearch.randomizedtesting.TestFilterExpressionParser
20-Nov-2018 10:00:54 --
20-Nov-2018 10:00:54    default
20-Nov-2018 10:00:54 -- default
20-Nov-2018 10:00:54    default
20-Nov-2018 10:00:54 -- @nightly
20-Nov-2018 10:00:54    @nightly
20-Nov-2018 10:00:54 -- @nightly or @slow
20-Nov-2018 10:00:54    (@nightly OR @slow)
20-Nov-2018 10:00:54 -- @nightly and @slow
20-Nov-2018 10:00:54    (@nightly AND @slow)
20-Nov-2018 10:00:54 -- @nightly and not @slow
20-Nov-2018 10:00:54    (@nightly AND (NOT @slow))
20-Nov-2018 10:00:54 -- @nightly and (not @slow)
20-Nov-2018 10:00:54    (@nightly AND (NOT @slow))
20-Nov-2018 10:00:54 -- not @slow
20-Nov-2018 10:00:54    (NOT @slow)
20-Nov-2018 10:00:54 -- not not @slow
20-Nov-2018 10:00:54    (NOT (NOT @slow))
20-Nov-2018 10:00:54 -- not @nightly or @slow
20-Nov-2018 10:00:54    ((NOT @nightly) OR @slow)
20-Nov-2018 10:00:54 -- not(@nightly or @slow)
20-Nov-2018 10:00:54    (NOT (@nightly OR @slow))
20-Nov-2018 10:00:54 -- (@nightly and (not @slow))
20-Nov-2018 10:00:54    (@nightly AND (NOT @slow))
20-Nov-2018 10:00:54 -- nightly
20-Nov-2018 10:00:54    Unrecognized token 'nightly'. At: ">nightly<"
20-Nov-2018 10:00:54 -- @nightly and
20-Nov-2018 10:00:54    Missing argument for AND. At: "@nightly >and< "
20-Nov-2018 10:00:54 -- @nightly or
20-Nov-2018 10:00:54    Missing argument for OR. At: "@nightly >or< "
20-Nov-2018 10:00:54 -- @nightly and or @slow
20-Nov-2018 10:00:54    Syntax error. At: "@nightly and >or< @slow"
20-Nov-2018 10:00:54 -- and not @slow
20-Nov-2018 10:00:54    Syntax error. At: ">and< not @slow"
20-Nov-2018 10:00:54 -- (@nightly))
20-Nov-2018 10:00:54    Unbalanced parenthesis. At: "(@nightly)>)<"
20-Nov-2018 10:00:54 -- ((@nightly or @slow)
20-Nov-2018 10:00:54    Expected closing bracket. At: "((@nightly or @slow)><"
20-Nov-2018 10:00:54 Tests run: 5, Failures: 0, Errors: 0, Skipped: 0, Time elapsed: 0.002 sec - in com.carrotsearch.randomizedtesting.TestFilterExpressionParser
20-Nov-2018 10:00:54 Running com.carrotsearch.randomizedtesting.TestFormattingRandomSeeds
20-Nov-2018 10:00:54 Tests run: 1003, Failures: 0, Errors: 0, Skipped: 0, Time elapsed: 0.355 sec - in com.carrotsearch.randomizedtesting.TestFormattingRandomSeeds
20-Nov-2018 10:00:54 Running com.carrotsearch.randomizedtesting.TestRandomNumbers
20-Nov-2018 10:00:55 Tests run: 200, Failures: 0, Errors: 0, Skipped: 0, Time elapsed: 1.096 sec - in com.carrotsearch.randomizedtesting.TestRandomNumbers
20-Nov-2018 10:00:55 Running com.carrotsearch.randomizedtesting.TestContextRandom
20-Nov-2018 10:00:55 Run started.
20-Nov-2018 10:00:55 Started : testMethod
20-Nov-2018 10:00:55 Finished: testMethod
20-Nov-2018 10:00:55 Run finished: run=1, ignored=0, failures=0, assumptions=0
20-Nov-2018 10:00:55
20-Nov-2018 10:00:55 Run started.
20-Nov-2018 10:00:55 Started : testMethod
20-Nov-2018 10:00:55 Finished: testMethod
20-Nov-2018 10:00:55 Run finished: run=1, ignored=0, failures=0, assumptions=0
20-Nov-2018 10:00:55
20-Nov-2018 10:00:55 Run started.
20-Nov-2018 10:00:55 Started : testMethod
20-Nov-2018 10:00:55 Finished: testMethod
20-Nov-2018 10:00:55 Run finished: run=1, ignored=0, failures=0, assumptions=0
20-Nov-2018 10:00:55
20-Nov-2018 10:00:55 Run started.
20-Nov-2018 10:00:55 Started : testMethod
20-Nov-2018 10:00:55 Finished: testMethod
20-Nov-2018 10:00:55 Run finished: run=1, ignored=0, failures=0, assumptions=0
20-Nov-2018 10:00:55
20-Nov-2018 10:00:55 Tests run: 3, Failures: 0, Errors: 0, Skipped: 1, Time elapsed: 0.008 sec - in com.carrotsearch.randomizedtesting.TestContextRandom
20-Nov-2018 10:00:55 Running com.carrotsearch.randomizedtesting.TestRandomInStaticInitializer
20-Nov-2018 10:00:55 Tests run: 1, Failures: 0, Errors: 0, Skipped: 0, Time elapsed: 0.001 sec - in com.carrotsearch.randomizedtesting.TestRandomInStaticInitializer
20-Nov-2018 10:00:55 Running com.carrotsearch.randomizedtesting.TestStackAugmentation
20-Nov-2018 10:00:55 Run started.
20-Nov-2018 10:00:55 Failure : com.carrotsearch.randomizedtesting.TestStackAugmentation$Nested2: beforeclass.
20-Nov-2018 10:00:55 Run finished: run=0, ignored=0, failures=1, assumptions=0
20-Nov-2018 10:00:55
20-Nov-2018 10:00:55 Run started.
20-Nov-2018 10:00:55 Started : testMethod1
20-Nov-2018 10:00:55 Failure : testMethod1(com.carrotsearch.randomizedtesting.TestStackAugmentation$Nested): Outer.
20-Nov-2018 10:00:55 Finished: testMethod1
20-Nov-2018 10:00:55 Run finished: run=1, ignored=0, failures=1, assumptions=0
20-Nov-2018 10:00:55
20-Nov-2018 10:00:55 Run started.
20-Nov-2018 10:00:55 Started : testMethod1
20-Nov-2018 10:00:55 Finished: testMethod1
20-Nov-2018 10:00:55 Failure : com.carrotsearch.randomizedtesting.TestStackAugmentation$Nested3: afterclass.
20-Nov-2018 10:00:55 Run finished: run=1, ignored=0, failures=1, assumptions=0
20-Nov-2018 10:00:55
20-Nov-2018 10:00:55 Tests run: 3, Failures: 0, Errors: 0, Skipped: 0, Time elapsed: 0.006 sec - in com.carrotsearch.randomizedtesting.TestStackAugmentation
20-Nov-2018 10:00:55 Running com.carrotsearch.randomizedtesting.TestExpected
20-Nov-2018 10:00:55 Run started.
20-Nov-2018 10:00:55 Started : testMethod1
20-Nov-2018 10:00:55 Failure : testMethod1(com.carrotsearch.randomizedtesting.TestExpected$Nested2): Expected an exception but the test passed: java.lang.RuntimeException
20-Nov-2018 10:00:55 Finished: testMethod1
20-Nov-2018 10:00:55 Run finished: run=1, ignored=0, failures=1, assumptions=0
20-Nov-2018 10:00:55
20-Nov-2018 10:00:55 Run started.
20-Nov-2018 10:00:55 Started : testMethod1
20-Nov-2018 10:00:55 Finished: testMethod1
20-Nov-2018 10:00:55 Started : testMethod2
20-Nov-2018 10:00:55 Failure : testMethod2(com.carrotsearch.randomizedtesting.TestExpected$Nested1): null
20-Nov-2018 10:00:55 Finished: testMethod2
20-Nov-2018 10:00:55 Run finished: run=2, ignored=0, failures=1, assumptions=0
20-Nov-2018 10:00:55
20-Nov-2018 10:00:55 Tests run: 2, Failures: 0, Errors: 0, Skipped: 0, Time elapsed: 0.006 sec - in com.carrotsearch.randomizedtesting.TestExpected
20-Nov-2018 10:00:55 Running com.carrotsearch.randomizedtesting.contracts.TestClassRules
20-Nov-2018 10:00:55 Run started.
20-Nov-2018 10:00:55 Started : passing
20-Nov-2018 10:00:55 Finished: passing
20-Nov-2018 10:00:55 Run finished: run=1, ignored=0, failures=0, assumptions=0
20-Nov-2018 10:00:55
20-Nov-2018 10:00:55 Tests run: 1, Failures: 0, Errors: 0, Skipped: 0, Time elapsed: 0.002 sec - in com.carrotsearch.randomizedtesting.contracts.TestClassRules
20-Nov-2018 10:00:55 Running com.carrotsearch.randomizedtesting.contracts.TestBeforeAfterMethodOrder
20-Nov-2018 10:00:55 Run started.
20-Nov-2018 10:00:55 Started : testMethod
20-Nov-2018 10:00:55 Finished: testMethod
20-Nov-2018 10:00:55 Run finished: run=1, ignored=0, failures=0, assumptions=0
20-Nov-2018 10:00:55
20-Nov-2018 10:00:55 Tests run: 2, Failures: 0, Errors: 0, Skipped: 0, Time elapsed: 0.025 sec - in com.carrotsearch.randomizedtesting.contracts.TestBeforeAfterMethodOrder
20-Nov-2018 10:00:55 Running com.carrotsearch.randomizedtesting.contracts.TestClassLevelIgnore
20-Nov-2018 10:00:55 Run started.
20-Nov-2018 10:00:55 Ignored : null
20-Nov-2018 10:00:55 Run finished: run=0, ignored=1, failures=0, assumptions=0
20-Nov-2018 10:00:55
20-Nov-2018 10:00:55 Tests run: 1, Failures: 0, Errors: 0, Skipped: 0, Time elapsed: 0.001 sec - in com.carrotsearch.randomizedtesting.contracts.TestClassLevelIgnore
20-Nov-2018 10:00:55 Running com.carrotsearch.randomizedtesting.contracts.TestAssumptionsAtClassLevel
20-Nov-2018 10:00:55 Run started.
20-Nov-2018 10:00:55 Assumpt.: com.carrotsearch.randomizedtesting.contracts.TestAssumptionsAtClassLevel$SubSub: got: <false>, expected: is <true>
20-Nov-2018 10:00:55 Ignored : testMethod
20-Nov-2018 10:00:55 Run finished: run=0, ignored=1, failures=0, assumptions=1
20-Nov-2018 10:00:55
20-Nov-2018 10:00:55 Tests run: 1, Failures: 0, Errors: 0, Skipped: 0, Time elapsed: 0.002 sec - in com.carrotsearch.randomizedtesting.contracts.TestAssumptionsAtClassLevel
20-Nov-2018 10:00:55 Running com.carrotsearch.randomizedtesting.contracts.TestAnnotationInheritance
20-Nov-2018 10:00:55 Run started.
20-Nov-2018 10:00:55 Started : testMethod1
20-Nov-2018 10:00:55 Finished: testMethod1
20-Nov-2018 10:00:55 Run finished: run=1, ignored=0, failures=0, assumptions=0
20-Nov-2018 10:00:55
20-Nov-2018 10:00:55 Tests run: 1, Failures: 0, Errors: 0, Skipped: 0, Time elapsed: 0.003 sec - in com.carrotsearch.randomizedtesting.contracts.TestAnnotationInheritance
20-Nov-2018 10:00:55 Running com.carrotsearch.randomizedtesting.contracts.TestMethodFilteringInIDEs
20-Nov-2018 10:00:55 Tests run: 8, Failures: 0, Errors: 0, Skipped: 4, Time elapsed: 0.005 sec - in com.carrotsearch.randomizedtesting.contracts.TestMethodFilteringInIDEs
20-Nov-2018 10:00:55 Running com.carrotsearch.randomizedtesting.TestSetSeedLocked
20-Nov-2018 10:00:55 Tests run: 1, Failures: 0, Errors: 0, Skipped: 0, Time elapsed: 0.002 sec - in com.carrotsearch.randomizedtesting.TestSetSeedLocked
20-Nov-2018 10:00:55 Running com.carrotsearch.randomizedtesting.rules.TestSystemPropertiesInvariantRule
20-Nov-2018 10:00:55 Run started.
20-Nov-2018 10:00:55 Started : testMethod1
20-Nov-2018 10:00:55 Finished: testMethod1
20-Nov-2018 10:00:55 Started : testMethod2
20-Nov-2018 10:00:55 Failure : testMethod2(com.carrotsearch.randomizedtesting.rules.TestSystemPropertiesInvariantRule$NonStringProperties): Will pass.
20-Nov-2018 10:00:55 Finished: testMethod2
20-Nov-2018 10:00:55 Started : testEmpty
20-Nov-2018 10:00:55 Finished: testEmpty
20-Nov-2018 10:00:55 Run finished: run=3, ignored=0, failures=1, assumptions=0
20-Nov-2018 10:00:55
20-Nov-2018 10:00:55 Run started.
20-Nov-2018 10:00:55 Started : testEmpty
20-Nov-2018 10:00:55 Finished: testEmpty
20-Nov-2018 10:00:55 Failure : com.carrotsearch.randomizedtesting.rules.TestSystemPropertiesInvariantRule$InAfterClass: System properties invariant violated.
20-Nov-2018 10:00:55 New keys:
20-Nov-2018 10:00:55   new-property-1=new-value-1
20-Nov-2018 10:00:55
20-Nov-2018 10:00:56 Run finished: run=1, ignored=0, failures=1, assumptions=0
20-Nov-2018 10:00:56
20-Nov-2018 10:00:56 Run started.
20-Nov-2018 10:00:56 Started : testMethod1
20-Nov-2018 10:00:56 Failure : testMethod1(com.carrotsearch.randomizedtesting.rules.TestSystemPropertiesInvariantRule$InTestMethod): System properties invariant violated.
20-Nov-2018 10:00:56 New keys:
20-Nov-2018 10:00:56   new-property-1=new-value-1
20-Nov-2018 10:00:56
20-Nov-2018 10:00:56 Finished: testMethod1
20-Nov-2018 10:00:56 Started : testMethod2
20-Nov-2018 10:00:56 Failure : testMethod2(com.carrotsearch.randomizedtesting.rules.TestSystemPropertiesInvariantRule$InTestMethod): System properties invariant violated.
20-Nov-2018 10:00:56 New keys:
20-Nov-2018 10:00:56   new-property-1=new-value-1
20-Nov-2018 10:00:56
20-Nov-2018 10:00:56 Finished: testMethod2
20-Nov-2018 10:00:56 Started : testEmpty
20-Nov-2018 10:00:56 Finished: testEmpty
20-Nov-2018 10:00:56 Run finished: run=3, ignored=0, failures=2, assumptions=0
20-Nov-2018 10:00:56
20-Nov-2018 10:00:56 Run started.
20-Nov-2018 10:00:56 Started : testEmpty
20-Nov-2018 10:00:56 Finished: testEmpty
20-Nov-2018 10:00:56 Failure : com.carrotsearch.randomizedtesting.rules.TestSystemPropertiesInvariantRule$InBeforeClass: System properties invariant violated.
20-Nov-2018 10:00:56 New keys:
20-Nov-2018 10:00:56   new-property-1=new-value-1
20-Nov-2018 10:00:56
20-Nov-2018 10:00:56 Run finished: run=1, ignored=0, failures=1, assumptions=0
20-Nov-2018 10:00:56
20-Nov-2018 10:00:56 Tests run: 4, Failures: 0, Errors: 0, Skipped: 0, Time elapsed: 0.006 sec - in com.carrotsearch.randomizedtesting.rules.TestSystemPropertiesInvariantRule
20-Nov-2018 10:00:56 Running com.carrotsearch.randomizedtesting.rules.TestNoInstanceHooksOverridesRule
20-Nov-2018 10:00:56 Run started.
20-Nov-2018 10:00:56 Started : testEmpty
20-Nov-2018 10:00:56 Finished: testEmpty
20-Nov-2018 10:00:56 Run finished: run=1, ignored=0, failures=0, assumptions=0
20-Nov-2018 10:00:56
20-Nov-2018 10:00:56 Run started.
20-Nov-2018 10:00:56 Failure : com.carrotsearch.randomizedtesting.rules.TestNoInstanceHooksOverridesRule$Sub2: There are overridden methods annotated with org.junit.Before. These methods would not be executed by JUnit and need to manually chain themselves which can lead to maintenance problems. Consider using different method names or make hook methods private.
20-Nov-2018 10:00:56 Methods annotated with @org.junit.Before shadow or override each other:
20-Nov-2018 10:00:56   - @Before public void com.carrotsearch.randomizedtesting.rules.TestNoInstanceHooksOverridesRule$Super.before()
20-Nov-2018 10:00:56   - @Before public void com.carrotsearch.randomizedtesting.rules.TestNoInstanceHooksOverridesRule$Sub2.before()
20-Nov-2018 10:00:56 Run finished: run=0, ignored=0, failures=1, assumptions=0
20-Nov-2018 10:00:56
20-Nov-2018 10:00:56 Run started.
20-Nov-2018 10:00:56 Failure : com.carrotsearch.randomizedtesting.rules.TestNoInstanceHooksOverridesRule$Sub1: There are overridden methods annotated with org.junit.Before. These methods would not be executed by JUnit and need to manually chain themselves which can lead to maintenance problems. Consider using different method names or make hook methods private.
20-Nov-2018 10:00:56 Methods annotated with @org.junit.Before shadow or override each other:
20-Nov-2018 10:00:56   - @Before public void com.carrotsearch.randomizedtesting.rules.TestNoInstanceHooksOverridesRule$Super.before()
20-Nov-2018 10:00:56   - public void com.carrotsearch.randomizedtesting.rules.TestNoInstanceHooksOverridesRule$Sub1.before()
20-Nov-2018 10:00:56 Run finished: run=0, ignored=0, failures=1, assumptions=0
20-Nov-2018 10:00:56
20-Nov-2018 10:00:56 Run started.
20-Nov-2018 10:00:56 Started : testEmpty
20-Nov-2018 10:00:56 Finished: testEmpty
20-Nov-2018 10:00:56 Run finished: run=1, ignored=0, failures=0, assumptions=0
20-Nov-2018 10:00:56
20-Nov-2018 10:00:56 Tests run: 4, Failures: 0, Errors: 0, Skipped: 0, Time elapsed: 0.013 sec - in com.carrotsearch.randomizedtesting.rules.TestNoInstanceHooksOverridesRule
20-Nov-2018 10:00:56 Running com.carrotsearch.randomizedtesting.rules.TestNoClassHooksShadowingRule
20-Nov-2018 10:00:56 Run started.
20-Nov-2018 10:00:56 Failure : com.carrotsearch.randomizedtesting.rules.TestNoClassHooksShadowingRule$Sub2: There are overridden methods annotated with org.junit.BeforeClass. These methods would not be executed by JUnit and need to manually chain themselves which can lead to maintenance problems. Consider using different method names or make hook methods private.
20-Nov-2018 10:00:56 Methods annotated with @org.junit.BeforeClass shadow or override each other:
20-Nov-2018 10:00:56   - @BeforeClass public static void com.carrotsearch.randomizedtesting.rules.TestNoClassHooksShadowingRule$Super.before()
20-Nov-2018 10:00:56   - @BeforeClass public static void com.carrotsearch.randomizedtesting.rules.TestNoClassHooksShadowingRule$Sub2.before()
20-Nov-2018 10:00:56 Run finished: run=0, ignored=0, failures=1, assumptions=0
20-Nov-2018 10:00:56
20-Nov-2018 10:00:56 Run started.
20-Nov-2018 10:00:56 Started : testEmpty
20-Nov-2018 10:00:56 Finished: testEmpty
20-Nov-2018 10:00:56 Run finished: run=1, ignored=0, failures=0, assumptions=0
20-Nov-2018 10:00:56
20-Nov-2018 10:00:56 Run started.
20-Nov-2018 10:00:56 Failure : com.carrotsearch.randomizedtesting.rules.TestNoClassHooksShadowingRule$Sub1: There are overridden methods annotated with org.junit.BeforeClass. These methods would not be executed by JUnit and need to manually chain themselves which can lead to maintenance problems. Consider using different method names or make hook methods private.
20-Nov-2018 10:00:56 Methods annotated with @org.junit.BeforeClass shadow or override each other:
20-Nov-2018 10:00:56   - @BeforeClass public static void com.carrotsearch.randomizedtesting.rules.TestNoClassHooksShadowingRule$Super.before()
20-Nov-2018 10:00:56   - public static void com.carrotsearch.randomizedtesting.rules.TestNoClassHooksShadowingRule$Sub1.before()
20-Nov-2018 10:00:56 Run finished: run=0, ignored=0, failures=1, assumptions=0
20-Nov-2018 10:00:56
20-Nov-2018 10:00:56 Tests run: 3, Failures: 0, Errors: 0, Skipped: 0, Time elapsed: 0.009 sec - in com.carrotsearch.randomizedtesting.rules.TestNoClassHooksShadowingRule
20-Nov-2018 10:00:56 Running com.carrotsearch.randomizedtesting.rules.TestStaticFieldsInvariantRule
20-Nov-2018 10:00:56 Run started.
20-Nov-2018 10:00:56 Started : testEmpty
20-Nov-2018 10:00:56 Finished: testEmpty
20-Nov-2018 10:00:56 Run finished: run=1, ignored=0, failures=0, assumptions=0
20-Nov-2018 10:00:56
20-Nov-2018 10:00:56 Run started.
20-Nov-2018 10:00:56 Started : testEmpty
20-Nov-2018 10:00:56 Finished: testEmpty
20-Nov-2018 10:00:56 Run finished: run=1, ignored=0, failures=0, assumptions=0
20-Nov-2018 10:00:56
20-Nov-2018 10:00:56 Run started.
20-Nov-2018 10:00:56 Started : testEmpty
20-Nov-2018 10:00:56 Finished: testEmpty
20-Nov-2018 10:00:56 Failure : com.carrotsearch.randomizedtesting.rules.TestStaticFieldsInvariantRule$Exceeding: Clean up static fields (in @AfterClass?), your test seems to hang on to approximately 5,243,600 bytes (threshold is 5,242,880). Field reference sizes (counted individually):
20-Nov-2018 10:00:56   - 2,621,456 bytes, static byte[] com.carrotsearch.randomizedtesting.rules.TestStaticFieldsInvariantRule$Exceeding.field1
20-Nov-2018 10:00:56   - 2,621,456 bytes, static byte[] com.carrotsearch.randomizedtesting.rules.TestStaticFieldsInvariantRule$Smaller.field0
20-Nov-2018 10:00:56   - 416 bytes, static int[] com.carrotsearch.randomizedtesting.rules.TestStaticFieldsInvariantRule$Exceeding.field3
20-Nov-2018 10:00:56   - 136 bytes, public static org.junit.rules.TestRule com.carrotsearch.randomizedtesting.rules.TestStaticFieldsInvariantRule$Base.classRules
20-Nov-2018 10:00:56   - 120 bytes, static byte[] com.carrotsearch.randomizedtesting.rules.TestStaticFieldsInvariantRule$Exceeding.field2
20-Nov-2018 10:00:56   - 16 bytes, private static java.util.concurrent.atomic.AtomicInteger com.carrotsearch.randomizedtesting.RandomizedTest.tempSubFileNameCount
20-Nov-2018 10:00:56   - 16 bytes, private static org.junit.rules.TestRule com.carrotsearch.randomizedtesting.rules.TestStaticFieldsInvariantRule$Base.assumeNotNestedRule
20-Nov-2018 10:00:56 Run finished: run=1, ignored=0, failures=1, assumptions=0
20-Nov-2018 10:00:56
20-Nov-2018 10:00:56 Tests run: 4, Failures: 0, Errors: 0, Skipped: 1, Time elapsed: 0.018 sec - in com.carrotsearch.randomizedtesting.rules.TestStaticFieldsInvariantRule
20-Nov-2018 10:00:56 Running com.carrotsearch.randomizedtesting.TestInstantiationTime
20-Nov-2018 10:00:56 Tests run: 1, Failures: 0, Errors: 0, Skipped: 0, Time elapsed: 0.001 sec - in com.carrotsearch.randomizedtesting.TestInstantiationTime
20-Nov-2018 10:00:56 Running com.carrotsearch.randomizedtesting.TestRandomizedContext
20-Nov-2018 10:00:56 Tests run: 1, Failures: 0, Errors: 0, Skipped: 0, Time elapsed: 0.005 sec - in com.carrotsearch.randomizedtesting.TestRandomizedContext
20-Nov-2018 10:00:56 Running com.carrotsearch.randomizedtesting.TestTestGroups
20-Nov-2018 10:00:56 Run started.
20-Nov-2018 10:00:56 Started : test1
20-Nov-2018 10:00:56 Assumpt.: test1(com.carrotsearch.randomizedtesting.TestTestGroups$Nested1): 'abc' test group is disabled (@Group2())
20-Nov-2018 10:00:56 Finished: test1
20-Nov-2018 10:00:56 Run finished: run=1, ignored=0, failures=0, assumptions=1
20-Nov-2018 10:00:56
20-Nov-2018 10:00:56 Run started.
20-Nov-2018 10:00:56 Started : test1
20-Nov-2018 10:00:56 Assumpt.: test1(com.carrotsearch.randomizedtesting.TestTestGroups$Nested1): 'abc' test group is disabled (@Group2())
20-Nov-2018 10:00:56 Finished: test1
20-Nov-2018 10:00:56 Run finished: run=1, ignored=0, failures=0, assumptions=1
20-Nov-2018 10:00:56
20-Nov-2018 10:00:56 Run started.
20-Nov-2018 10:00:56 Started : test1
20-Nov-2018 10:00:56 Finished: test1
20-Nov-2018 10:00:56 Run finished: run=1, ignored=0, failures=0, assumptions=0
20-Nov-2018 10:00:56
20-Nov-2018 10:00:56 Run started.
20-Nov-2018 10:00:56 Started : test1
20-Nov-2018 10:00:56 Assumpt.: test1(com.carrotsearch.randomizedtesting.TestTestGroups$Nested1): 'group1' test group is disabled (@Group1())
20-Nov-2018 10:00:56 Finished: test1
20-Nov-2018 10:00:56 Run finished: run=1, ignored=0, failures=0, assumptions=1
20-Nov-2018 10:00:56
20-Nov-2018 10:00:56 Run started.
20-Nov-2018 10:00:56 Started : test1
20-Nov-2018 10:00:56 Assumpt.: test1(com.carrotsearch.randomizedtesting.TestTestGroups$Nested3): 'abc' test group is disabled (@Group2())
20-Nov-2018 10:00:56 Finished: test1
20-Nov-2018 10:00:56 Started : testUnconditional
20-Nov-2018 10:00:56 Finished: testUnconditional
20-Nov-2018 10:00:56 Run finished: run=2, ignored=0, failures=0, assumptions=1
20-Nov-2018 10:00:56
20-Nov-2018 10:00:56 Run started.
20-Nov-2018 10:00:56 Started : testUnconditional
20-Nov-2018 10:00:56 Finished: testUnconditional
20-Nov-2018 10:00:56 Started : test1
20-Nov-2018 10:00:56 Assumpt.: test1(com.carrotsearch.randomizedtesting.TestTestGroups$Nested3): 'abc' test group is disabled (@Group2())
20-Nov-2018 10:00:56 Finished: test1
20-Nov-2018 10:00:56 Run finished: run=2, ignored=0, failures=0, assumptions=1
20-Nov-2018 10:00:56
20-Nov-2018 10:00:56 Run started.
20-Nov-2018 10:00:56 Started : test1
20-Nov-2018 10:00:56 Finished: test1
20-Nov-2018 10:00:56 Started : testUnconditional
20-Nov-2018 10:00:56 Finished: testUnconditional
20-Nov-2018 10:00:56 Run finished: run=2, ignored=0, failures=0, assumptions=0
20-Nov-2018 10:00:56
20-Nov-2018 10:00:56 Run started.
20-Nov-2018 10:00:56 Started : test1
20-Nov-2018 10:00:56 Assumpt.: test1(com.carrotsearch.randomizedtesting.TestTestGroups$Nested3): 'group1' test group is disabled (@Group1())
20-Nov-2018 10:00:56 Finished: test1
20-Nov-2018 10:00:56 Started : testUnconditional
20-Nov-2018 10:00:56 Finished: testUnconditional
20-Nov-2018 10:00:56 Run finished: run=2, ignored=0, failures=0, assumptions=1
20-Nov-2018 10:00:56
20-Nov-2018 10:00:56 Run started.
20-Nov-2018 10:00:56 Started : test1
20-Nov-2018 10:00:56 Assumpt.: test1(com.carrotsearch.randomizedtesting.TestTestGroups$Nested2): 'abc' test group is disabled (@Group2())
20-Nov-2018 10:00:56 Finished: test1
20-Nov-2018 10:00:56 Run finished: run=1, ignored=0, failures=0, assumptions=1
20-Nov-2018 10:00:56
20-Nov-2018 10:00:56 Run started.
20-Nov-2018 10:00:56 Started : test1
20-Nov-2018 10:00:56 Assumpt.: test1(com.carrotsearch.randomizedtesting.TestTestGroups$Nested2): 'abc' test group is disabled (@Group2())
20-Nov-2018 10:00:56 Finished: test1
20-Nov-2018 10:00:56 Run finished: run=1, ignored=0, failures=0, assumptions=1
20-Nov-2018 10:00:56
20-Nov-2018 10:00:56 Run started.
20-Nov-2018 10:00:56 Started : test1
20-Nov-2018 10:00:56 Finished: test1
20-Nov-2018 10:00:56 Run finished: run=1, ignored=0, failures=0, assumptions=0
20-Nov-2018 10:00:56
20-Nov-2018 10:00:56 Run started.
20-Nov-2018 10:00:56 Started : test1
20-Nov-2018 10:00:56 Assumpt.: test1(com.carrotsearch.randomizedtesting.TestTestGroups$Nested2): 'group1' test group is disabled (@Group1())
20-Nov-2018 10:00:56 Finished: test1
20-Nov-2018 10:00:56 Run finished: run=1, ignored=0, failures=0, assumptions=1
20-Nov-2018 10:00:56
20-Nov-2018 10:00:56 Tests run: 4, Failures: 0, Errors: 0, Skipped: 0, Time elapsed: 0.025 sec - in com.carrotsearch.randomizedtesting.TestTestGroups
20-Nov-2018 10:00:56 Running com.carrotsearch.randomizedtesting.generators.TestUnicodeGenerator
20-Nov-2018 10:00:56 Tests run: 41, Failures: 0, Errors: 0, Skipped: 0, Time elapsed: 0.027 sec - in com.carrotsearch.randomizedtesting.generators.TestUnicodeGenerator
20-Nov-2018 10:00:56 Running com.carrotsearch.randomizedtesting.generators.TestRealisticUnicodeGenerator
20-Nov-2018 10:00:56 Tests run: 41, Failures: 0, Errors: 0, Skipped: 0, Time elapsed: 0.023 sec - in com.carrotsearch.randomizedtesting.generators.TestRealisticUnicodeGenerator
20-Nov-2018 10:00:56 Running com.carrotsearch.randomizedtesting.generators.TestCodepointSetGenerator
20-Nov-2018 10:00:56 Tests run: 127, Failures: 0, Errors: 0, Skipped: 0, Time elapsed: 0.064 sec - in com.carrotsearch.randomizedtesting.generators.TestCodepointSetGenerator
20-Nov-2018 10:00:56 Running com.carrotsearch.randomizedtesting.generators.TestRandomBytes
20-Nov-2018 10:00:56 Tests run: 200, Failures: 0, Errors: 0, Skipped: 0, Time elapsed: 0.084 sec - in com.carrotsearch.randomizedtesting.generators.TestRandomBytes
20-Nov-2018 10:00:56 Running com.carrotsearch.randomizedtesting.generators.TestRandomPicks
20-Nov-2018 10:00:56 Tests run: 4, Failures: 0, Errors: 0, Skipped: 0, Time elapsed: 0.001 sec - in com.carrotsearch.randomizedtesting.generators.TestRandomPicks
20-Nov-2018 10:00:56 Running com.carrotsearch.randomizedtesting.TestRandomizedTest
20-Nov-2018 10:00:56 Tests run: 19, Failures: 0, Errors: 0, Skipped: 0, Time elapsed: 0.106 sec - in com.carrotsearch.randomizedtesting.TestRandomizedTest
20-Nov-2018 10:00:56 Running com.carrotsearch.randomizedtesting.TestSeedDecorator
20-Nov-2018 10:00:56 Run started.
20-Nov-2018 10:00:56 Started : method1
20-Nov-2018 10:00:56 Finished: method1
20-Nov-2018 10:00:56 Started : method1
20-Nov-2018 10:00:56 Finished: method1
20-Nov-2018 10:00:56 Started : method1
20-Nov-2018 10:00:56 Finished: method1
20-Nov-2018 10:00:56 Started : method1
20-Nov-2018 10:00:56 Finished: method1
20-Nov-2018 10:00:56 Run finished: run=4, ignored=0, failures=0, assumptions=0
20-Nov-2018 10:00:56
20-Nov-2018 10:00:56 Tests run: 1, Failures: 0, Errors: 0, Skipped: 0, Time elapsed: 0.01 sec - in com.carrotsearch.randomizedtesting.TestSeedDecorator
20-Nov-2018 10:00:56 Running com.carrotsearch.randomizedtesting.TestOverlappingMethodProviders
20-Nov-2018 10:00:56 Tests run: 1, Failures: 0, Errors: 0, Skipped: 0, Time elapsed: 0.001 sec - in com.carrotsearch.randomizedtesting.TestOverlappingMethodProviders
20-Nov-2018 10:00:56 Running com.carrotsearch.randomizedtesting.TestJ9SysThreads
20-Nov-2018 10:00:56 Run started.
20-Nov-2018 10:00:56 Started : testMethod1
20-Nov-2018 10:00:56 sun.management.MemoryPoolImpl
20-Nov-2018 10:00:56 sun.management.MemoryPoolImpl
20-Nov-2018 10:00:56 sun.management.MemoryPoolImpl
20-Nov-2018 10:00:56 sun.management.MemoryPoolImpl
20-Nov-2018 10:00:56 sun.management.MemoryPoolImpl
20-Nov-2018 10:00:56 sun.management.MemoryPoolImpl
20-Nov-2018 10:00:56 Finished: testMethod1
20-Nov-2018 10:00:56 Run finished: run=1, ignored=0, failures=0, assumptions=0
20-Nov-2018 10:00:56
20-Nov-2018 10:00:56 Tests run: 1, Failures: 0, Errors: 0, Skipped: 0, Time elapsed: 0.005 sec - in com.carrotsearch.randomizedtesting.TestJ9SysThreads
20-Nov-2018 10:00:56 Running com.carrotsearch.randomizedtesting.TestHookMethodOrderWithExceptions
20-Nov-2018 10:00:56 Run started.
20-Nov-2018 10:00:56 Started : testMethod
20-Nov-2018 10:00:56 Finished: testMethod
20-Nov-2018 10:00:56 Run finished: run=1, ignored=0, failures=0, assumptions=0
20-Nov-2018 10:00:56
20-Nov-2018 10:00:56 Run started.
20-Nov-2018 10:00:56 Started : testMethod
20-Nov-2018 10:00:56 Finished: testMethod
20-Nov-2018 10:00:56 Run finished: run=1, ignored=0, failures=0, assumptions=0
20-Nov-2018 10:00:56
20-Nov-2018 10:00:56 Run started.
20-Nov-2018 10:00:56 Started : testMethod
20-Nov-2018 10:00:56 Failure : testMethod(com.carrotsearch.randomizedtesting.TestHookMethodOrderWithExceptions$WithRegularRunner): null
20-Nov-2018 10:00:56 Finished: testMethod
20-Nov-2018 10:00:56 Run finished: run=1, ignored=0, failures=1, assumptions=0
20-Nov-2018 10:00:56
20-Nov-2018 10:00:56 Run started.
20-Nov-2018 10:00:56 Started : testMethod
20-Nov-2018 10:00:56 Failure : testMethod(com.carrotsearch.randomizedtesting.TestHookMethodOrderWithExceptions$WithRandomizedRunner): null
20-Nov-2018 10:00:56 Finished: testMethod
20-Nov-2018 10:00:56 Run finished: run=1, ignored=0, failures=1, assumptions=0
20-Nov-2018 10:00:56
20-Nov-2018 10:00:56 Run started.
20-Nov-2018 10:00:56 Started : testMethod
20-Nov-2018 10:00:56 Failure : testMethod(com.carrotsearch.randomizedtesting.TestHookMethodOrderWithExceptions$WithRegularRunner): null
20-Nov-2018 10:00:56 Finished: testMethod
20-Nov-2018 10:00:56 Run finished: run=1, ignored=0, failures=1, assumptions=0
20-Nov-2018 10:00:56
20-Nov-2018 10:00:56 Run started.
20-Nov-2018 10:00:56 Started : testMethod
20-Nov-2018 10:00:56 Failure : testMethod(com.carrotsearch.randomizedtesting.TestHookMethodOrderWithExceptions$WithRandomizedRunner): null
20-Nov-2018 10:00:56 Finished: testMethod
20-Nov-2018 10:00:56 Run finished: run=1, ignored=0, failures=1, assumptions=0
20-Nov-2018 10:00:56
20-Nov-2018 10:00:56 Run started.
20-Nov-2018 10:00:56 Started : testMethod
20-Nov-2018 10:00:56 Finished: testMethod
20-Nov-2018 10:00:56 Failure : com.carrotsearch.randomizedtesting.TestHookMethodOrderWithExceptions$WithRegularRunner: null
20-Nov-2018 10:00:56 Run finished: run=1, ignored=0, failures=1, assumptions=0
20-Nov-2018 10:00:56
20-Nov-2018 10:00:56 Run started.
20-Nov-2018 10:00:56 Started : testMethod
20-Nov-2018 10:00:56 Finished: testMethod
20-Nov-2018 10:00:56 Failure : com.carrotsearch.randomizedtesting.TestHookMethodOrderWithExceptions$WithRandomizedRunner: null
20-Nov-2018 10:00:56 Run finished: run=1, ignored=0, failures=1, assumptions=0
20-Nov-2018 10:00:56
20-Nov-2018 10:00:56 Run started.
20-Nov-2018 10:00:56 Started : testMethod
20-Nov-2018 10:00:56 Finished: testMethod
20-Nov-2018 10:00:56 Run finished: run=1, ignored=0, failures=0, assumptions=0
20-Nov-2018 10:00:56
20-Nov-2018 10:00:56 Run started.
20-Nov-2018 10:00:56 Started : testMethod
20-Nov-2018 10:00:56 Finished: testMethod
20-Nov-2018 10:00:56 Run finished: run=1, ignored=0, failures=0, assumptions=0
20-Nov-2018 10:00:56
20-Nov-2018 10:00:56 Run started.
20-Nov-2018 10:00:56 Started : testMethod
20-Nov-2018 10:00:56 Finished: testMethod
20-Nov-2018 10:00:56 Run finished: run=1, ignored=0, failures=0, assumptions=0
20-Nov-2018 10:00:56
20-Nov-2018 10:00:56 Run started.
20-Nov-2018 10:00:56 Started : testMethod
20-Nov-2018 10:00:56 Finished: testMethod
20-Nov-2018 10:00:56 Run finished: run=1, ignored=0, failures=0, assumptions=0
20-Nov-2018 10:00:56
20-Nov-2018 10:00:56 Run started.
20-Nov-2018 10:00:56 Started : testMethod
20-Nov-2018 10:00:56 Finished: testMethod
20-Nov-2018 10:00:56 Run finished: run=1, ignored=0, failures=0, assumptions=0
20-Nov-2018 10:00:56
20-Nov-2018 10:00:56 Run started.
20-Nov-2018 10:00:56 Started : testMethod
20-Nov-2018 10:00:56 Finished: testMethod
20-Nov-2018 10:00:56 Run finished: run=1, ignored=0, failures=0, assumptions=0
20-Nov-2018 10:00:56
20-Nov-2018 10:00:56 Run started.
20-Nov-2018 10:00:56 Started : testMethod
20-Nov-2018 10:00:56 Failure : testMethod(com.carrotsearch.randomizedtesting.TestHookMethodOrderWithExceptions$WithRegularRunner): null
20-Nov-2018 10:00:56 Finished: testMethod
20-Nov-2018 10:00:56 Failure : com.carrotsearch.randomizedtesting.TestHookMethodOrderWithExceptions$WithRegularRunner: null
20-Nov-2018 10:00:56 Run finished: run=1, ignored=0, failures=2, assumptions=0
20-Nov-2018 10:00:56
20-Nov-2018 10:00:56 Run started.
20-Nov-2018 10:00:56 Started : testMethod
20-Nov-2018 10:00:56 Failure : testMethod(com.carrotsearch.randomizedtesting.TestHookMethodOrderWithExceptions$WithRandomizedRunner): null
20-Nov-2018 10:00:56 Finished: testMethod
20-Nov-2018 10:00:56 Failure : com.carrotsearch.randomizedtesting.TestHookMethodOrderWithExceptions$WithRandomizedRunner: null
20-Nov-2018 10:00:56 Run finished: run=1, ignored=0, failures=2, assumptions=0
20-Nov-2018 10:00:56
20-Nov-2018 10:00:56 Run started.
20-Nov-2018 10:00:56 Started : testMethod
20-Nov-2018 10:00:56 Finished: testMethod
20-Nov-2018 10:00:56 Run finished: run=1, ignored=0, failures=0, assumptions=0
20-Nov-2018 10:00:56
20-Nov-2018 10:00:56 Run started.
20-Nov-2018 10:00:56 Started : testMethod
20-Nov-2018 10:00:56 Finished: testMethod
20-Nov-2018 10:00:56 Run finished: run=1, ignored=0, failures=0, assumptions=0
20-Nov-2018 10:00:56
20-Nov-2018 10:00:56 Run started.
20-Nov-2018 10:00:56 Failure : com.carrotsearch.randomizedtesting.TestHookMethodOrderWithExceptions$WithRegularRunner: null
20-Nov-2018 10:00:56 Run finished: run=0, ignored=0, failures=1, assumptions=0
20-Nov-2018 10:00:56
20-Nov-2018 10:00:56 Run started.
20-Nov-2018 10:00:56 Failure : com.carrotsearch.randomizedtesting.TestHookMethodOrderWithExceptions$WithRandomizedRunner: null
20-Nov-2018 10:00:56 Run finished: run=0, ignored=0, failures=1, assumptions=0
20-Nov-2018 10:00:56
20-Nov-2018 10:00:56 Run started.
20-Nov-2018 10:00:56 Started : testMethod
20-Nov-2018 10:00:56 Finished: testMethod
20-Nov-2018 10:00:56 Run finished: run=1, ignored=0, failures=0, assumptions=0
20-Nov-2018 10:00:56
20-Nov-2018 10:00:56 Run started.
20-Nov-2018 10:00:56 Started : testMethod
20-Nov-2018 10:00:56 Finished: testMethod
20-Nov-2018 10:00:56 Run finished: run=1, ignored=0, failures=0, assumptions=0
20-Nov-2018 10:00:56
20-Nov-2018 10:00:56 Run started.
20-Nov-2018 10:00:56 Started : testMethod
20-Nov-2018 10:00:56 Failure : testMethod(com.carrotsearch.randomizedtesting.TestHookMethodOrderWithExceptions$WithRegularRunner): null
20-Nov-2018 10:00:56 Finished: testMethod
20-Nov-2018 10:00:56 Run finished: run=1, ignored=0, failures=1, assumptions=0
20-Nov-2018 10:00:56
20-Nov-2018 10:00:56 Run started.
20-Nov-2018 10:00:56 Started : testMethod
20-Nov-2018 10:00:56 Failure : testMethod(com.carrotsearch.randomizedtesting.TestHookMethodOrderWithExceptions$WithRandomizedRunner): null
20-Nov-2018 10:00:56 Finished: testMethod
20-Nov-2018 10:00:56 Run finished: run=1, ignored=0, failures=1, assumptions=0
20-Nov-2018 10:00:56
20-Nov-2018 10:00:56 Run started.
20-Nov-2018 10:00:56 Started : testMethod
20-Nov-2018 10:00:56 Finished: testMethod
20-Nov-2018 10:00:56 Failure : com.carrotsearch.randomizedtesting.TestHookMethodOrderWithExceptions$WithRegularRunner: null
20-Nov-2018 10:00:56 Run finished: run=1, ignored=0, failures=1, assumptions=0
20-Nov-2018 10:00:56
20-Nov-2018 10:00:56 Run started.
20-Nov-2018 10:00:56 Started : testMethod
20-Nov-2018 10:00:56 Finished: testMethod
20-Nov-2018 10:00:56 Failure : com.carrotsearch.randomizedtesting.TestHookMethodOrderWithExceptions$WithRandomizedRunner: null
20-Nov-2018 10:00:56 Run finished: run=1, ignored=0, failures=1, assumptions=0
20-Nov-2018 10:00:56
20-Nov-2018 10:00:56 Run started.
20-Nov-2018 10:00:56 Failure : com.carrotsearch.randomizedtesting.TestHookMethodOrderWithExceptions$WithRegularRunner: null
20-Nov-2018 10:00:56 Run finished: run=0, ignored=0, failures=1, assumptions=0
20-Nov-2018 10:00:56
20-Nov-2018 10:00:56 Run started.
20-Nov-2018 10:00:56 Failure : com.carrotsearch.randomizedtesting.TestHookMethodOrderWithExceptions$WithRandomizedRunner: null
20-Nov-2018 10:00:56 Run finished: run=0, ignored=0, failures=1, assumptions=0
20-Nov-2018 10:00:56
20-Nov-2018 10:00:56 Run started.
20-Nov-2018 10:00:56 Started : testMethod
20-Nov-2018 10:00:56 Failure : testMethod(com.carrotsearch.randomizedtesting.TestHookMethodOrderWithExceptions$WithRegularRunner): null
20-Nov-2018 10:00:56 Finished: testMethod
20-Nov-2018 10:00:56 Run finished: run=1, ignored=0, failures=1, assumptions=0
20-Nov-2018 10:00:56
20-Nov-2018 10:00:56 Run started.
20-Nov-2018 10:00:56 Started : testMethod
20-Nov-2018 10:00:56 Failure : testMethod(com.carrotsearch.randomizedtesting.TestHookMethodOrderWithExceptions$WithRandomizedRunner): null
20-Nov-2018 10:00:56 Finished: testMethod
20-Nov-2018 10:00:56 Run finished: run=1, ignored=0, failures=1, assumptions=0
20-Nov-2018 10:00:56
20-Nov-2018 10:00:56 Run started.
20-Nov-2018 10:00:56 Started : testMethod
20-Nov-2018 10:00:56 Finished: testMethod
20-Nov-2018 10:00:56 Run finished: run=1, ignored=0, failures=0, assumptions=0
20-Nov-2018 10:00:56
20-Nov-2018 10:00:56 Run started.
20-Nov-2018 10:00:56 Started : testMethod
20-Nov-2018 10:00:56 Finished: testMethod
20-Nov-2018 10:00:56 Run finished: run=1, ignored=0, failures=0, assumptions=0
20-Nov-2018 10:00:56
20-Nov-2018 10:00:56 Run started.
20-Nov-2018 10:00:56 Started : testMethod
20-Nov-2018 10:00:56 Finished: testMethod
20-Nov-2018 10:00:56 Run finished: run=1, ignored=0, failures=0, assumptions=0
20-Nov-2018 10:00:56
20-Nov-2018 10:00:56 Run started.
20-Nov-2018 10:00:56 Started : testMethod
20-Nov-2018 10:00:56 Finished: testMethod
20-Nov-2018 10:00:56 Run finished: run=1, ignored=0, failures=0, assumptions=0
20-Nov-2018 10:00:56
20-Nov-2018 10:00:56 Run started.
20-Nov-2018 10:00:56 Started : testMethod
20-Nov-2018 10:00:56 Finished: testMethod
20-Nov-2018 10:00:56 Run finished: run=1, ignored=0, failures=0, assumptions=0
20-Nov-2018 10:00:56
20-Nov-2018 10:00:56 Run started.
20-Nov-2018 10:00:56 Started : testMethod
20-Nov-2018 10:00:56 Finished: testMethod
20-Nov-2018 10:00:56 Run finished: run=1, ignored=0, failures=0, assumptions=0
20-Nov-2018 10:00:56
20-Nov-2018 10:00:56 Run started.
20-Nov-2018 10:00:56 Started : testMethod
20-Nov-2018 10:00:56 Finished: testMethod
20-Nov-2018 10:00:56 Run finished: run=1, ignored=0, failures=0, assumptions=0
20-Nov-2018 10:00:56
20-Nov-2018 10:00:56 Run started.
20-Nov-2018 10:00:56 Started : testMethod
20-Nov-2018 10:00:56 Finished: testMethod
20-Nov-2018 10:00:56 Run finished: run=1, ignored=0, failures=0, assumptions=0
20-Nov-2018 10:00:56
20-Nov-2018 10:00:56 Run started.
20-Nov-2018 10:00:56 Started : testMethod
20-Nov-2018 10:00:56 Finished: testMethod
20-Nov-2018 10:00:56 Run finished: run=1, ignored=0, failures=0, assumptions=0
20-Nov-2018 10:00:56
20-Nov-2018 10:00:56 Run started.
20-Nov-2018 10:00:56 Started : testMethod
20-Nov-2018 10:00:56 Finished: testMethod
20-Nov-2018 10:00:56 Run finished: run=1, ignored=0, failures=0, assumptions=0
20-Nov-2018 10:00:56
20-Nov-2018 10:00:56 Tests run: 20, Failures: 0, Errors: 0, Skipped: 0, Time elapsed: 0.058 sec - in com.carrotsearch.randomizedtesting.TestHookMethodOrderWithExceptions
20-Nov-2018 10:00:56 Running com.carrotsearch.randomizedtesting.TestChildTestGroupThreads
20-Nov-2018 10:00:56 Tests run: 1, Failures: 0, Errors: 0, Skipped: 0, Time elapsed: 0.001 sec - in com.carrotsearch.randomizedtesting.TestChildTestGroupThreads
20-Nov-2018 10:00:56 Running com.carrotsearch.randomizedtesting.TestBiasedNumbers
20-Nov-2018 10:00:56       6081        548        550        528        505       8205        574        555        528        530       5982
20-Nov-2018 10:00:56        528         46         54         44         50        770         54         42         44         47        580
20-Nov-2018 10:00:56        519         50         48         44         55        734         41         50         42         43        527
20-Nov-2018 10:00:56        545         41         32         39         58        789         37         48         53         44        551
20-Nov-2018 10:00:56        552         44         36         42         50        742         58         46         49         57        540
20-Nov-2018 10:00:56       8159        735        716        760        736      11277        745        650        741        764       8256
20-Nov-2018 10:00:56        591         45         51         53         51        764         57         48         47         49        575
20-Nov-2018 10:00:56        528         42         56         46         51        723         43         50         68         52        548
20-Nov-2018 10:00:56        506         49         48         56         44        725         53         53         42         44        537
20-Nov-2018 10:00:56        509         39         42         50         49        712         48         42         43         41        503
20-Nov-2018 10:00:56       5962        509        504        529        559       8207        514        511        535        509       5898
20-Nov-2018 10:00:56 Tests run: 201, Failures: 0, Errors: 0, Skipped: 0, Time elapsed: 0.162 sec - in com.carrotsearch.randomizedtesting.TestBiasedNumbers
20-Nov-2018 10:00:56 Running com.carrotsearch.randomizedtesting.TestMacSysThreads
20-Nov-2018 10:00:56 Run started.
20-Nov-2018 10:00:56 Started : testMethod1
20-Nov-2018 10:00:59 Finished: testMethod1
20-Nov-2018 10:00:59 Run finished: run=1, ignored=0, failures=0, assumptions=0
20-Nov-2018 10:00:59
20-Nov-2018 10:00:59 Tests run: 1, Failures: 0, Errors: 0, Skipped: 0, Time elapsed: 2.526 sec - in com.carrotsearch.randomizedtesting.TestMacSysThreads
20-Nov-2018 10:00:59 Running com.carrotsearch.randomizedtesting.TestRules
20-Nov-2018 10:00:59 Run started.
20-Nov-2018 10:00:59 Started : passing
20-Nov-2018 10:00:59 Finished: passing
20-Nov-2018 10:00:59 Run finished: run=1, ignored=0, failures=0, assumptions=0
20-Nov-2018 10:00:59
20-Nov-2018 10:00:59 Run started.
20-Nov-2018 10:00:59 Started : passing
20-Nov-2018 10:00:59 Finished: passing
20-Nov-2018 10:00:59 Run finished: run=1, ignored=0, failures=0, assumptions=0
20-Nov-2018 10:00:59
20-Nov-2018 10:00:59 Run started.
20-Nov-2018 10:00:59 Started : failing
20-Nov-2018 10:00:59 Failure : failing(com.carrotsearch.randomizedtesting.TestRules$NewRuleSupportFailing): null
20-Nov-2018 10:00:59 Finished: failing
20-Nov-2018 10:00:59 Run finished: run=1, ignored=0, failures=1, assumptions=0
20-Nov-2018 10:00:59
20-Nov-2018 10:00:59 Run started.
20-Nov-2018 10:00:59 Ignored : ignored
20-Nov-2018 10:00:59 Run finished: run=0, ignored=1, failures=0, assumptions=0
20-Nov-2018 10:00:59
20-Nov-2018 10:00:59 Tests run: 2, Failures: 0, Errors: 0, Skipped: 0, Time elapsed: 0.008 sec - in com.carrotsearch.randomizedtesting.TestRules
20-Nov-2018 10:00:59 Running com.carrotsearch.randomizedtesting.TestJUnit3MethodProvider
20-Nov-2018 10:00:59 Tests run: 3, Failures: 0, Errors: 0, Skipped: 0, Time elapsed: 0.007 sec - in com.carrotsearch.randomizedtesting.TestJUnit3MethodProvider
20-Nov-2018 10:00:59
20-Nov-2018 10:00:59 Results :
20-Nov-2018 10:00:59
20-Nov-2018 10:00:59 Tests run: 2257, Failures: 0, Errors: 0, Skipped: 6
20-Nov-2018 10:00:59
20-Nov-2018 10:00:59 [INFO]
20-Nov-2018 10:00:59 [INFO] --- maven-jar-plugin:3.0.2:jar (default-jar) @ randomizedtesting-runner ---
20-Nov-2018 10:00:59 [INFO] Building jar: /var/atlassian/application-data/bamboo/xml-data/build-dir/RNDTEST-SOFTWARE-JDK18/randomized-runner/target/randomizedtesting-runner-2.7.1.jar
20-Nov-2018 10:01:00 [INFO]
20-Nov-2018 10:01:00 [INFO] --- maven-site-plugin:3.5.1:attach-descriptor (attach-descriptor) @ randomizedtesting-runner ---
20-Nov-2018 10:01:00 [INFO]
20-Nov-2018 10:01:00 [INFO] --- forbiddenapis:2.5:check (check-forbidden-apis) @ randomizedtesting-runner ---
20-Nov-2018 10:01:00 [INFO] Scanning for classes to check...
20-Nov-2018 10:01:00 [INFO] Reading bundled API signatures: jdk-unsafe-1.8
20-Nov-2018 10:01:00 [INFO] Reading bundled API signatures: jdk-deprecated-1.8
20-Nov-2018 10:01:00 [INFO] Reading bundled API signatures: jdk-system-out
20-Nov-2018 10:01:00 [INFO] Reading bundled API signatures: jdk-non-portable
20-Nov-2018 10:01:00 [INFO] Loading classes to check...
20-Nov-2018 10:01:00 [INFO] Scanning classes for violations...
20-Nov-2018 10:01:00 [INFO] Scanned 190 class file(s) for forbidden API invocations (in 0.20s), 0 error(s).
20-Nov-2018 10:01:00 [INFO]
20-Nov-2018 10:01:00 [INFO] -----------< com.carrotsearch.randomizedtesting:junit4-ant >------------
20-Nov-2018 10:01:00 [INFO] Building RandomizedTesting JUnit4 ANT Task 2.7.1                   [3/8]
20-Nov-2018 10:01:00 [INFO] --------------------------------[ jar ]---------------------------------
20-Nov-2018 10:01:00 [INFO]
20-Nov-2018 10:01:00 [INFO] --- maven-clean-plugin:3.0.0:clean (default-clean) @ junit4-ant ---
20-Nov-2018 10:01:00 [INFO] Deleting /var/atlassian/application-data/bamboo/xml-data/build-dir/RNDTEST-SOFTWARE-JDK18/junit4-ant/target (includes = [], excludes = [eclipse/**, idea/**])
20-Nov-2018 10:01:00 [INFO]
20-Nov-2018 10:01:00 [INFO] --- maven-resources-plugin:3.0.1:resources (default-resources) @ junit4-ant ---
20-Nov-2018 10:01:00 [INFO] Using 'UTF-8' encoding to copy filtered resources.
20-Nov-2018 10:01:00 [INFO] Copying 15 resources
20-Nov-2018 10:01:00 [INFO]
20-Nov-2018 10:01:00 [INFO] --- maven-compiler-plugin:3.5.1:compile (default-compile) @ junit4-ant ---
20-Nov-2018 10:01:00 [INFO] Changes detected - recompiling the module!
20-Nov-2018 10:01:00 [INFO] Compiling 99 source files to /var/atlassian/application-data/bamboo/xml-data/build-dir/RNDTEST-SOFTWARE-JDK18/junit4-ant/target/classes
20-Nov-2018 10:01:00 [INFO] -------------------------------------------------------------
20-Nov-2018 10:01:00 [ERROR] COMPILATION ERROR :
20-Nov-2018 10:01:00 [INFO] -------------------------------------------------------------
20-Nov-2018 10:01:00 [ERROR] /var/atlassian/application-data/bamboo/xml-data/build-dir/RNDTEST-SOFTWARE-JDK18/junit4-ant/src/main/java/com/carrotsearch/ant/tasks/junit4/listeners/json/JsonReport.java:[267,9] ';' expected
20-Nov-2018 10:01:00 [INFO] 1 error
20-Nov-2018 10:01:00 [INFO] -------------------------------------------------------------
20-Nov-2018 10:01:00 [INFO] ------------------------------------------------------------------------
20-Nov-2018 10:01:00 [INFO] Reactor Summary:
20-Nov-2018 10:01:00 [INFO]
20-Nov-2018 10:01:00 [INFO] RandomizedTesting Parent POM 2.7.1 ................. SUCCESS [  0.712 s]
20-Nov-2018 10:01:00 [INFO] RandomizedTesting Randomized Runner ................ SUCCESS [ 28.119 s]
20-Nov-2018 10:01:00 [INFO] RandomizedTesting JUnit4 ANT Task .................. FAILURE [  0.326 s]
20-Nov-2018 10:01:00 [INFO] RandomizedTesting JUnit4 Maven Plugin .............. SKIPPED
20-Nov-2018 10:01:00 [INFO] RandomizedTesting JUnit4 Maven Plugin Tests ........ SKIPPED
20-Nov-2018 10:01:00 [INFO] RandomizedTesting Examples ......................... SKIPPED
20-Nov-2018 10:01:00 [INFO] RandomizedTesting ANT Examples ..................... SKIPPED
20-Nov-2018 10:01:00 [INFO] RandomizedTesting Security Manager Example 2.7.1 ... SKIPPED
20-Nov-2018 10:01:00 [INFO] ------------------------------------------------------------------------
20-Nov-2018 10:01:00 [INFO] BUILD FAILURE
20-Nov-2018 10:01:00 [INFO] ------------------------------------------------------------------------
20-Nov-2018 10:01:00 [INFO] Total time: 29.275 s
20-Nov-2018 10:01:00 [INFO] Finished at: 2018-11-20T10:01:00+01:00
20-Nov-2018 10:01:00 [INFO] ------------------------------------------------------------------------
20-Nov-2018 10:01:00 [ERROR] Failed to execute goal org.apache.maven.plugins:maven-compiler-plugin:3.5.1:compile (default-compile) on project junit4-ant: Compilation failure
20-Nov-2018 10:01:00 [ERROR] /var/atlassian/application-data/bamboo/xml-data/build-dir/RNDTEST-SOFTWARE-JDK18/junit4-ant/src/main/java/com/carrotsearch/ant/tasks/junit4/listeners/json/JsonReport.java:[267,9] ';' expected
20-Nov-2018 10:01:00 [ERROR] -> [Help 1]
20-Nov-2018 10:01:00 [ERROR]
20-Nov-2018 10:01:00 [ERROR] To see the full stack trace of the errors, re-run Maven with the -e switch.
20-Nov-2018 10:01:00 [ERROR] Re-run Maven using the -X switch to enable full debug logging.
20-Nov-2018 10:01:00 [ERROR]
20-Nov-2018 10:01:00 [ERROR] For more information about the errors and possible solutions, please read the following articles:
20-Nov-2018 10:01:00 [ERROR] [Help 1] http://cwiki.apache.org/confluence/display/MAVEN/MojoFailureException
20-Nov-2018 10:01:00 [ERROR]
20-Nov-2018 10:01:00 [ERROR] After correcting the problems, you can resume the build with the command
20-Nov-2018 10:01:00 [ERROR]   mvn <goals> -rf :junit4-ant
20-Nov-2018 10:01:00 Failing task since return code of [/home/bamboo/jvms/maven/bin/mvn --batch-mode -Djava.io.tmpdir=/opt/atlassian/bamboo/current/temp/RNDTEST-SOFTWARE-JDK18 -Dmaven.repo.local=/var/atlassian/application-data/bamboo/.m2/AGENT-131073/repository clean verify] was 1 while expected 0
20-Nov-2018 10:01:00 Parsing test results under /var/atlassian/application-data/bamboo/xml-data/build-dir/RNDTEST-SOFTWARE-JDK18...
20-Nov-2018 10:01:00 Finished task 'Maven 3.x' with result: Failed
20-Nov-2018 10:01:00 Running post build plugin 'NCover Results Collector'
20-Nov-2018 10:01:00 Running post build plugin 'Artifact Copier'
20-Nov-2018 10:01:00 Running post build plugin 'npm Cache Cleanup'
20-Nov-2018 10:01:00 Running post build plugin 'Clover Results Collector'
20-Nov-2018 10:01:00 Running post build plugin 'Docker Container Cleanup'
20-Nov-2018 10:01:00 Finalising the build...
20-Nov-2018 10:01:00 Stopping timer.
20-Nov-2018 10:01:00 Build RNDTEST-SOFTWARE-JDK18-225 completed.
20-Nov-2018 10:01:00 Running on server: post build plugin 'NCover Results Collector'
20-Nov-2018 10:01:00 Running on server: post build plugin 'Build Hanging Detection Configuration'
20-Nov-2018 10:01:00 Running on server: post build plugin 'Clover Delta Calculator'
20-Nov-2018 10:01:00 Running on server: post build plugin 'Maven Dependencies Postprocessor'
20-Nov-2018 10:01:00 All post build plugins have finished
20-Nov-2018 10:01:00 Generating build results summary...
20-Nov-2018 10:01:06 Saving build results to disk...
20-Nov-2018 10:01:06 Logging substituted variables...
20-Nov-2018 10:01:06 Indexing build results...
20-Nov-2018 10:01:06 Finished building RNDTEST-SOFTWARE-JDK18-225.