Build #187

Build: #187 failed

Job: JDK 1.8 was successful

Stages & jobs

  1. Compile and test

  2. Package

Build log

The build generated 11,366 lines of output.The output is too long and has been truncated to the last 1,000 lines. Download or view full build log

08-May-2018 12:09:15 policy: evaluation (codesource) failed
08-May-2018 12:09:15 policy: evaluate codesources:
08-May-2018 12:09:15         Policy CodeSource: (file:/var/atlassian/application-data/bamboo/xml-data/build-dir/RNDTEST-SOFTWARE-JDK18/junit4-ant/target/junit4-ant-2.5.4-SNAPSHOT.jar <no signer certificates>)
08-May-2018 12:09:15         Active CodeSource: (file:/var/atlassian/application-data/bamboo/xml-data/build-dir/RNDTEST-SOFTWARE-JDK18/junit4-ant/target/junit4-ant-2.5.4-SNAPSHOT.jar <no signer certificates>)
08-May-2018 12:09:15 policy: evaluate principals:
08-May-2018 12:09:15         Policy Principals: []
08-May-2018 12:09:15         Active Principals: []
08-May-2018 12:09:15 policy:   granting ("java.lang.RuntimePermission" "setIO")
08-May-2018 12:09:15 policy: evaluation (codesource/principals) passed
08-May-2018 12:09:15 policy: evaluate codesources:
08-May-2018 12:09:15         Policy CodeSource: (file:/var/atlassian/application-data/bamboo/xml-data/build-dir/RNDTEST-SOFTWARE-JDK18/randomized-runner/target/randomizedtesting-runner-2.5.4-SNAPSHOT.jar <no signer certificates>)
08-May-2018 12:09:15         Active CodeSource: (file:/var/atlassian/application-data/bamboo/xml-data/build-dir/RNDTEST-SOFTWARE-JDK18/junit4-ant/target/junit4-ant-2.5.4-SNAPSHOT.jar <no signer certificates>)
08-May-2018 12:09:15 policy: evaluation (codesource) failed
08-May-2018 12:09:15 policy: evaluate codesources:
08-May-2018 12:09:15         Policy CodeSource: (file:/var/atlassian/application-data/bamboo/.m2/AGENT-61702145/repository/junit/junit/4.10/junit-4.10.jar <no signer certificates>)
08-May-2018 12:09:15         Active CodeSource: (file:/var/atlassian/application-data/bamboo/xml-data/build-dir/RNDTEST-SOFTWARE-JDK18/junit4-ant/target/junit4-ant-2.5.4-SNAPSHOT.jar <no signer certificates>)
08-May-2018 12:09:15 policy: evaluation (codesource) failed
08-May-2018 12:09:15 policy: evaluate codesources:
08-May-2018 12:09:15         Policy CodeSource: (null <no signer certificates>)
08-May-2018 12:09:15         Active CodeSource: (file:/var/atlassian/application-data/bamboo/xml-data/build-dir/RNDTEST-SOFTWARE-JDK18/junit4-ant/target/junit4-ant-2.5.4-SNAPSHOT.jar <no signer certificates>)
08-May-2018 12:09:15 policy: evaluate principals:
08-May-2018 12:09:15         Policy Principals: []
08-May-2018 12:09:15         Active Principals: []
08-May-2018 12:09:15 policy:   granting ("java.util.PropertyPermission" "*" "read")
08-May-2018 12:09:15 policy:   granting ("java.io.FilePermission" "<<ALL FILES>>" "read,write,execute,delete")
08-May-2018 12:09:15 policy: evaluation (codesource/principals) passed
08-May-2018 12:09:15 access: domain 0 ProtectionDomain  (file:/var/atlassian/application-data/bamboo/xml-data/build-dir/RNDTEST-SOFTWARE-JDK18/junit4-ant/target/junit4-ant-2.5.4-SNAPSHOT.jar <no signer certificates>)
08-May-2018 12:09:15 sun.misc.Launcher$AppClassLoader@42a57993
08-May-2018 12:09:15 <no principals>
08-May-2018 12:09:15 java.security.Permissions@2f4d3709 (
08-May-2018 12:09:15 ("java.lang.RuntimePermission" "exitVM")
08-May-2018 12:09:15 ("java.lang.RuntimePermission" "setIO")
08-May-2018 12:09:15 ("java.io.FilePermission" "<<ALL FILES>>" "read,write,execute,delete")
08-May-2018 12:09:15 ("java.io.FilePermission" "/var/atlassian/application-data/bamboo/xml-data/build-dir/RNDTEST-SOFTWARE-JDK18/junit4-ant/target/junit4-ant-2.5.4-SNAPSHOT.jar" "read")
08-May-2018 12:09:15 ("java.util.PropertyPermission" "*" "read")
08-May-2018 12:09:15 )
08-May-2018 12:09:15
08-May-2018 12:09:15
08-May-2018 12:09:15 access: access allowed ("java.util.PropertyPermission" "java.class.path" "read")
08-May-2018 12:09:15 java.lang.Exception: Stack trace
08-May-2018 12:09:15         at java.lang.Thread.dumpStack(Thread.java:1336)
08-May-2018 12:09:15         at java.security.AccessControlContext.checkPermission(AccessControlContext.java:419)
08-May-2018 12:09:15         at java.security.AccessController.checkPermission(AccessController.java:884)
08-May-2018 12:09:15         at java.lang.SecurityManager.checkPermission(SecurityManager.java:549)
08-May-2018 12:09:15         at java.lang.SecurityManager.checkPropertyAccess(SecurityManager.java:1294)
08-May-2018 12:09:15         at java.lang.System.getProperty(System.java:717)
08-May-2018 12:09:15         at com.carrotsearch.ant.tasks.junit4.events.BootstrapEvent.collectSystemProperties(BootstrapEvent.java:93)
08-May-2018 12:09:15         at com.carrotsearch.ant.tasks.junit4.events.BootstrapEvent.<init>(BootstrapEvent.java:68)
08-May-2018 12:09:15         at com.carrotsearch.ant.tasks.junit4.slave.SlaveMain.main(SlaveMain.java:350)
08-May-2018 12:09:15         at com.carrotsearch.ant.tasks.junit4.slave.SlaveMainSafe.main(SlaveMainSafe.java:13)
08-May-2018 12:09:15 policy: getPermissions:
08-May-2018 12:09:15         PD CodeSource: (file:/var/atlassian/application-data/bamboo/xml-data/build-dir/RNDTEST-SOFTWARE-JDK18/junit4-ant/target/junit4-ant-2.5.4-SNAPSHOT.jar <no signer certificates>)
08-May-2018 12:09:15         PD ClassLoader: sun.misc.Launcher$AppClassLoader@42a57993
08-May-2018 12:09:15         PD Principals: <no principals>
08-May-2018 12:09:15 policy: evaluate codesources:
08-May-2018 12:09:15         Policy CodeSource: (file:/home/bamboo/jvms/oracle-jdk-1.8.0_162/jre/lib/ext/* <no signer certificates>)
08-May-2018 12:09:15         Active CodeSource: (file:/var/atlassian/application-data/bamboo/xml-data/build-dir/RNDTEST-SOFTWARE-JDK18/junit4-ant/target/junit4-ant-2.5.4-SNAPSHOT.jar <no signer certificates>)
08-May-2018 12:09:15 policy: evaluation (codesource) failed
08-May-2018 12:09:15 policy: evaluate codesources:
08-May-2018 12:09:15         Policy CodeSource: (file:/usr/java/packages/lib/ext/* <no signer certificates>)
08-May-2018 12:09:15         Active CodeSource: (file:/var/atlassian/application-data/bamboo/xml-data/build-dir/RNDTEST-SOFTWARE-JDK18/junit4-ant/target/junit4-ant-2.5.4-SNAPSHOT.jar <no signer certificates>)
08-May-2018 12:09:15 policy: evaluation (codesource) failed
08-May-2018 12:09:15 policy: evaluate codesources:
08-May-2018 12:09:15         Policy CodeSource: (file:/var/atlassian/application-data/bamboo/xml-data/build-dir/RNDTEST-SOFTWARE-JDK18/junit4-ant/target/junit4-ant-2.5.4-SNAPSHOT.jar <no signer certificates>)
08-May-2018 12:09:15         Active CodeSource: (file:/var/atlassian/application-data/bamboo/xml-data/build-dir/RNDTEST-SOFTWARE-JDK18/junit4-ant/target/junit4-ant-2.5.4-SNAPSHOT.jar <no signer certificates>)
08-May-2018 12:09:15 policy: evaluate principals:
08-May-2018 12:09:15         Policy Principals: []
08-May-2018 12:09:15         Active Principals: []
08-May-2018 12:09:15 policy:   granting ("java.lang.RuntimePermission" "setIO")
08-May-2018 12:09:15 policy: evaluation (codesource/principals) passed
08-May-2018 12:09:15 policy: evaluate codesources:
08-May-2018 12:09:15         Policy CodeSource: (file:/var/atlassian/application-data/bamboo/xml-data/build-dir/RNDTEST-SOFTWARE-JDK18/randomized-runner/target/randomizedtesting-runner-2.5.4-SNAPSHOT.jar <no signer certificates>)
08-May-2018 12:09:15         Active CodeSource: (file:/var/atlassian/application-data/bamboo/xml-data/build-dir/RNDTEST-SOFTWARE-JDK18/junit4-ant/target/junit4-ant-2.5.4-SNAPSHOT.jar <no signer certificates>)
08-May-2018 12:09:15 policy: evaluation (codesource) failed
08-May-2018 12:09:15 policy: evaluate codesources:
08-May-2018 12:09:15         Policy CodeSource: (file:/var/atlassian/application-data/bamboo/.m2/AGENT-61702145/repository/junit/junit/4.10/junit-4.10.jar <no signer certificates>)
08-May-2018 12:09:15         Active CodeSource: (file:/var/atlassian/application-data/bamboo/xml-data/build-dir/RNDTEST-SOFTWARE-JDK18/junit4-ant/target/junit4-ant-2.5.4-SNAPSHOT.jar <no signer certificates>)
08-May-2018 12:09:15 policy: evaluation (codesource) failed
08-May-2018 12:09:15 policy: evaluate codesources:
08-May-2018 12:09:15         Policy CodeSource: (null <no signer certificates>)
08-May-2018 12:09:15         Active CodeSource: (file:/var/atlassian/application-data/bamboo/xml-data/build-dir/RNDTEST-SOFTWARE-JDK18/junit4-ant/target/junit4-ant-2.5.4-SNAPSHOT.jar <no signer certificates>)
08-May-2018 12:09:15 policy: evaluate principals:
08-May-2018 12:09:15         Policy Principals: []
08-May-2018 12:09:15         Active Principals: []
08-May-2018 12:09:15 policy:   granting ("java.util.PropertyPermission" "*" "read")
08-May-2018 12:09:15 policy:   granting ("java.io.FilePermission" "<<ALL FILES>>" "read,write,execute,delete")
08-May-2018 12:09:15 policy: evaluation (codesource/principals) passed
08-May-2018 12:09:15 access: domain 0 ProtectionDomain  (file:/var/atlassian/application-data/bamboo/xml-data/build-dir/RNDTEST-SOFTWARE-JDK18/junit4-ant/target/junit4-ant-2.5.4-SNAPSHOT.jar <no signer certificates>)
08-May-2018 12:09:15 sun.misc.Launcher$AppClassLoader@42a57993
08-May-2018 12:09:15 <no principals>
08-May-2018 12:09:15 java.security.Permissions@1d81eb93 (
08-May-2018 12:09:15 ("java.lang.RuntimePermission" "exitVM")
08-May-2018 12:09:15 ("java.lang.RuntimePermission" "setIO")
08-May-2018 12:09:15 ("java.io.FilePermission" "<<ALL FILES>>" "read,write,execute,delete")
08-May-2018 12:09:15 ("java.io.FilePermission" "/var/atlassian/application-data/bamboo/xml-data/build-dir/RNDTEST-SOFTWARE-JDK18/junit4-ant/target/junit4-ant-2.5.4-SNAPSHOT.jar" "read")
08-May-2018 12:09:15 ("java.util.PropertyPermission" "*" "read")
08-May-2018 12:09:15 )
08-May-2018 12:09:15
08-May-2018 12:09:15
08-May-2018 12:09:15 access: access allowed ("java.util.PropertyPermission" "java.library.path" "read")
08-May-2018 12:09:15 java.lang.Exception: Stack trace
08-May-2018 12:09:15         at java.lang.Thread.dumpStack(Thread.java:1336)
08-May-2018 12:09:15         at java.security.AccessControlContext.checkPermission(AccessControlContext.java:419)
08-May-2018 12:09:15         at java.security.AccessController.checkPermission(AccessController.java:884)
08-May-2018 12:09:15         at java.lang.SecurityManager.checkPermission(SecurityManager.java:549)
08-May-2018 12:09:15         at java.lang.SecurityManager.checkPropertyAccess(SecurityManager.java:1294)
08-May-2018 12:09:15         at java.lang.System.getProperty(System.java:717)
08-May-2018 12:09:15         at com.carrotsearch.ant.tasks.junit4.events.BootstrapEvent.collectSystemProperties(BootstrapEvent.java:93)
08-May-2018 12:09:15         at com.carrotsearch.ant.tasks.junit4.events.BootstrapEvent.<init>(BootstrapEvent.java:68)
08-May-2018 12:09:15         at com.carrotsearch.ant.tasks.junit4.slave.SlaveMain.main(SlaveMain.java:350)
08-May-2018 12:09:15         at com.carrotsearch.ant.tasks.junit4.slave.SlaveMainSafe.main(SlaveMainSafe.java:13)
08-May-2018 12:09:15 policy: getPermissions:
08-May-2018 12:09:15         PD CodeSource: (file:/var/atlassian/application-data/bamboo/xml-data/build-dir/RNDTEST-SOFTWARE-JDK18/junit4-ant/target/junit4-ant-2.5.4-SNAPSHOT.jar <no signer certificates>)
08-May-2018 12:09:15         PD ClassLoader: sun.misc.Launcher$AppClassLoader@42a57993
08-May-2018 12:09:15         PD Principals: <no principals>
08-May-2018 12:09:15 policy: evaluate codesources:
08-May-2018 12:09:15         Policy CodeSource: (file:/home/bamboo/jvms/oracle-jdk-1.8.0_162/jre/lib/ext/* <no signer certificates>)
08-May-2018 12:09:15         Active CodeSource: (file:/var/atlassian/application-data/bamboo/xml-data/build-dir/RNDTEST-SOFTWARE-JDK18/junit4-ant/target/junit4-ant-2.5.4-SNAPSHOT.jar <no signer certificates>)
08-May-2018 12:09:15 policy: evaluation (codesource) failed
08-May-2018 12:09:15 policy: evaluate codesources:
08-May-2018 12:09:15         Policy CodeSource: (file:/usr/java/packages/lib/ext/* <no signer certificates>)
08-May-2018 12:09:15         Active CodeSource: (file:/var/atlassian/application-data/bamboo/xml-data/build-dir/RNDTEST-SOFTWARE-JDK18/junit4-ant/target/junit4-ant-2.5.4-SNAPSHOT.jar <no signer certificates>)
08-May-2018 12:09:15 policy: evaluation (codesource) failed
08-May-2018 12:09:15 policy: evaluate codesources:
08-May-2018 12:09:15         Policy CodeSource: (file:/var/atlassian/application-data/bamboo/xml-data/build-dir/RNDTEST-SOFTWARE-JDK18/junit4-ant/target/junit4-ant-2.5.4-SNAPSHOT.jar <no signer certificates>)
08-May-2018 12:09:15         Active CodeSource: (file:/var/atlassian/application-data/bamboo/xml-data/build-dir/RNDTEST-SOFTWARE-JDK18/junit4-ant/target/junit4-ant-2.5.4-SNAPSHOT.jar <no signer certificates>)
08-May-2018 12:09:15 policy: evaluate principals:
08-May-2018 12:09:15         Policy Principals: []
08-May-2018 12:09:15         Active Principals: []
08-May-2018 12:09:15 policy:   granting ("java.lang.RuntimePermission" "setIO")
08-May-2018 12:09:15 policy: evaluation (codesource/principals) passed
08-May-2018 12:09:15 policy: evaluate codesources:
08-May-2018 12:09:15         Policy CodeSource: (file:/var/atlassian/application-data/bamboo/xml-data/build-dir/RNDTEST-SOFTWARE-JDK18/randomized-runner/target/randomizedtesting-runner-2.5.4-SNAPSHOT.jar <no signer certificates>)
08-May-2018 12:09:15         Active CodeSource: (file:/var/atlassian/application-data/bamboo/xml-data/build-dir/RNDTEST-SOFTWARE-JDK18/junit4-ant/target/junit4-ant-2.5.4-SNAPSHOT.jar <no signer certificates>)
08-May-2018 12:09:15 policy: evaluation (codesource) failed
08-May-2018 12:09:15 policy: evaluate codesources:
08-May-2018 12:09:15         Policy CodeSource: (file:/var/atlassian/application-data/bamboo/.m2/AGENT-61702145/repository/junit/junit/4.10/junit-4.10.jar <no signer certificates>)
08-May-2018 12:09:15         Active CodeSource: (file:/var/atlassian/application-data/bamboo/xml-data/build-dir/RNDTEST-SOFTWARE-JDK18/junit4-ant/target/junit4-ant-2.5.4-SNAPSHOT.jar <no signer certificates>)
08-May-2018 12:09:15 policy: evaluation (codesource) failed
08-May-2018 12:09:15 policy: evaluate codesources:
08-May-2018 12:09:15         Policy CodeSource: (null <no signer certificates>)
08-May-2018 12:09:15         Active CodeSource: (file:/var/atlassian/application-data/bamboo/xml-data/build-dir/RNDTEST-SOFTWARE-JDK18/junit4-ant/target/junit4-ant-2.5.4-SNAPSHOT.jar <no signer certificates>)
08-May-2018 12:09:15 policy: evaluate principals:
08-May-2018 12:09:15         Policy Principals: []
08-May-2018 12:09:15         Active Principals: []
08-May-2018 12:09:15 policy:   granting ("java.util.PropertyPermission" "*" "read")
08-May-2018 12:09:15 policy:   granting ("java.io.FilePermission" "<<ALL FILES>>" "read,write,execute,delete")
08-May-2018 12:09:15 policy: evaluation (codesource/principals) passed
08-May-2018 12:09:15 access: domain 0 ProtectionDomain  (file:/var/atlassian/application-data/bamboo/xml-data/build-dir/RNDTEST-SOFTWARE-JDK18/junit4-ant/target/junit4-ant-2.5.4-SNAPSHOT.jar <no signer certificates>)
08-May-2018 12:09:15 sun.misc.Launcher$AppClassLoader@42a57993
08-May-2018 12:09:15 <no principals>
08-May-2018 12:09:15 java.security.Permissions@34a245ab (
08-May-2018 12:09:15 ("java.lang.RuntimePermission" "exitVM")
08-May-2018 12:09:15 ("java.lang.RuntimePermission" "setIO")
08-May-2018 12:09:15 ("java.io.FilePermission" "<<ALL FILES>>" "read,write,execute,delete")
08-May-2018 12:09:15 ("java.io.FilePermission" "/var/atlassian/application-data/bamboo/xml-data/build-dir/RNDTEST-SOFTWARE-JDK18/junit4-ant/target/junit4-ant-2.5.4-SNAPSHOT.jar" "read")
08-May-2018 12:09:15 ("java.util.PropertyPermission" "*" "read")
08-May-2018 12:09:15 )
08-May-2018 12:09:15
08-May-2018 12:09:15
08-May-2018 12:09:15 access: access allowed ("java.util.PropertyPermission" "java.io.tmpdir" "read")
08-May-2018 12:09:15 java.lang.Exception: Stack trace
08-May-2018 12:09:15         at java.lang.Thread.dumpStack(Thread.java:1336)
08-May-2018 12:09:15         at java.security.AccessControlContext.checkPermission(AccessControlContext.java:419)
08-May-2018 12:09:15         at java.security.AccessController.checkPermission(AccessController.java:884)
08-May-2018 12:09:15         at java.lang.SecurityManager.checkPermission(SecurityManager.java:549)
08-May-2018 12:09:15         at java.lang.SecurityManager.checkPropertyAccess(SecurityManager.java:1294)
08-May-2018 12:09:15         at java.lang.System.getProperty(System.java:717)
08-May-2018 12:09:15         at com.carrotsearch.ant.tasks.junit4.events.BootstrapEvent.collectSystemProperties(BootstrapEvent.java:93)
08-May-2018 12:09:15         at com.carrotsearch.ant.tasks.junit4.events.BootstrapEvent.<init>(BootstrapEvent.java:68)
08-May-2018 12:09:15         at com.carrotsearch.ant.tasks.junit4.slave.SlaveMain.main(SlaveMain.java:350)
08-May-2018 12:09:15         at com.carrotsearch.ant.tasks.junit4.slave.SlaveMainSafe.main(SlaveMainSafe.java:13)
08-May-2018 12:09:15 policy: getPermissions:
08-May-2018 12:09:15         PD CodeSource: (file:/var/atlassian/application-data/bamboo/xml-data/build-dir/RNDTEST-SOFTWARE-JDK18/junit4-ant/target/junit4-ant-2.5.4-SNAPSHOT.jar <no signer certificates>)
08-May-2018 12:09:15         PD ClassLoader: sun.misc.Launcher$AppClassLoader@42a57993
08-May-2018 12:09:15         PD Principals: <no principals>
08-May-2018 12:09:15 policy: evaluate codesources:
08-May-2018 12:09:15         Policy CodeSource: (file:/home/bamboo/jvms/oracle-jdk-1.8.0_162/jre/lib/ext/* <no signer certificates>)
08-May-2018 12:09:15         Active CodeSource: (file:/var/atlassian/application-data/bamboo/xml-data/build-dir/RNDTEST-SOFTWARE-JDK18/junit4-ant/target/junit4-ant-2.5.4-SNAPSHOT.jar <no signer certificates>)
08-May-2018 12:09:15 policy: evaluation (codesource) failed
08-May-2018 12:09:15 policy: evaluate codesources:
08-May-2018 12:09:15         Policy CodeSource: (file:/usr/java/packages/lib/ext/* <no signer certificates>)
08-May-2018 12:09:15         Active CodeSource: (file:/var/atlassian/application-data/bamboo/xml-data/build-dir/RNDTEST-SOFTWARE-JDK18/junit4-ant/target/junit4-ant-2.5.4-SNAPSHOT.jar <no signer certificates>)
08-May-2018 12:09:15 policy: evaluation (codesource) failed
08-May-2018 12:09:15 policy: evaluate codesources:
08-May-2018 12:09:15         Policy CodeSource: (file:/var/atlassian/application-data/bamboo/xml-data/build-dir/RNDTEST-SOFTWARE-JDK18/junit4-ant/target/junit4-ant-2.5.4-SNAPSHOT.jar <no signer certificates>)
08-May-2018 12:09:15         Active CodeSource: (file:/var/atlassian/application-data/bamboo/xml-data/build-dir/RNDTEST-SOFTWARE-JDK18/junit4-ant/target/junit4-ant-2.5.4-SNAPSHOT.jar <no signer certificates>)
08-May-2018 12:09:15 policy: evaluate principals:
08-May-2018 12:09:15         Policy Principals: []
08-May-2018 12:09:15         Active Principals: []
08-May-2018 12:09:15 policy:   granting ("java.lang.RuntimePermission" "setIO")
08-May-2018 12:09:15 policy: evaluation (codesource/principals) passed
08-May-2018 12:09:15 policy: evaluate codesources:
08-May-2018 12:09:15         Policy CodeSource: (file:/var/atlassian/application-data/bamboo/xml-data/build-dir/RNDTEST-SOFTWARE-JDK18/randomized-runner/target/randomizedtesting-runner-2.5.4-SNAPSHOT.jar <no signer certificates>)
08-May-2018 12:09:15         Active CodeSource: (file:/var/atlassian/application-data/bamboo/xml-data/build-dir/RNDTEST-SOFTWARE-JDK18/junit4-ant/target/junit4-ant-2.5.4-SNAPSHOT.jar <no signer certificates>)
08-May-2018 12:09:15 policy: evaluation (codesource) failed
08-May-2018 12:09:15 policy: evaluate codesources:
08-May-2018 12:09:15         Policy CodeSource: (file:/var/atlassian/application-data/bamboo/.m2/AGENT-61702145/repository/junit/junit/4.10/junit-4.10.jar <no signer certificates>)
08-May-2018 12:09:15         Active CodeSource: (file:/var/atlassian/application-data/bamboo/xml-data/build-dir/RNDTEST-SOFTWARE-JDK18/junit4-ant/target/junit4-ant-2.5.4-SNAPSHOT.jar <no signer certificates>)
08-May-2018 12:09:15 policy: evaluation (codesource) failed
08-May-2018 12:09:15 policy: evaluate codesources:
08-May-2018 12:09:15         Policy CodeSource: (null <no signer certificates>)
08-May-2018 12:09:15         Active CodeSource: (file:/var/atlassian/application-data/bamboo/xml-data/build-dir/RNDTEST-SOFTWARE-JDK18/junit4-ant/target/junit4-ant-2.5.4-SNAPSHOT.jar <no signer certificates>)
08-May-2018 12:09:15 policy: evaluate principals:
08-May-2018 12:09:15         Policy Principals: []
08-May-2018 12:09:15         Active Principals: []
08-May-2018 12:09:15 policy:   granting ("java.util.PropertyPermission" "*" "read")
08-May-2018 12:09:15 policy:   granting ("java.io.FilePermission" "<<ALL FILES>>" "read,write,execute,delete")
08-May-2018 12:09:15 policy: evaluation (codesource/principals) passed
08-May-2018 12:09:15 access: domain 0 ProtectionDomain  (file:/var/atlassian/application-data/bamboo/xml-data/build-dir/RNDTEST-SOFTWARE-JDK18/junit4-ant/target/junit4-ant-2.5.4-SNAPSHOT.jar <no signer certificates>)
08-May-2018 12:09:15 sun.misc.Launcher$AppClassLoader@42a57993
08-May-2018 12:09:15 <no principals>
08-May-2018 12:09:15 java.security.Permissions@6e8cf4c6 (
08-May-2018 12:09:15 ("java.lang.RuntimePermission" "exitVM")
08-May-2018 12:09:15 ("java.lang.RuntimePermission" "setIO")
08-May-2018 12:09:15 ("java.io.FilePermission" "<<ALL FILES>>" "read,write,execute,delete")
08-May-2018 12:09:15 ("java.io.FilePermission" "/var/atlassian/application-data/bamboo/xml-data/build-dir/RNDTEST-SOFTWARE-JDK18/junit4-ant/target/junit4-ant-2.5.4-SNAPSHOT.jar" "read")
08-May-2018 12:09:15 ("java.util.PropertyPermission" "*" "read")
08-May-2018 12:09:15 )
08-May-2018 12:09:15
08-May-2018 12:09:15
08-May-2018 12:09:15 access: access allowed ("java.util.PropertyPermission" "java.compiler" "read")
08-May-2018 12:09:15 java.lang.Exception: Stack trace
08-May-2018 12:09:15         at java.lang.Thread.dumpStack(Thread.java:1336)
08-May-2018 12:09:15         at java.security.AccessControlContext.checkPermission(AccessControlContext.java:419)
08-May-2018 12:09:15         at java.security.AccessController.checkPermission(AccessController.java:884)
08-May-2018 12:09:15         at java.lang.SecurityManager.checkPermission(SecurityManager.java:549)
08-May-2018 12:09:15         at java.lang.SecurityManager.checkPropertyAccess(SecurityManager.java:1294)
08-May-2018 12:09:15         at java.lang.System.getProperty(System.java:717)
08-May-2018 12:09:15         at com.carrotsearch.ant.tasks.junit4.events.BootstrapEvent.collectSystemProperties(BootstrapEvent.java:93)
08-May-2018 12:09:15         at com.carrotsearch.ant.tasks.junit4.events.BootstrapEvent.<init>(BootstrapEvent.java:68)
08-May-2018 12:09:15         at com.carrotsearch.ant.tasks.junit4.slave.SlaveMain.main(SlaveMain.java:350)
08-May-2018 12:09:15         at com.carrotsearch.ant.tasks.junit4.slave.SlaveMainSafe.main(SlaveMainSafe.java:13)
08-May-2018 12:09:15 policy: getPermissions:
08-May-2018 12:09:15         PD CodeSource: (file:/var/atlassian/application-data/bamboo/xml-data/build-dir/RNDTEST-SOFTWARE-JDK18/junit4-ant/target/junit4-ant-2.5.4-SNAPSHOT.jar <no signer certificates>)
08-May-2018 12:09:15         PD ClassLoader: sun.misc.Launcher$AppClassLoader@42a57993
08-May-2018 12:09:15         PD Principals: <no principals>
08-May-2018 12:09:15 policy: evaluate codesources:
08-May-2018 12:09:15         Policy CodeSource: (file:/home/bamboo/jvms/oracle-jdk-1.8.0_162/jre/lib/ext/* <no signer certificates>)
08-May-2018 12:09:15         Active CodeSource: (file:/var/atlassian/application-data/bamboo/xml-data/build-dir/RNDTEST-SOFTWARE-JDK18/junit4-ant/target/junit4-ant-2.5.4-SNAPSHOT.jar <no signer certificates>)
08-May-2018 12:09:15 policy: evaluation (codesource) failed
08-May-2018 12:09:15 policy: evaluate codesources:
08-May-2018 12:09:15         Policy CodeSource: (file:/usr/java/packages/lib/ext/* <no signer certificates>)
08-May-2018 12:09:15         Active CodeSource: (file:/var/atlassian/application-data/bamboo/xml-data/build-dir/RNDTEST-SOFTWARE-JDK18/junit4-ant/target/junit4-ant-2.5.4-SNAPSHOT.jar <no signer certificates>)
08-May-2018 12:09:15 policy: evaluation (codesource) failed
08-May-2018 12:09:15 policy: evaluate codesources:
08-May-2018 12:09:15         Policy CodeSource: (file:/var/atlassian/application-data/bamboo/xml-data/build-dir/RNDTEST-SOFTWARE-JDK18/junit4-ant/target/junit4-ant-2.5.4-SNAPSHOT.jar <no signer certificates>)
08-May-2018 12:09:15         Active CodeSource: (file:/var/atlassian/application-data/bamboo/xml-data/build-dir/RNDTEST-SOFTWARE-JDK18/junit4-ant/target/junit4-ant-2.5.4-SNAPSHOT.jar <no signer certificates>)
08-May-2018 12:09:15 policy: evaluate principals:
08-May-2018 12:09:15         Policy Principals: []
08-May-2018 12:09:15         Active Principals: []
08-May-2018 12:09:15 policy:   granting ("java.lang.RuntimePermission" "setIO")
08-May-2018 12:09:15 policy: evaluation (codesource/principals) passed
08-May-2018 12:09:15 policy: evaluate codesources:
08-May-2018 12:09:15         Policy CodeSource: (file:/var/atlassian/application-data/bamboo/xml-data/build-dir/RNDTEST-SOFTWARE-JDK18/randomized-runner/target/randomizedtesting-runner-2.5.4-SNAPSHOT.jar <no signer certificates>)
08-May-2018 12:09:15         Active CodeSource: (file:/var/atlassian/application-data/bamboo/xml-data/build-dir/RNDTEST-SOFTWARE-JDK18/junit4-ant/target/junit4-ant-2.5.4-SNAPSHOT.jar <no signer certificates>)
08-May-2018 12:09:15 policy: evaluation (codesource) failed
08-May-2018 12:09:15 policy: evaluate codesources:
08-May-2018 12:09:15         Policy CodeSource: (file:/var/atlassian/application-data/bamboo/.m2/AGENT-61702145/repository/junit/junit/4.10/junit-4.10.jar <no signer certificates>)
08-May-2018 12:09:15         Active CodeSource: (file:/var/atlassian/application-data/bamboo/xml-data/build-dir/RNDTEST-SOFTWARE-JDK18/junit4-ant/target/junit4-ant-2.5.4-SNAPSHOT.jar <no signer certificates>)
08-May-2018 12:09:15 policy: evaluation (codesource) failed
08-May-2018 12:09:15 policy: evaluate codesources:
08-May-2018 12:09:15         Policy CodeSource: (null <no signer certificates>)
08-May-2018 12:09:15         Active CodeSource: (file:/var/atlassian/application-data/bamboo/xml-data/build-dir/RNDTEST-SOFTWARE-JDK18/junit4-ant/target/junit4-ant-2.5.4-SNAPSHOT.jar <no signer certificates>)
08-May-2018 12:09:15 policy: evaluate principals:
08-May-2018 12:09:15         Policy Principals: []
08-May-2018 12:09:15         Active Principals: []
08-May-2018 12:09:15 policy:   granting ("java.util.PropertyPermission" "*" "read")
08-May-2018 12:09:15 policy:   granting ("java.io.FilePermission" "<<ALL FILES>>" "read,write,execute,delete")
08-May-2018 12:09:15 policy: evaluation (codesource/principals) passed
08-May-2018 12:09:15 access: domain 0 ProtectionDomain  (file:/var/atlassian/application-data/bamboo/xml-data/build-dir/RNDTEST-SOFTWARE-JDK18/junit4-ant/target/junit4-ant-2.5.4-SNAPSHOT.jar <no signer certificates>)
08-May-2018 12:09:15 sun.misc.Launcher$AppClassLoader@42a57993
08-May-2018 12:09:15 <no principals>
08-May-2018 12:09:15 java.security.Permissions@34c45dca (
08-May-2018 12:09:15 ("java.lang.RuntimePermission" "exitVM")
08-May-2018 12:09:15 ("java.lang.RuntimePermission" "setIO")
08-May-2018 12:09:15 ("java.io.FilePermission" "<<ALL FILES>>" "read,write,execute,delete")
08-May-2018 12:09:15 ("java.io.FilePermission" "/var/atlassian/application-data/bamboo/xml-data/build-dir/RNDTEST-SOFTWARE-JDK18/junit4-ant/target/junit4-ant-2.5.4-SNAPSHOT.jar" "read")
08-May-2018 12:09:15 ("java.util.PropertyPermission" "*" "read")
08-May-2018 12:09:15 )
08-May-2018 12:09:15
08-May-2018 12:09:15
08-May-2018 12:09:15 access: access allowed ("java.util.PropertyPermission" "java.ext.dirs" "read")
08-May-2018 12:09:15 java.lang.Exception: Stack trace
08-May-2018 12:09:15         at java.lang.Thread.dumpStack(Thread.java:1336)
08-May-2018 12:09:15         at java.security.AccessControlContext.checkPermission(AccessControlContext.java:419)
08-May-2018 12:09:15         at java.security.AccessController.checkPermission(AccessController.java:884)
08-May-2018 12:09:15         at java.lang.SecurityManager.checkPermission(SecurityManager.java:549)
08-May-2018 12:09:15         at java.lang.SecurityManager.checkPropertyAccess(SecurityManager.java:1294)
08-May-2018 12:09:15         at java.lang.System.getProperty(System.java:717)
08-May-2018 12:09:15         at com.carrotsearch.ant.tasks.junit4.events.BootstrapEvent.collectSystemProperties(BootstrapEvent.java:93)
08-May-2018 12:09:15         at com.carrotsearch.ant.tasks.junit4.events.BootstrapEvent.<init>(BootstrapEvent.java:68)
08-May-2018 12:09:15         at com.carrotsearch.ant.tasks.junit4.slave.SlaveMain.main(SlaveMain.java:350)
08-May-2018 12:09:15         at com.carrotsearch.ant.tasks.junit4.slave.SlaveMainSafe.main(SlaveMainSafe.java:13)
08-May-2018 12:09:15 policy: getPermissions:
08-May-2018 12:09:15         PD CodeSource: (file:/var/atlassian/application-data/bamboo/xml-data/build-dir/RNDTEST-SOFTWARE-JDK18/junit4-ant/target/junit4-ant-2.5.4-SNAPSHOT.jar <no signer certificates>)
08-May-2018 12:09:15         PD ClassLoader: sun.misc.Launcher$AppClassLoader@42a57993
08-May-2018 12:09:15         PD Principals: <no principals>
08-May-2018 12:09:15 policy: evaluate codesources:
08-May-2018 12:09:15         Policy CodeSource: (file:/home/bamboo/jvms/oracle-jdk-1.8.0_162/jre/lib/ext/* <no signer certificates>)
08-May-2018 12:09:15         Active CodeSource: (file:/var/atlassian/application-data/bamboo/xml-data/build-dir/RNDTEST-SOFTWARE-JDK18/junit4-ant/target/junit4-ant-2.5.4-SNAPSHOT.jar <no signer certificates>)
08-May-2018 12:09:15 policy: evaluation (codesource) failed
08-May-2018 12:09:15 policy: evaluate codesources:
08-May-2018 12:09:15         Policy CodeSource: (file:/usr/java/packages/lib/ext/* <no signer certificates>)
08-May-2018 12:09:15         Active CodeSource: (file:/var/atlassian/application-data/bamboo/xml-data/build-dir/RNDTEST-SOFTWARE-JDK18/junit4-ant/target/junit4-ant-2.5.4-SNAPSHOT.jar <no signer certificates>)
08-May-2018 12:09:15 policy: evaluation (codesource) failed
08-May-2018 12:09:15 policy: evaluate codesources:
08-May-2018 12:09:15         Policy CodeSource: (file:/var/atlassian/application-data/bamboo/xml-data/build-dir/RNDTEST-SOFTWARE-JDK18/junit4-ant/target/junit4-ant-2.5.4-SNAPSHOT.jar <no signer certificates>)
08-May-2018 12:09:15         Active CodeSource: (file:/var/atlassian/application-data/bamboo/xml-data/build-dir/RNDTEST-SOFTWARE-JDK18/junit4-ant/target/junit4-ant-2.5.4-SNAPSHOT.jar <no signer certificates>)
08-May-2018 12:09:15 policy: evaluate principals:
08-May-2018 12:09:15         Policy Principals: []
08-May-2018 12:09:15         Active Principals: []
08-May-2018 12:09:15 policy:   granting ("java.lang.RuntimePermission" "setIO")
08-May-2018 12:09:15 policy: evaluation (codesource/principals) passed
08-May-2018 12:09:15 policy: evaluate codesources:
08-May-2018 12:09:15         Policy CodeSource: (file:/var/atlassian/application-data/bamboo/xml-data/build-dir/RNDTEST-SOFTWARE-JDK18/randomized-runner/target/randomizedtesting-runner-2.5.4-SNAPSHOT.jar <no signer certificates>)
08-May-2018 12:09:15         Active CodeSource: (file:/var/atlassian/application-data/bamboo/xml-data/build-dir/RNDTEST-SOFTWARE-JDK18/junit4-ant/target/junit4-ant-2.5.4-SNAPSHOT.jar <no signer certificates>)
08-May-2018 12:09:15 policy: evaluation (codesource) failed
08-May-2018 12:09:15 policy: evaluate codesources:
08-May-2018 12:09:15         Policy CodeSource: (file:/var/atlassian/application-data/bamboo/.m2/AGENT-61702145/repository/junit/junit/4.10/junit-4.10.jar <no signer certificates>)
08-May-2018 12:09:15         Active CodeSource: (file:/var/atlassian/application-data/bamboo/xml-data/build-dir/RNDTEST-SOFTWARE-JDK18/junit4-ant/target/junit4-ant-2.5.4-SNAPSHOT.jar <no signer certificates>)
08-May-2018 12:09:15 policy: evaluation (codesource) failed
08-May-2018 12:09:15 policy: evaluate codesources:
08-May-2018 12:09:15         Policy CodeSource: (null <no signer certificates>)
08-May-2018 12:09:15         Active CodeSource: (file:/var/atlassian/application-data/bamboo/xml-data/build-dir/RNDTEST-SOFTWARE-JDK18/junit4-ant/target/junit4-ant-2.5.4-SNAPSHOT.jar <no signer certificates>)
08-May-2018 12:09:15 policy: evaluate principals:
08-May-2018 12:09:15         Policy Principals: []
08-May-2018 12:09:15         Active Principals: []
08-May-2018 12:09:15 policy:   granting ("java.util.PropertyPermission" "*" "read")
08-May-2018 12:09:15 policy:   granting ("java.io.FilePermission" "<<ALL FILES>>" "read,write,execute,delete")
08-May-2018 12:09:15 policy: evaluation (codesource/principals) passed
08-May-2018 12:09:15 access: domain 0 ProtectionDomain  (file:/var/atlassian/application-data/bamboo/xml-data/build-dir/RNDTEST-SOFTWARE-JDK18/junit4-ant/target/junit4-ant-2.5.4-SNAPSHOT.jar <no signer certificates>)
08-May-2018 12:09:15 sun.misc.Launcher$AppClassLoader@42a57993
08-May-2018 12:09:15 <no principals>
08-May-2018 12:09:15 java.security.Permissions@5b6f7412 (
08-May-2018 12:09:15 ("java.lang.RuntimePermission" "exitVM")
08-May-2018 12:09:15 ("java.lang.RuntimePermission" "setIO")
08-May-2018 12:09:15 ("java.io.FilePermission" "<<ALL FILES>>" "read,write,execute,delete")
08-May-2018 12:09:15 ("java.io.FilePermission" "/var/atlassian/application-data/bamboo/xml-data/build-dir/RNDTEST-SOFTWARE-JDK18/junit4-ant/target/junit4-ant-2.5.4-SNAPSHOT.jar" "read")
08-May-2018 12:09:15 ("java.util.PropertyPermission" "*" "read")
08-May-2018 12:09:15 )
08-May-2018 12:09:15
08-May-2018 12:09:15
08-May-2018 12:09:15 access: access allowed ("java.util.PropertyPermission" "os.name" "read")
08-May-2018 12:09:15 java.lang.Exception: Stack trace
08-May-2018 12:09:15         at java.lang.Thread.dumpStack(Thread.java:1336)
08-May-2018 12:09:15         at java.security.AccessControlContext.checkPermission(AccessControlContext.java:419)
08-May-2018 12:09:15         at java.security.AccessController.checkPermission(AccessController.java:884)
08-May-2018 12:09:15         at java.lang.SecurityManager.checkPermission(SecurityManager.java:549)
08-May-2018 12:09:15         at java.lang.SecurityManager.checkPropertyAccess(SecurityManager.java:1294)
08-May-2018 12:09:15         at java.lang.System.getProperty(System.java:717)
08-May-2018 12:09:15         at com.carrotsearch.ant.tasks.junit4.events.BootstrapEvent.collectSystemProperties(BootstrapEvent.java:93)
08-May-2018 12:09:15         at com.carrotsearch.ant.tasks.junit4.events.BootstrapEvent.<init>(BootstrapEvent.java:68)
08-May-2018 12:09:15         at com.carrotsearch.ant.tasks.junit4.slave.SlaveMain.main(SlaveMain.java:350)
08-May-2018 12:09:15         at com.carrotsearch.ant.tasks.junit4.slave.SlaveMainSafe.main(SlaveMainSafe.java:13)
08-May-2018 12:09:15 policy: getPermissions:
08-May-2018 12:09:15         PD CodeSource: (file:/var/atlassian/application-data/bamboo/xml-data/build-dir/RNDTEST-SOFTWARE-JDK18/junit4-ant/target/junit4-ant-2.5.4-SNAPSHOT.jar <no signer certificates>)
08-May-2018 12:09:15         PD ClassLoader: sun.misc.Launcher$AppClassLoader@42a57993
08-May-2018 12:09:15         PD Principals: <no principals>
08-May-2018 12:09:15 policy: evaluate codesources:
08-May-2018 12:09:15         Policy CodeSource: (file:/home/bamboo/jvms/oracle-jdk-1.8.0_162/jre/lib/ext/* <no signer certificates>)
08-May-2018 12:09:15         Active CodeSource: (file:/var/atlassian/application-data/bamboo/xml-data/build-dir/RNDTEST-SOFTWARE-JDK18/junit4-ant/target/junit4-ant-2.5.4-SNAPSHOT.jar <no signer certificates>)
08-May-2018 12:09:15 policy: evaluation (codesource) failed
08-May-2018 12:09:15 policy: evaluate codesources:
08-May-2018 12:09:15         Policy CodeSource: (file:/usr/java/packages/lib/ext/* <no signer certificates>)
08-May-2018 12:09:15         Active CodeSource: (file:/var/atlassian/application-data/bamboo/xml-data/build-dir/RNDTEST-SOFTWARE-JDK18/junit4-ant/target/junit4-ant-2.5.4-SNAPSHOT.jar <no signer certificates>)
08-May-2018 12:09:15 policy: evaluation (codesource) failed
08-May-2018 12:09:15 policy: evaluate codesources:
08-May-2018 12:09:15         Policy CodeSource: (file:/var/atlassian/application-data/bamboo/xml-data/build-dir/RNDTEST-SOFTWARE-JDK18/junit4-ant/target/junit4-ant-2.5.4-SNAPSHOT.jar <no signer certificates>)
08-May-2018 12:09:15         Active CodeSource: (file:/var/atlassian/application-data/bamboo/xml-data/build-dir/RNDTEST-SOFTWARE-JDK18/junit4-ant/target/junit4-ant-2.5.4-SNAPSHOT.jar <no signer certificates>)
08-May-2018 12:09:15 policy: evaluate principals:
08-May-2018 12:09:15         Policy Principals: []
08-May-2018 12:09:15         Active Principals: []
08-May-2018 12:09:15 policy:   granting ("java.lang.RuntimePermission" "setIO")
08-May-2018 12:09:15 policy: evaluation (codesource/principals) passed
08-May-2018 12:09:15 policy: evaluate codesources:
08-May-2018 12:09:15         Policy CodeSource: (file:/var/atlassian/application-data/bamboo/xml-data/build-dir/RNDTEST-SOFTWARE-JDK18/randomized-runner/target/randomizedtesting-runner-2.5.4-SNAPSHOT.jar <no signer certificates>)
08-May-2018 12:09:15         Active CodeSource: (file:/var/atlassian/application-data/bamboo/xml-data/build-dir/RNDTEST-SOFTWARE-JDK18/junit4-ant/target/junit4-ant-2.5.4-SNAPSHOT.jar <no signer certificates>)
08-May-2018 12:09:15 policy: evaluation (codesource) failed
08-May-2018 12:09:15 policy: evaluate codesources:
08-May-2018 12:09:15         Policy CodeSource: (file:/var/atlassian/application-data/bamboo/.m2/AGENT-61702145/repository/junit/junit/4.10/junit-4.10.jar <no signer certificates>)
08-May-2018 12:09:15         Active CodeSource: (file:/var/atlassian/application-data/bamboo/xml-data/build-dir/RNDTEST-SOFTWARE-JDK18/junit4-ant/target/junit4-ant-2.5.4-SNAPSHOT.jar <no signer certificates>)
08-May-2018 12:09:15 policy: evaluation (codesource) failed
08-May-2018 12:09:15 policy: evaluate codesources:
08-May-2018 12:09:15         Policy CodeSource: (null <no signer certificates>)
08-May-2018 12:09:15         Active CodeSource: (file:/var/atlassian/application-data/bamboo/xml-data/build-dir/RNDTEST-SOFTWARE-JDK18/junit4-ant/target/junit4-ant-2.5.4-SNAPSHOT.jar <no signer certificates>)
08-May-2018 12:09:15 policy: evaluate principals:
08-May-2018 12:09:15         Policy Principals: []
08-May-2018 12:09:15         Active Principals: []
08-May-2018 12:09:15 policy:   granting ("java.util.PropertyPermission" "*" "read")
08-May-2018 12:09:15 policy:   granting ("java.io.FilePermission" "<<ALL FILES>>" "read,write,execute,delete")
08-May-2018 12:09:15 policy: evaluation (codesource/principals) passed
08-May-2018 12:09:15 access: domain 0 ProtectionDomain  (file:/var/atlassian/application-data/bamboo/xml-data/build-dir/RNDTEST-SOFTWARE-JDK18/junit4-ant/target/junit4-ant-2.5.4-SNAPSHOT.jar <no signer certificates>)
08-May-2018 12:09:15 sun.misc.Launcher$AppClassLoader@42a57993
08-May-2018 12:09:15 <no principals>
08-May-2018 12:09:15 java.security.Permissions@312b1dae (
08-May-2018 12:09:15 ("java.lang.RuntimePermission" "exitVM")
08-May-2018 12:09:15 ("java.lang.RuntimePermission" "setIO")
08-May-2018 12:09:15 ("java.io.FilePermission" "<<ALL FILES>>" "read,write,execute,delete")
08-May-2018 12:09:15 ("java.io.FilePermission" "/var/atlassian/application-data/bamboo/xml-data/build-dir/RNDTEST-SOFTWARE-JDK18/junit4-ant/target/junit4-ant-2.5.4-SNAPSHOT.jar" "read")
08-May-2018 12:09:15 ("java.util.PropertyPermission" "*" "read")
08-May-2018 12:09:15 )
08-May-2018 12:09:15
08-May-2018 12:09:15
08-May-2018 12:09:15 access: access allowed ("java.util.PropertyPermission" "os.arch" "read")
08-May-2018 12:09:15 java.lang.Exception: Stack trace
08-May-2018 12:09:15         at java.lang.Thread.dumpStack(Thread.java:1336)
08-May-2018 12:09:15         at java.security.AccessControlContext.checkPermission(AccessControlContext.java:419)
08-May-2018 12:09:15         at java.security.AccessController.checkPermission(AccessController.java:884)
08-May-2018 12:09:15         at java.lang.SecurityManager.checkPermission(SecurityManager.java:549)
08-May-2018 12:09:15         at java.lang.SecurityManager.checkPropertyAccess(SecurityManager.java:1294)
08-May-2018 12:09:15         at java.lang.System.getProperty(System.java:717)
08-May-2018 12:09:15         at com.carrotsearch.ant.tasks.junit4.events.BootstrapEvent.collectSystemProperties(BootstrapEvent.java:93)
08-May-2018 12:09:15         at com.carrotsearch.ant.tasks.junit4.events.BootstrapEvent.<init>(BootstrapEvent.java:68)
08-May-2018 12:09:15         at com.carrotsearch.ant.tasks.junit4.slave.SlaveMain.main(SlaveMain.java:350)
08-May-2018 12:09:15         at com.carrotsearch.ant.tasks.junit4.slave.SlaveMainSafe.main(SlaveMainSafe.java:13)
08-May-2018 12:09:15 policy: getPermissions:
08-May-2018 12:09:15         PD CodeSource: (file:/var/atlassian/application-data/bamboo/xml-data/build-dir/RNDTEST-SOFTWARE-JDK18/junit4-ant/target/junit4-ant-2.5.4-SNAPSHOT.jar <no signer certificates>)
08-May-2018 12:09:15         PD ClassLoader: sun.misc.Launcher$AppClassLoader@42a57993
08-May-2018 12:09:15         PD Principals: <no principals>
08-May-2018 12:09:15 policy: evaluate codesources:
08-May-2018 12:09:15         Policy CodeSource: (file:/home/bamboo/jvms/oracle-jdk-1.8.0_162/jre/lib/ext/* <no signer certificates>)
08-May-2018 12:09:15         Active CodeSource: (file:/var/atlassian/application-data/bamboo/xml-data/build-dir/RNDTEST-SOFTWARE-JDK18/junit4-ant/target/junit4-ant-2.5.4-SNAPSHOT.jar <no signer certificates>)
08-May-2018 12:09:15 policy: evaluation (codesource) failed
08-May-2018 12:09:15 policy: evaluate codesources:
08-May-2018 12:09:15         Policy CodeSource: (file:/usr/java/packages/lib/ext/* <no signer certificates>)
08-May-2018 12:09:15         Active CodeSource: (file:/var/atlassian/application-data/bamboo/xml-data/build-dir/RNDTEST-SOFTWARE-JDK18/junit4-ant/target/junit4-ant-2.5.4-SNAPSHOT.jar <no signer certificates>)
08-May-2018 12:09:15 policy: evaluation (codesource) failed
08-May-2018 12:09:15 policy: evaluate codesources:
08-May-2018 12:09:15         Policy CodeSource: (file:/var/atlassian/application-data/bamboo/xml-data/build-dir/RNDTEST-SOFTWARE-JDK18/junit4-ant/target/junit4-ant-2.5.4-SNAPSHOT.jar <no signer certificates>)
08-May-2018 12:09:15         Active CodeSource: (file:/var/atlassian/application-data/bamboo/xml-data/build-dir/RNDTEST-SOFTWARE-JDK18/junit4-ant/target/junit4-ant-2.5.4-SNAPSHOT.jar <no signer certificates>)
08-May-2018 12:09:15 policy: evaluate principals:
08-May-2018 12:09:15         Policy Principals: []
08-May-2018 12:09:15         Active Principals: []
08-May-2018 12:09:15 policy:   granting ("java.lang.RuntimePermission" "setIO")
08-May-2018 12:09:15 policy: evaluation (codesource/principals) passed
08-May-2018 12:09:15 policy: evaluate codesources:
08-May-2018 12:09:15         Policy CodeSource: (file:/var/atlassian/application-data/bamboo/xml-data/build-dir/RNDTEST-SOFTWARE-JDK18/randomized-runner/target/randomizedtesting-runner-2.5.4-SNAPSHOT.jar <no signer certificates>)
08-May-2018 12:09:15         Active CodeSource: (file:/var/atlassian/application-data/bamboo/xml-data/build-dir/RNDTEST-SOFTWARE-JDK18/junit4-ant/target/junit4-ant-2.5.4-SNAPSHOT.jar <no signer certificates>)
08-May-2018 12:09:15 policy: evaluation (codesource) failed
08-May-2018 12:09:15 policy: evaluate codesources:
08-May-2018 12:09:15         Policy CodeSource: (file:/var/atlassian/application-data/bamboo/.m2/AGENT-61702145/repository/junit/junit/4.10/junit-4.10.jar <no signer certificates>)
08-May-2018 12:09:15         Active CodeSource: (file:/var/atlassian/application-data/bamboo/xml-data/build-dir/RNDTEST-SOFTWARE-JDK18/junit4-ant/target/junit4-ant-2.5.4-SNAPSHOT.jar <no signer certificates>)
08-May-2018 12:09:15 policy: evaluation (codesource) failed
08-May-2018 12:09:15 policy: evaluate codesources:
08-May-2018 12:09:15         Policy CodeSource: (null <no signer certificates>)
08-May-2018 12:09:15         Active CodeSource: (file:/var/atlassian/application-data/bamboo/xml-data/build-dir/RNDTEST-SOFTWARE-JDK18/junit4-ant/target/junit4-ant-2.5.4-SNAPSHOT.jar <no signer certificates>)
08-May-2018 12:09:15 policy: evaluate principals:
08-May-2018 12:09:15         Policy Principals: []
08-May-2018 12:09:15         Active Principals: []
08-May-2018 12:09:15 policy:   granting ("java.util.PropertyPermission" "*" "read")
08-May-2018 12:09:15 policy:   granting ("java.io.FilePermission" "<<ALL FILES>>" "read,write,execute,delete")
08-May-2018 12:09:15 policy: evaluation (codesource/principals) passed
08-May-2018 12:09:15 access: domain 0 ProtectionDomain  (file:/var/atlassian/application-data/bamboo/xml-data/build-dir/RNDTEST-SOFTWARE-JDK18/junit4-ant/target/junit4-ant-2.5.4-SNAPSHOT.jar <no signer certificates>)
08-May-2018 12:09:15 sun.misc.Launcher$AppClassLoader@42a57993
08-May-2018 12:09:15 <no principals>
08-May-2018 12:09:15 java.security.Permissions@27bc2616 (
08-May-2018 12:09:15 ("java.lang.RuntimePermission" "exitVM")
08-May-2018 12:09:15 ("java.lang.RuntimePermission" "setIO")
08-May-2018 12:09:15 ("java.io.FilePermission" "<<ALL FILES>>" "read,write,execute,delete")
08-May-2018 12:09:15 ("java.io.FilePermission" "/var/atlassian/application-data/bamboo/xml-data/build-dir/RNDTEST-SOFTWARE-JDK18/junit4-ant/target/junit4-ant-2.5.4-SNAPSHOT.jar" "read")
08-May-2018 12:09:15 ("java.util.PropertyPermission" "*" "read")
08-May-2018 12:09:15 )
08-May-2018 12:09:15
08-May-2018 12:09:15
08-May-2018 12:09:15 access: access allowed ("java.util.PropertyPermission" "os.version" "read")
08-May-2018 12:09:15 java.lang.Exception: Stack trace
08-May-2018 12:09:15         at java.lang.Thread.dumpStack(Thread.java:1336)
08-May-2018 12:09:15         at java.security.AccessControlContext.checkPermission(AccessControlContext.java:419)
08-May-2018 12:09:15         at java.security.AccessController.checkPermission(AccessController.java:884)
08-May-2018 12:09:15         at java.lang.SecurityManager.checkPermission(SecurityManager.java:549)
08-May-2018 12:09:15         at java.lang.SecurityManager.checkPropertyAccess(SecurityManager.java:1294)
08-May-2018 12:09:15         at java.lang.System.getProperty(System.java:717)
08-May-2018 12:09:15         at com.carrotsearch.ant.tasks.junit4.events.BootstrapEvent.collectSystemProperties(BootstrapEvent.java:93)
08-May-2018 12:09:15         at com.carrotsearch.ant.tasks.junit4.events.BootstrapEvent.<init>(BootstrapEvent.java:68)
08-May-2018 12:09:15         at com.carrotsearch.ant.tasks.junit4.slave.SlaveMain.main(SlaveMain.java:350)
08-May-2018 12:09:15         at com.carrotsearch.ant.tasks.junit4.slave.SlaveMainSafe.main(SlaveMainSafe.java:13)
08-May-2018 12:09:15 policy: getPermissions:
08-May-2018 12:09:15         PD CodeSource: (file:/var/atlassian/application-data/bamboo/xml-data/build-dir/RNDTEST-SOFTWARE-JDK18/junit4-ant/target/junit4-ant-2.5.4-SNAPSHOT.jar <no signer certificates>)
08-May-2018 12:09:15         PD ClassLoader: sun.misc.Launcher$AppClassLoader@42a57993
08-May-2018 12:09:15         PD Principals: <no principals>
08-May-2018 12:09:15 policy: evaluate codesources:
08-May-2018 12:09:15         Policy CodeSource: (file:/home/bamboo/jvms/oracle-jdk-1.8.0_162/jre/lib/ext/* <no signer certificates>)
08-May-2018 12:09:15         Active CodeSource: (file:/var/atlassian/application-data/bamboo/xml-data/build-dir/RNDTEST-SOFTWARE-JDK18/junit4-ant/target/junit4-ant-2.5.4-SNAPSHOT.jar <no signer certificates>)
08-May-2018 12:09:15 policy: evaluation (codesource) failed
08-May-2018 12:09:15 policy: evaluate codesources:
08-May-2018 12:09:15         Policy CodeSource: (file:/usr/java/packages/lib/ext/* <no signer certificates>)
08-May-2018 12:09:15         Active CodeSource: (file:/var/atlassian/application-data/bamboo/xml-data/build-dir/RNDTEST-SOFTWARE-JDK18/junit4-ant/target/junit4-ant-2.5.4-SNAPSHOT.jar <no signer certificates>)
08-May-2018 12:09:15 policy: evaluation (codesource) failed
08-May-2018 12:09:15 policy: evaluate codesources:
08-May-2018 12:09:15         Policy CodeSource: (file:/var/atlassian/application-data/bamboo/xml-data/build-dir/RNDTEST-SOFTWARE-JDK18/junit4-ant/target/junit4-ant-2.5.4-SNAPSHOT.jar <no signer certificates>)
08-May-2018 12:09:15         Active CodeSource: (file:/var/atlassian/application-data/bamboo/xml-data/build-dir/RNDTEST-SOFTWARE-JDK18/junit4-ant/target/junit4-ant-2.5.4-SNAPSHOT.jar <no signer certificates>)
08-May-2018 12:09:15 policy: evaluate principals:
08-May-2018 12:09:15         Policy Principals: []
08-May-2018 12:09:15         Active Principals: []
08-May-2018 12:09:15 policy:   granting ("java.lang.RuntimePermission" "setIO")
08-May-2018 12:09:15 policy: evaluation (codesource/principals) passed
08-May-2018 12:09:15 policy: evaluate codesources:
08-May-2018 12:09:15         Policy CodeSource: (file:/var/atlassian/application-data/bamboo/xml-data/build-dir/RNDTEST-SOFTWARE-JDK18/randomized-runner/target/randomizedtesting-runner-2.5.4-SNAPSHOT.jar <no signer certificates>)
08-May-2018 12:09:15         Active CodeSource: (file:/var/atlassian/application-data/bamboo/xml-data/build-dir/RNDTEST-SOFTWARE-JDK18/junit4-ant/target/junit4-ant-2.5.4-SNAPSHOT.jar <no signer certificates>)
08-May-2018 12:09:15 policy: evaluation (codesource) failed
08-May-2018 12:09:15 policy: evaluate codesources:
08-May-2018 12:09:15         Policy CodeSource: (file:/var/atlassian/application-data/bamboo/.m2/AGENT-61702145/repository/junit/junit/4.10/junit-4.10.jar <no signer certificates>)
08-May-2018 12:09:15         Active CodeSource: (file:/var/atlassian/application-data/bamboo/xml-data/build-dir/RNDTEST-SOFTWARE-JDK18/junit4-ant/target/junit4-ant-2.5.4-SNAPSHOT.jar <no signer certificates>)
08-May-2018 12:09:15 policy: evaluation (codesource) failed
08-May-2018 12:09:15 policy: evaluate codesources:
08-May-2018 12:09:15         Policy CodeSource: (null <no signer certificates>)
08-May-2018 12:09:15         Active CodeSource: (file:/var/atlassian/application-data/bamboo/xml-data/build-dir/RNDTEST-SOFTWARE-JDK18/junit4-ant/target/junit4-ant-2.5.4-SNAPSHOT.jar <no signer certificates>)
08-May-2018 12:09:15 policy: evaluate principals:
08-May-2018 12:09:15         Policy Principals: []
08-May-2018 12:09:15         Active Principals: []
08-May-2018 12:09:15 policy:   granting ("java.util.PropertyPermission" "*" "read")
08-May-2018 12:09:15 policy:   granting ("java.io.FilePermission" "<<ALL FILES>>" "read,write,execute,delete")
08-May-2018 12:09:15 policy: evaluation (codesource/principals) passed
08-May-2018 12:09:15 access: domain 0 ProtectionDomain  (file:/var/atlassian/application-data/bamboo/xml-data/build-dir/RNDTEST-SOFTWARE-JDK18/junit4-ant/target/junit4-ant-2.5.4-SNAPSHOT.jar <no signer certificates>)
08-May-2018 12:09:15 sun.misc.Launcher$AppClassLoader@42a57993
08-May-2018 12:09:15 <no principals>
08-May-2018 12:09:15 java.security.Permissions@506e1b77 (
08-May-2018 12:09:15 ("java.lang.RuntimePermission" "exitVM")
08-May-2018 12:09:15 ("java.lang.RuntimePermission" "setIO")
08-May-2018 12:09:15 ("java.io.FilePermission" "<<ALL FILES>>" "read,write,execute,delete")
08-May-2018 12:09:15 ("java.io.FilePermission" "/var/atlassian/application-data/bamboo/xml-data/build-dir/RNDTEST-SOFTWARE-JDK18/junit4-ant/target/junit4-ant-2.5.4-SNAPSHOT.jar" "read")
08-May-2018 12:09:15 ("java.util.PropertyPermission" "*" "read")
08-May-2018 12:09:15 )
08-May-2018 12:09:15
08-May-2018 12:09:15
08-May-2018 12:09:15 access: access allowed ("java.util.PropertyPermission" "file.separator" "read")
08-May-2018 12:09:15 java.lang.Exception: Stack trace
08-May-2018 12:09:15         at java.lang.Thread.dumpStack(Thread.java:1336)
08-May-2018 12:09:15         at java.security.AccessControlContext.checkPermission(AccessControlContext.java:419)
08-May-2018 12:09:15         at java.security.AccessController.checkPermission(AccessController.java:884)
08-May-2018 12:09:15         at java.lang.SecurityManager.checkPermission(SecurityManager.java:549)
08-May-2018 12:09:15         at java.lang.SecurityManager.checkPropertyAccess(SecurityManager.java:1294)
08-May-2018 12:09:15         at java.lang.System.getProperty(System.java:717)
08-May-2018 12:09:15         at com.carrotsearch.ant.tasks.junit4.events.BootstrapEvent.collectSystemProperties(BootstrapEvent.java:93)
08-May-2018 12:09:15         at com.carrotsearch.ant.tasks.junit4.events.BootstrapEvent.<init>(BootstrapEvent.java:68)
08-May-2018 12:09:15         at com.carrotsearch.ant.tasks.junit4.slave.SlaveMain.main(SlaveMain.java:350)
08-May-2018 12:09:15         at com.carrotsearch.ant.tasks.junit4.slave.SlaveMainSafe.main(SlaveMainSafe.java:13)
08-May-2018 12:09:15 policy: getPermissions:
08-May-2018 12:09:15         PD CodeSource: (file:/var/atlassian/application-data/bamboo/xml-data/build-dir/RNDTEST-SOFTWARE-JDK18/junit4-ant/target/junit4-ant-2.5.4-SNAPSHOT.jar <no signer certificates>)
08-May-2018 12:09:15         PD ClassLoader: sun.misc.Launcher$AppClassLoader@42a57993
08-May-2018 12:09:15         PD Principals: <no principals>
08-May-2018 12:09:15 policy: evaluate codesources:
08-May-2018 12:09:15         Policy CodeSource: (file:/home/bamboo/jvms/oracle-jdk-1.8.0_162/jre/lib/ext/* <no signer certificates>)
08-May-2018 12:09:15         Active CodeSource: (file:/var/atlassian/application-data/bamboo/xml-data/build-dir/RNDTEST-SOFTWARE-JDK18/junit4-ant/target/junit4-ant-2.5.4-SNAPSHOT.jar <no signer certificates>)
08-May-2018 12:09:15 policy: evaluation (codesource) failed
08-May-2018 12:09:15 policy: evaluate codesources:
08-May-2018 12:09:15         Policy CodeSource: (file:/usr/java/packages/lib/ext/* <no signer certificates>)
08-May-2018 12:09:15         Active CodeSource: (file:/var/atlassian/application-data/bamboo/xml-data/build-dir/RNDTEST-SOFTWARE-JDK18/junit4-ant/target/junit4-ant-2.5.4-SNAPSHOT.jar <no signer certificates>)
08-May-2018 12:09:15 policy: evaluation (codesource) failed
08-May-2018 12:09:15 policy: evaluate codesources:
08-May-2018 12:09:15         Policy CodeSource: (file:/var/atlassian/application-data/bamboo/xml-data/build-dir/RNDTEST-SOFTWARE-JDK18/junit4-ant/target/junit4-ant-2.5.4-SNAPSHOT.jar <no signer certificates>)
08-May-2018 12:09:15         Active CodeSource: (file:/var/atlassian/application-data/bamboo/xml-data/build-dir/RNDTEST-SOFTWARE-JDK18/junit4-ant/target/junit4-ant-2.5.4-SNAPSHOT.jar <no signer certificates>)
08-May-2018 12:09:15 policy: evaluate principals:
08-May-2018 12:09:15         Policy Principals: []
08-May-2018 12:09:15         Active Principals: []
08-May-2018 12:09:15 policy:   granting ("java.lang.RuntimePermission" "setIO")
08-May-2018 12:09:15 policy: evaluation (codesource/principals) passed
08-May-2018 12:09:15 policy: evaluate codesources:
08-May-2018 12:09:15         Policy CodeSource: (file:/var/atlassian/application-data/bamboo/xml-data/build-dir/RNDTEST-SOFTWARE-JDK18/randomized-runner/target/randomizedtesting-runner-2.5.4-SNAPSHOT.jar <no signer certificates>)
08-May-2018 12:09:15         Active CodeSource: (file:/var/atlassian/application-data/bamboo/xml-data/build-dir/RNDTEST-SOFTWARE-JDK18/junit4-ant/target/junit4-ant-2.5.4-SNAPSHOT.jar <no signer certificates>)
08-May-2018 12:09:15 policy: evaluation (codesource) failed
08-May-2018 12:09:15 policy: evaluate codesources:
08-May-2018 12:09:15         Policy CodeSource: (file:/var/atlassian/application-data/bamboo/.m2/AGENT-61702145/repository/junit/junit/4.10/junit-4.10.jar <no signer certificates>)
08-May-2018 12:09:15         Active CodeSource: (file:/var/atlassian/application-data/bamboo/xml-data/build-dir/RNDTEST-SOFTWARE-JDK18/junit4-ant/target/junit4-ant-2.5.4-SNAPSHOT.jar <no signer certificates>)
08-May-2018 12:09:15 policy: evaluation (codesource) failed
08-May-2018 12:09:15 policy: evaluate codesources:
08-May-2018 12:09:15         Policy CodeSource: (null <no signer certificates>)
08-May-2018 12:09:15         Active CodeSource: (file:/var/atlassian/application-data/bamboo/xml-data/build-dir/RNDTEST-SOFTWARE-JDK18/junit4-ant/target/junit4-ant-2.5.4-SNAPSHOT.jar <no signer certificates>)
08-May-2018 12:09:15 policy: evaluate principals:
08-May-2018 12:09:15         Policy Principals: []
08-May-2018 12:09:15         Active Principals: []
08-May-2018 12:09:15 policy:   granting ("java.util.PropertyPermission" "*" "read")
08-May-2018 12:09:15 policy:   granting ("java.io.FilePermission" "<<ALL FILES>>" "read,write,execute,delete")
08-May-2018 12:09:15 policy: evaluation (codesource/principals) passed
08-May-2018 12:09:15 access: domain 0 ProtectionDomain  (file:/var/atlassian/application-data/bamboo/xml-data/build-dir/RNDTEST-SOFTWARE-JDK18/junit4-ant/target/junit4-ant-2.5.4-SNAPSHOT.jar <no signer certificates>)
08-May-2018 12:09:15 sun.misc.Launcher$AppClassLoader@42a57993
08-May-2018 12:09:15 <no principals>
08-May-2018 12:09:15 java.security.Permissions@9807454 (
08-May-2018 12:09:15 ("java.lang.RuntimePermission" "exitVM")
08-May-2018 12:09:15 ("java.lang.RuntimePermission" "setIO")
08-May-2018 12:09:15 ("java.io.FilePermission" "<<ALL FILES>>" "read,write,execute,delete")
08-May-2018 12:09:15 ("java.io.FilePermission" "/var/atlassian/application-data/bamboo/xml-data/build-dir/RNDTEST-SOFTWARE-JDK18/junit4-ant/target/junit4-ant-2.5.4-SNAPSHOT.jar" "read")
08-May-2018 12:09:15 ("java.util.PropertyPermission" "*" "read")
08-May-2018 12:09:15 )
08-May-2018 12:09:15
08-May-2018 12:09:15
08-May-2018 12:09:15 access: access allowed ("java.util.PropertyPermission" "path.separator" "read")
08-May-2018 12:09:15 java.lang.Exception: Stack trace
08-May-2018 12:09:15         at java.lang.Thread.dumpStack(Thread.java:1336)
08-May-2018 12:09:15         at java.security.AccessControlContext.checkPermission(AccessControlContext.java:419)
08-May-2018 12:09:15         at java.security.AccessController.checkPermission(AccessController.java:884)
08-May-2018 12:09:15         at java.lang.SecurityManager.checkPermission(SecurityManager.java:549)
08-May-2018 12:09:15         at java.lang.SecurityManager.checkPropertyAccess(SecurityManager.java:1294)
08-May-2018 12:09:15         at java.lang.System.getProperty(System.java:717)
08-May-2018 12:09:15         at com.carrotsearch.ant.tasks.junit4.events.BootstrapEvent.collectSystemProperties(BootstrapEvent.java:93)
08-May-2018 12:09:15         at com.carrotsearch.ant.tasks.junit4.events.BootstrapEvent.<init>(BootstrapEvent.java:68)
08-May-2018 12:09:15         at com.carrotsearch.ant.tasks.junit4.slave.SlaveMain.main(SlaveMain.java:350)
08-May-2018 12:09:15         at com.carrotsearch.ant.tasks.junit4.slave.SlaveMainSafe.main(SlaveMainSafe.java:13)
08-May-2018 12:09:15 policy: getPermissions:
08-May-2018 12:09:15         PD CodeSource: (file:/var/atlassian/application-data/bamboo/xml-data/build-dir/RNDTEST-SOFTWARE-JDK18/junit4-ant/target/junit4-ant-2.5.4-SNAPSHOT.jar <no signer certificates>)
08-May-2018 12:09:15         PD ClassLoader: sun.misc.Launcher$AppClassLoader@42a57993
08-May-2018 12:09:15         PD Principals: <no principals>
08-May-2018 12:09:15 policy: evaluate codesources:
08-May-2018 12:09:15         Policy CodeSource: (file:/home/bamboo/jvms/oracle-jdk-1.8.0_162/jre/lib/ext/* <no signer certificates>)
08-May-2018 12:09:15         Active CodeSource: (file:/var/atlassian/application-data/bamboo/xml-data/build-dir/RNDTEST-SOFTWARE-JDK18/junit4-ant/target/junit4-ant-2.5.4-SNAPSHOT.jar <no signer certificates>)
08-May-2018 12:09:15 policy: evaluation (codesource) failed
08-May-2018 12:09:15 policy: evaluate codesources:
08-May-2018 12:09:15         Policy CodeSource: (file:/usr/java/packages/lib/ext/* <no signer certificates>)
08-May-2018 12:09:15         Active CodeSource: (file:/var/atlassian/application-data/bamboo/xml-data/build-dir/RNDTEST-SOFTWARE-JDK18/junit4-ant/target/junit4-ant-2.5.4-SNAPSHOT.jar <no signer certificates>)
08-May-2018 12:09:15 policy: evaluation (codesource) failed
08-May-2018 12:09:15 policy: evaluate codesources:
08-May-2018 12:09:15         Policy CodeSource: (file:/var/atlassian/application-data/bamboo/xml-data/build-dir/RNDTEST-SOFTWARE-JDK18/junit4-ant/target/junit4-ant-2.5.4-SNAPSHOT.jar <no signer certificates>)
08-May-2018 12:09:15         Active CodeSource: (file:/var/atlassian/application-data/bamboo/xml-data/build-dir/RNDTEST-SOFTWARE-JDK18/junit4-ant/target/junit4-ant-2.5.4-SNAPSHOT.jar <no signer certificates>)
08-May-2018 12:09:15 policy: evaluate principals:
08-May-2018 12:09:15         Policy Principals: []
08-May-2018 12:09:15         Active Principals: []
08-May-2018 12:09:15 policy:   granting ("java.lang.RuntimePermission" "setIO")
08-May-2018 12:09:15 policy: evaluation (codesource/principals) passed
08-May-2018 12:09:15 policy: evaluate codesources:
08-May-2018 12:09:15         Policy CodeSource: (file:/var/atlassian/application-data/bamboo/xml-data/build-dir/RNDTEST-SOFTWARE-JDK18/randomized-runner/target/randomizedtesting-runner-2.5.4-SNAPSHOT.jar <no signer certificates>)
08-May-2018 12:09:15         Active CodeSource: (file:/var/atlassian/application-data/bamboo/xml-data/build-dir/RNDTEST-SOFTWARE-JDK18/junit4-ant/target/junit4-ant-2.5.4-SNAPSHOT.jar <no signer certificates>)
08-May-2018 12:09:15 policy: evaluation (codesource) failed
08-May-2018 12:09:15 policy: evaluate codesources:
08-May-2018 12:09:15         Policy CodeSource: (file:/var/atlassian/application-data/bamboo/.m2/AGENT-61702145/repository/junit/junit/4.10/junit-4.10.jar <no signer certificates>)
08-May-2018 12:09:15         Active CodeSource: (file:/var/atlassian/application-data/bamboo/xml-data/build-dir/RNDTEST-SOFTWARE-JDK18/junit4-ant/target/junit4-ant-2.5.4-SNAPSHOT.jar <no signer certificates>)
08-May-2018 12:09:15 policy: evaluation (codesource) failed
08-May-2018 12:09:15 policy: evaluate codesources:
08-May-2018 12:09:15         Policy CodeSource: (null <no signer certificates>)
08-May-2018 12:09:15         Active CodeSource: (file:/var/atlassian/application-data/bamboo/xml-data/build-dir/RNDTEST-SOFTWARE-JDK18/junit4-ant/target/junit4-ant-2.5.4-SNAPSHOT.jar <no signer certificates>)
08-May-2018 12:09:15 policy: evaluate principals:
08-May-2018 12:09:15         Policy Principals: []
08-May-2018 12:09:15         Active Principals: []
08-May-2018 12:09:15 policy:   granting ("java.util.PropertyPermission" "*" "read")
08-May-2018 12:09:15 policy:   granting ("java.io.FilePermission" "<<ALL FILES>>" "read,write,execute,delete")
08-May-2018 12:09:15 policy: evaluation (codesource/principals) passed
08-May-2018 12:09:15 access: domain 0 ProtectionDomain  (file:/var/atlassian/application-data/bamboo/xml-data/build-dir/RNDTEST-SOFTWARE-JDK18/junit4-ant/target/junit4-ant-2.5.4-SNAPSHOT.jar <no signer certificates>)
08-May-2018 12:09:15 sun.misc.Launcher$AppClassLoader@42a57993
08-May-2018 12:09:15 <no principals>
08-May-2018 12:09:15 java.security.Permissions@1ddc4ec2 (
08-May-2018 12:09:15 ("java.lang.RuntimePermission" "exitVM")
08-May-2018 12:09:15 ("java.lang.RuntimePermission" "setIO")
08-May-2018 12:09:15 ("java.io.FilePermission" "<<ALL FILES>>" "read,write,execute,delete")
08-May-2018 12:09:15 ("java.io.FilePermission" "/var/atlassian/application-data/bamboo/xml-data/build-dir/RNDTEST-SOFTWARE-JDK18/junit4-ant/target/junit4-ant-2.5.4-SNAPSHOT.jar" "read")
08-May-2018 12:09:15 ("java.util.PropertyPermission" "*" "read")
08-May-2018 12:09:15 )
08-May-2018 12:09:15
08-May-2018 12:09:15
08-May-2018 12:09:15 access: access allowed ("java.util.PropertyPermission" "line.separator" "read")
08-May-2018 12:09:15 java.lang.Exception: Stack trace
08-May-2018 12:09:15         at java.lang.Thread.dumpStack(Thread.java:1336)
08-May-2018 12:09:15         at java.security.AccessControlContext.checkPermission(AccessControlContext.java:419)
08-May-2018 12:09:15         at java.security.AccessController.checkPermission(AccessController.java:884)
08-May-2018 12:09:15         at java.lang.SecurityManager.checkPermission(SecurityManager.java:549)
08-May-2018 12:09:15         at java.lang.SecurityManager.checkPropertyAccess(SecurityManager.java:1294)
08-May-2018 12:09:15         at java.lang.System.getProperty(System.java:717)
08-May-2018 12:09:15         at com.carrotsearch.ant.tasks.junit4.events.BootstrapEvent.collectSystemProperties(BootstrapEvent.java:93)
08-May-2018 12:09:15         at com.carrotsearch.ant.tasks.junit4.events.BootstrapEvent.<init>(BootstrapEvent.java:68)
08-May-2018 12:09:15         at com.carrotsearch.ant.tasks.junit4.slave.SlaveMain.main(SlaveMain.java:350)
08-May-2018 12:09:15         at com.carrotsearch.ant.tasks.junit4.slave.SlaveMainSafe.main(SlaveMainSafe.java:13)
08-May-2018 12:09:15 policy: getPermissions:
08-May-2018 12:09:15         PD CodeSource: (file:/var/atlassian/application-data/bamboo/xml-data/build-dir/RNDTEST-SOFTWARE-JDK18/junit4-ant/target/junit4-ant-2.5.4-SNAPSHOT.jar <no signer certificates>)
08-May-2018 12:09:15         PD ClassLoader: sun.misc.Launcher$AppClassLoader@42a57993
08-May-2018 12:09:15         PD Principals: <no principals>
08-May-2018 12:09:15 policy: evaluate codesources:
08-May-2018 12:09:15         Policy CodeSource: (file:/home/bamboo/jvms/oracle-jdk-1.8.0_162/jre/lib/ext/* <no signer certificates>)
08-May-2018 12:09:15         Active CodeSource: (file:/var/atlassian/application-data/bamboo/xml-data/build-dir/RNDTEST-SOFTWARE-JDK18/junit4-ant/target/junit4-ant-2.5.4-SNAPSHOT.jar <no signer certificates>)
08-May-2018 12:09:15 policy: evaluation (codesource) failed
08-May-2018 12:09:15 policy: evaluate codesources:
08-May-2018 12:09:15         Policy CodeSource: (file:/usr/java/packages/lib/ext/* <no signer certificates>)
08-May-2018 12:09:15         Active CodeSource: (file:/var/atlassian/application-data/bamboo/xml-data/build-dir/RNDTEST-SOFTWARE-JDK18/junit4-ant/target/junit4-ant-2.5.4-SNAPSHOT.jar <no signer certificates>)
08-May-2018 12:09:15 policy: evaluation (codesource) failed
08-May-2018 12:09:15 policy: evaluate codesources:
08-May-2018 12:09:15         Policy CodeSource: (file:/var/atlassian/application-data/bamboo/xml-data/build-dir/RNDTEST-SOFTWARE-JDK18/junit4-ant/target/junit4-ant-2.5.4-SNAPSHOT.jar <no signer certificates>)
08-May-2018 12:09:15         Active CodeSource: (file:/var/atlassian/application-data/bamboo/xml-data/build-dir/RNDTEST-SOFTWARE-JDK18/junit4-ant/target/junit4-ant-2.5.4-SNAPSHOT.jar <no signer certificates>)
08-May-2018 12:09:15 policy: evaluate principals:
08-May-2018 12:09:15         Policy Principals: []
08-May-2018 12:09:15         Active Principals: []
08-May-2018 12:09:15 policy:   granting ("java.lang.RuntimePermission" "setIO")
08-May-2018 12:09:15 policy: evaluation (codesource/principals) passed
08-May-2018 12:09:15 policy: evaluate codesources:
08-May-2018 12:09:15         Policy CodeSource: (file:/var/atlassian/application-data/bamboo/xml-data/build-dir/RNDTEST-SOFTWARE-JDK18/randomized-runner/target/randomizedtesting-runner-2.5.4-SNAPSHOT.jar <no signer certificates>)
08-May-2018 12:09:15         Active CodeSource: (file:/var/atlassian/application-data/bamboo/xml-data/build-dir/RNDTEST-SOFTWARE-JDK18/junit4-ant/target/junit4-ant-2.5.4-SNAPSHOT.jar <no signer certificates>)
08-May-2018 12:09:15 policy: evaluation (codesource) failed
08-May-2018 12:09:15 policy: evaluate codesources:
08-May-2018 12:09:15         Policy CodeSource: (file:/var/atlassian/application-data/bamboo/.m2/AGENT-61702145/repository/junit/junit/4.10/junit-4.10.jar <no signer certificates>)
08-May-2018 12:09:15         Active CodeSource: (file:/var/atlassian/application-data/bamboo/xml-data/build-dir/RNDTEST-SOFTWARE-JDK18/junit4-ant/target/junit4-ant-2.5.4-SNAPSHOT.jar <no signer certificates>)
08-May-2018 12:09:15 policy: evaluation (codesource) failed
08-May-2018 12:09:15 policy: evaluate codesources:
08-May-2018 12:09:15         Policy CodeSource: (null <no signer certificates>)
08-May-2018 12:09:15         Active CodeSource: (file:/var/atlassian/application-data/bamboo/xml-data/build-dir/RNDTEST-SOFTWARE-JDK18/junit4-ant/target/junit4-ant-2.5.4-SNAPSHOT.jar <no signer certificates>)
08-May-2018 12:09:15 policy: evaluate principals:
08-May-2018 12:09:15         Policy Principals: []
08-May-2018 12:09:15         Active Principals: []
08-May-2018 12:09:15 policy:   granting ("java.util.PropertyPermission" "*" "read")
08-May-2018 12:09:15 policy:   granting ("java.io.FilePermission" "<<ALL FILES>>" "read,write,execute,delete")
08-May-2018 12:09:15 policy: evaluation (codesource/principals) passed
08-May-2018 12:09:15 access: domain 0 ProtectionDomain  (file:/var/atlassian/application-data/bamboo/xml-data/build-dir/RNDTEST-SOFTWARE-JDK18/junit4-ant/target/junit4-ant-2.5.4-SNAPSHOT.jar <no signer certificates>)
08-May-2018 12:09:15 sun.misc.Launcher$AppClassLoader@42a57993
08-May-2018 12:09:15 <no principals>
08-May-2018 12:09:15 java.security.Permissions@b1bc7ed (
08-May-2018 12:09:15 ("java.lang.RuntimePermission" "exitVM")
08-May-2018 12:09:15 ("java.lang.RuntimePermission" "setIO")
08-May-2018 12:09:15 ("java.io.FilePermission" "<<ALL FILES>>" "read,write,execute,delete")
08-May-2018 12:09:15 ("java.io.FilePermission" "/var/atlassian/application-data/bamboo/xml-data/build-dir/RNDTEST-SOFTWARE-JDK18/junit4-ant/target/junit4-ant-2.5.4-SNAPSHOT.jar" "read")
08-May-2018 12:09:15 ("java.util.PropertyPermission" "*" "read")
08-May-2018 12:09:15 )
08-May-2018 12:09:15
08-May-2018 12:09:15
08-May-2018 12:09:15 access: access allowed ("java.util.PropertyPermission" "user.name" "read")
08-May-2018 12:09:15 java.lang.Exception: Stack trace
08-May-2018 12:09:15         at java.lang.Thread.dumpStack(Thread.java:1336)
08-May-2018 12:09:15         at java.security.AccessControlContext.checkPermission(AccessControlContext.java:419)
08-May-2018 12:09:15         at java.security.AccessController.checkPermission(AccessController.java:884)
08-May-2018 12:09:15         at java.lang.SecurityManager.checkPermission(SecurityManager.java:549)
08-May-2018 12:09:15         at java.lang.SecurityManager.checkPropertyAccess(SecurityManager.java:1294)
08-May-2018 12:09:15         at java.lang.System.getProperty(System.java:717)
08-May-2018 12:09:15         at com.carrotsearch.ant.tasks.junit4.events.BootstrapEvent.collectSystemProperties(BootstrapEvent.java:93)
08-May-2018 12:09:15         at com.carrotsearch.ant.tasks.junit4.events.BootstrapEvent.<init>(BootstrapEvent.java:68)
08-May-2018 12:09:15         at com.carrotsearch.ant.tasks.junit4.slave.SlaveMain.main(SlaveMain.java:350)
08-May-2018 12:09:15         at com.carrotsearch.ant.tasks.junit4.slave.SlaveMainSafe.main(SlaveMainSafe.java:13)
08-May-2018 12:09:15 policy: getPermissions:
08-May-2018 12:09:15         PD CodeSource: (file:/var/atlassian/application-data/bamboo/xml-data/build-dir/RNDTEST-SOFTWARE-JDK18/junit4-ant/target/junit4-ant-2.5.4-SNAPSHOT.jar <no signer certificates>)
08-May-2018 12:09:15         PD ClassLoader: sun.misc.Launcher$AppClassLoader@42a57993
08-May-2018 12:09:15         PD Principals: <no principals>
08-May-2018 12:09:15 policy: evaluate codesources:
08-May-2018 12:09:15         Policy CodeSource: (file:/home/bamboo/jvms/oracle-jdk-1.8.0_162/jre/lib/ext/* <no signer certificates>)
08-May-2018 12:09:15         Active CodeSource: (file:/var/atlassian/application-data/bamboo/xml-data/build-dir/RNDTEST-SOFTWARE-JDK18/junit4-ant/target/junit4-ant-2.5.4-SNAPSHOT.jar <no signer certificates>)
08-May-2018 12:09:15 policy: evaluation (codesource) failed
08-May-2018 12:09:15 policy: evaluate codesources:
08-May-2018 12:09:15         Policy CodeSource: (file:/usr/java/packages/lib/ext/* <no signer certificates>)
08-May-2018 12:09:15         Active CodeSource: (file:/var/atlassian/application-data/bamboo/xml-data/build-dir/RNDTEST-SOFTWARE-JDK18/junit4-ant/target/junit4-ant-2.5.4-SNAPSHOT.jar <no signer certificates>)
08-May-2018 12:09:15 policy: evaluation (codesource) failed
08-May-2018 12:09:15 policy: evaluate codesources:
08-May-2018 12:09:15         Policy CodeSource: (file:/var/atlassian/application-data/bamboo/xml-data/build-dir/RNDTEST-SOFTWARE-JDK18/junit4-ant/target/junit4-ant-2.5.4-SNAPSHOT.jar <no signer certificates>)
08-May-2018 12:09:15         Active CodeSource: (file:/var/atlassian/application-data/bamboo/xml-data/build-dir/RNDTEST-SOFTWARE-JDK18/junit4-ant/target/junit4-ant-2.5.4-SNAPSHOT.jar <no signer certificates>)
08-May-2018 12:09:15 policy: evaluate principals:
08-May-2018 12:09:15         Policy Principals: []
08-May-2018 12:09:15         Active Principals: []
08-May-2018 12:09:15 policy:   granting ("java.lang.RuntimePermission" "setIO")
08-May-2018 12:09:15 policy: evaluation (codesource/principals) passed
08-May-2018 12:09:15 policy: evaluate codesources:
08-May-2018 12:09:15         Policy CodeSource: (file:/var/atlassian/application-data/bamboo/xml-data/build-dir/RNDTEST-SOFTWARE-JDK18/randomized-runner/target/randomizedtesting-runner-2.5.4-SNAPSHOT.jar <no signer certificates>)
08-May-2018 12:09:15         Active CodeSource: (file:/var/atlassian/application-data/bamboo/xml-data/build-dir/RNDTEST-SOFTWARE-JDK18/junit4-ant/target/junit4-ant-2.5.4-SNAPSHOT.jar <no signer certificates>)
08-May-2018 12:09:15 policy: evaluation (codesource) failed
08-May-2018 12:09:15 policy: evaluate codesources:
08-May-2018 12:09:15         Policy CodeSource: (file:/var/atlassian/application-data/bamboo/.m2/AGENT-61702145/repository/junit/junit/4.10/junit-4.10.jar <no signer certificates>)
08-May-2018 12:09:15         Active CodeSource: (file:/var/atlassian/application-data/bamboo/xml-data/build-dir/RNDTEST-SOFTWARE-JDK18/junit4-ant/target/junit4-ant-2.5.4-SNAPSHOT.jar <no signer certificates>)
08-May-2018 12:09:15 policy: evaluation (codesource) failed
08-May-2018 12:09:15 policy: evaluate codesources:
08-May-2018 12:09:15         Policy CodeSource: (null <no signer certificates>)
08-May-2018 12:09:15         Active CodeSource: (file:/var/atlassian/application-data/bamboo/xml-data/build-dir/RNDTEST-SOFTWARE-JDK18/junit4-ant/target/junit4-ant-2.5.4-SNAPSHOT.jar <no signer certificates>)
08-May-2018 12:09:15 policy: evaluate principals:
08-May-2018 12:09:15         Policy Principals: []
08-May-2018 12:09:15         Active Principals: []
08-May-2018 12:09:15 policy:   granting ("java.util.PropertyPermission" "*" "read")
08-May-2018 12:09:15 policy:   granting ("java.io.FilePermission" "<<ALL FILES>>" "read,write,execute,delete")
08-May-2018 12:09:15 policy: evaluation (codesource/principals) passed
08-May-2018 12:09:15 access: domain 0 ProtectionDomain  (file:/var/atlassian/application-data/bamboo/xml-data/build-dir/RNDTEST-SOFTWARE-JDK18/junit4-ant/target/junit4-ant-2.5.4-SNAPSHOT.jar <no signer certificates>)
08-May-2018 12:09:15 sun.misc.Launcher$AppClassLoader@42a57993
08-May-2018 12:09:15 <no principals>
08-May-2018 12:09:15 java.security.Permissions@30dae81 (
08-May-2018 12:09:15 ("java.lang.RuntimePermission" "exitVM")
08-May-2018 12:09:15 ("java.lang.RuntimePermission" "setIO")
08-May-2018 12:09:15 ("java.io.FilePermission" "<<ALL FILES>>" "read,write,execute,delete")
08-May-2018 12:09:15 ("java.io.FilePermission" "/var/atlassian/application-data/bamboo/xml-data/build-dir/RNDTEST-SOFTWARE-JDK18/junit4-ant/target/junit4-ant-2.5.4-SNAPSHOT.jar" "read")
08-May-2018 12:09:15 ("java.util.PropertyPermission" "*" "read")
08-May-2018 12:09:15 )
08-May-2018 12:09:15
08-May-2018 12:09:15
08-May-2018 12:09:15 access: access allowed ("java.util.PropertyPermission" "user.home" "read")
08-May-2018 12:09:15 java.lang.Exception: Stack trace
08-May-2018 12:09:15         at java.lang.Thread.dumpStack(Thread.java:1336)
08-May-2018 12:09:15         at java.security.AccessControlContext.checkPermission(AccessControlContext.java:419)
08-May-2018 12:09:15         at java.security.AccessController.checkPermission(AccessController.java:884)
08-May-2018 12:09:15         at java.lang.SecurityManager.checkPermission(SecurityManager.java:549)
08-May-2018 12:09:15         at java.lang.SecurityManager.checkPropertyAccess(SecurityManager.java:1294)
08-May-2018 12:09:15         at java.lang.System.getProperty(System.java:717)
08-May-2018 12:09:15         at com.carrotsearch.ant.tasks.junit4.events.BootstrapEvent.collectSystemProperties(BootstrapEvent.java:93)
08-May-2018 12:09:15         at com.carrotsearch.ant.tasks.junit4.events.BootstrapEvent.<init>(BootstrapEvent.java:68)
08-May-2018 12:09:15         at com.carrotsearch.ant.tasks.junit4.slave.SlaveMain.main(SlaveMain.java:350)
08-May-2018 12:09:15         at com.carrotsearch.ant.tasks.junit4.slave.SlaveMainSafe.main(SlaveMainSafe.java:13)
08-May-2018 12:09:15 policy: getPermissions:
08-May-2018 12:09:15         PD CodeSource: (file:/var/atlassian/application-data/bamboo/xml-data/build-dir/RNDTEST-SOFTWARE-JDK18/junit4-ant/target/junit4-ant-2.5.4-SNAPSHOT.jar <no signer certificates>)
08-May-2018 12:09:15         PD ClassLoader: sun.misc.Launcher$AppClassLoader@42a57993
08-May-2018 12:09:15         PD Principals: <no principals>
08-May-2018 12:09:15 policy: evaluate codesources:
08-May-2018 12:09:15         Policy CodeSource: (file:/home/bamboo/jvms/oracle-jdk-1.8.0_162/jre/lib/ext/* <no signer certificates>)
08-May-2018 12:09:15         Active CodeSource: (file:/var/atlassian/application-data/bamboo/xml-data/build-dir/RNDTEST-SOFTWARE-JDK18/junit4-ant/target/junit4-ant-2.5.4-SNAPSHOT.jar <no signer certificates>)
08-May-2018 12:09:15 policy: evaluation (codesource) failed
08-May-2018 12:09:15 policy: evaluate codesources:
08-May-2018 12:09:15         Policy CodeSource: (file:/usr/java/packages/lib/ext/* <no signer certificates>)
08-May-2018 12:09:15         Active CodeSource: (file:/var/atlassian/application-data/bamboo/xml-data/build-dir/RNDTEST-SOFTWARE-JDK18/junit4-ant/target/junit4-ant-2.5.4-SNAPSHOT.jar <no signer certificates>)
08-May-2018 12:09:15 policy: evaluation (codesource) failed
08-May-2018 12:09:15 policy: evaluate codesources:
08-May-2018 12:09:15         Policy CodeSource: (file:/var/atlassian/application-data/bamboo/xml-data/build-dir/RNDTEST-SOFTWARE-JDK18/junit4-ant/target/junit4-ant-2.5.4-SNAPSHOT.jar <no signer certificates>)
08-May-2018 12:09:15         Active CodeSource: (file:/var/atlassian/application-data/bamboo/xml-data/build-dir/RNDTEST-SOFTWARE-JDK18/junit4-ant/target/junit4-ant-2.5.4-SNAPSHOT.jar <no signer certificates>)
08-May-2018 12:09:15 policy: evaluate principals:
08-May-2018 12:09:15         Policy Principals: []
08-May-2018 12:09:15         Active Principals: []
08-May-2018 12:09:15 policy:   granting ("java.lang.RuntimePermission" "setIO")
08-May-2018 12:09:15 policy: evaluation (codesource/principals) passed
08-May-2018 12:09:15 policy: evaluate codesources:
08-May-2018 12:09:15         Policy CodeSource: (file:/var/atlassian/application-data/bamboo/xml-data/build-dir/RNDTEST-SOFTWARE-JDK18/randomized-runner/target/randomizedtesting-runner-2.5.4-SNAPSHOT.jar <no signer certificates>)
08-May-2018 12:09:15         Active CodeSource: (file:/var/atlassian/application-data/bamboo/xml-data/build-dir/RNDTEST-SOFTWARE-JDK18/junit4-ant/target/junit4-ant-2.5.4-SNAPSHOT.jar <no signer certificates>)
08-May-2018 12:09:15 policy: evaluation (codesource) failed
08-May-2018 12:09:15 policy: evaluate codesources:
08-May-2018 12:09:15         Policy CodeSource: (file:/var/atlassian/application-data/bamboo/.m2/AGENT-61702145/repository/junit/junit/4.10/junit-4.10.jar <no signer certificates>)
08-May-2018 12:09:15         Active CodeSource: (file:/var/atlassian/application-data/bamboo/xml-data/build-dir/RNDTEST-SOFTWARE-JDK18/junit4-ant/target/junit4-ant-2.5.4-SNAPSHOT.jar <no signer certificates>)
08-May-2018 12:09:15 policy: evaluation (codesource) failed
08-May-2018 12:09:15 policy: evaluate codesources:
08-May-2018 12:09:15         Policy CodeSource: (null <no signer certificates>)
08-May-2018 12:09:15         Active CodeSource: (file:/var/atlassian/application-data/bamboo/xml-data/build-dir/RNDTEST-SOFTWARE-JDK18/junit4-ant/target/junit4-ant-2.5.4-SNAPSHOT.jar <no signer certificates>)
08-May-2018 12:09:15 policy: evaluate principals:
08-May-2018 12:09:15         Policy Principals: []
08-May-2018 12:09:15         Active Principals: []
08-May-2018 12:09:15 policy:   granting ("java.util.PropertyPermission" "*" "read")
08-May-2018 12:09:15 policy:   granting ("java.io.FilePermission" "<<ALL FILES>>" "read,write,execute,delete")
08-May-2018 12:09:15 policy: evaluation (codesource/principals) passed
08-May-2018 12:09:15 access: domain 0 ProtectionDomain  (file:/var/atlassian/application-data/bamboo/xml-data/build-dir/RNDTEST-SOFTWARE-JDK18/junit4-ant/target/junit4-ant-2.5.4-SNAPSHOT.jar <no signer certificates>)
08-May-2018 12:09:15 sun.misc.Launcher$AppClassLoader@42a57993
08-May-2018 12:09:15 <no principals>
08-May-2018 12:09:15 java.security.Permissions@4edde6e5 (
08-May-2018 12:09:15 ("java.lang.RuntimePermission" "exitVM")
08-May-2018 12:09:15 ("java.lang.RuntimePermission" "setIO")
08-May-2018 12:09:15 ("java.io.FilePermission" "<<ALL FILES>>" "read,write,execute,delete")
08-May-2018 12:09:15 ("java.io.FilePermission" "/var/atlassian/application-data/bamboo/xml-data/build-dir/RNDTEST-SOFTWARE-JDK18/junit4-ant/target/junit4-ant-2.5.4-SNAPSHOT.jar" "read")
08-May-2018 12:09:15 ("java.util.PropertyPermission" "*" "read")
08-May-2018 12:09:15 )
08-May-2018 12:09:15
08-May-2018 12:09:15
08-May-2018 12:09:15 access: access allowed ("java.util.PropertyPermission" "user.dir" "read")
08-May-2018 12:09:15 java.lang.Exception: Stack trace
08-May-2018 12:09:15         at java.lang.Thread.dumpStack(Thread.java:1336)
08-May-2018 12:09:15         at java.security.AccessControlContext.checkPermission(AccessControlContext.java:419)
08-May-2018 12:09:15         at java.security.AccessController.checkPermission(AccessController.java:884)
08-May-2018 12:09:15         at java.lang.SecurityManager.checkPermission(SecurityManager.java:549)
08-May-2018 12:09:15         at java.lang.System.checkIO(System.java:253)
08-May-2018 12:09:15         at java.lang.System.setOut(System.java:175)
08-May-2018 12:09:15         at com.carrotsearch.ant.tasks.junit4.slave.SlaveMain$3.run(SlaveMain.java:455)
08-May-2018 12:09:15         at com.carrotsearch.ant.tasks.junit4.slave.SlaveMain$3.run(SlaveMain.java:451)
08-May-2018 12:09:15         at java.security.AccessController.doPrivileged(Native Method)
08-May-2018 12:09:15         at com.carrotsearch.ant.tasks.junit4.slave.SlaveMain.redirectStreams(SlaveMain.java:451)
08-May-2018 12:09:15         at com.carrotsearch.ant.tasks.junit4.slave.SlaveMain.main(SlaveMain.java:355)
08-May-2018 12:09:15         at com.carrotsearch.ant.tasks.junit4.slave.SlaveMainSafe.main(SlaveMainSafe.java:13)
08-May-2018 12:09:15 policy: getPermissions:
08-May-2018 12:09:15         PD CodeSource: (file:/var/atlassian/application-data/bamboo/xml-data/build-dir/RNDTEST-SOFTWARE-JDK18/junit4-ant/target/junit4-ant-2.5.4-SNAPSHOT.jar <no signer certificates>)
08-May-2018 12:09:15         PD ClassLoader: sun.misc.Launcher$AppClassLoader@42a57993
08-May-2018 12:09:15         PD Principals: <no principals>
08-May-2018 12:09:15 policy: evaluate codesources:
08-May-2018 12:09:15         Policy CodeSource: (file:/home/bamboo/jvms/oracle-jdk-1.8.0_162/jre/lib/ext/* <no signer certificates>)
08-May-2018 12:09:15         Active CodeSource: (file:/var/atlassian/application-data/bamboo/xml-data/build-dir/RNDTEST-SOFTWARE-JDK18/junit4-ant/target/junit4-ant-2.5.4-SNAPSHOT.jar <no signer certificates>)
08-May-2018 12:09:15 policy: evaluation (codesource) failed
08-May-2018 12:09:15 policy: evaluate codesources:
08-May-2018 12:09:15         Policy CodeSource: (file:/usr/java/packages/lib/ext/* <no signer certificates>)
08-May-2018 12:09:15         Active CodeSource: (file:/var/atlassian/application-data/bamboo/xml-data/build-dir/RNDTEST-SOFTWARE-JDK18/junit4-ant/target/junit4-ant-2.5.4-SNAPSHOT.jar <no signer certificates>)
08-May-2018 12:09:15 policy: evaluation (codesource) failed
08-May-2018 12:09:15 policy: evaluate codesources:
08-May-2018 12:09:15         Policy CodeSource: (file:/var/atlassian/application-data/bamboo/xml-data/build-dir/RNDTEST-SOFTWARE-JDK18/junit4-ant/target/junit4-ant-2.5.4-SNAPSHOT.jar <no signer certificates>)
08-May-2018 12:09:15         Active CodeSource: (file:/var/atlassian/application-data/bamboo/xml-data/build-dir/RNDTEST-SOFTWARE-JDK18/junit4-ant/target/junit4-ant-2.5.4-SNAPSHOT.jar <no signer certificates>)
08-May-2018 12:09:15 policy: evaluate principals:
08-May-2018 12:09:15         Policy Principals: []
08-May-2018 12:09:15         Active Principals: []
08-May-2018 12:09:15 policy:   granting ("java.lang.RuntimePermission" "setIO")
08-May-2018 12:09:15 policy: evaluation (codesource/principals) passed
08-May-2018 12:09:15 policy: evaluate codesources:
08-May-2018 12:09:15         Policy CodeSource: (file:/var/atlassian/application-data/bamboo/xml-data/build-dir/RNDTEST-SOFTWARE-JDK18/randomized-runner/target/randomizedtesting-runner-2.5.4-SNAPSHOT.jar <no signer certificates>)
08-May-2018 12:09:15         Active CodeSource: (file:/var/atlassian/application-data/bamboo/xml-data/build-dir/RNDTEST-SOFTWARE-JDK18/junit4-ant/target/junit4-ant-2.5.4-SNAPSHOT.jar <no signer certificates>)
08-May-2018 12:09:15 policy: evaluation (codesource) failed
08-May-2018 12:09:15 policy: evaluate codesources:
08-May-2018 12:09:15         Policy CodeSource: (file:/var/atlassian/application-data/bamboo/.m2/AGENT-61702145/repository/junit/junit/4.10/junit-4.10.jar <no signer certificates>)
08-May-2018 12:09:15         Active CodeSource: (file:/var/atlassian/application-data/bamboo/xml-data/build-dir/RNDTEST-SOFTWARE-JDK18/junit4-ant/target/junit4-ant-2.5.4-SNAPSHOT.jar <no signer certificates>)
08-May-2018 12:09:15 policy: evaluation (codesource) failed
08-May-2018 12:09:15 policy: evaluate codesources:
08-May-2018 12:09:15         Policy CodeSource: (null <no signer certificates>)
08-May-2018 12:09:15         Active CodeSource: (file:/var/atlassian/application-data/bamboo/xml-data/build-dir/RNDTEST-SOFTWARE-JDK18/junit4-ant/target/junit4-ant-2.5.4-SNAPSHOT.jar <no signer certificates>)
08-May-2018 12:09:15 policy: evaluate principals:
08-May-2018 12:09:15         Policy Principals: []
08-May-2018 12:09:15         Active Principals: []
08-May-2018 12:09:15 policy:   granting ("java.util.PropertyPermission" "*" "read")
08-May-2018 12:09:15 policy:   granting ("java.io.FilePermission" "<<ALL FILES>>" "read,write,execute,delete")
08-May-2018 12:09:15 policy: evaluation (codesource/principals) passed
08-May-2018 12:09:15 access: domain 0 ProtectionDomain  (file:/var/atlassian/application-data/bamboo/xml-data/build-dir/RNDTEST-SOFTWARE-JDK18/junit4-ant/target/junit4-ant-2.5.4-SNAPSHOT.jar <no signer certificates>)
08-May-2018 12:09:15 sun.misc.Launcher$AppClassLoader@42a57993
08-May-2018 12:09:15 <no principals>
08-May-2018 12:09:15 java.security.Permissions@5e9f23b4 (
08-May-2018 12:09:15 ("java.lang.RuntimePermission" "exitVM")
08-May-2018 12:09:15 ("java.lang.RuntimePermission" "setIO")
08-May-2018 12:09:15 ("java.io.FilePermission" "<<ALL FILES>>" "read,write,execute,delete")
08-May-2018 12:09:15 ("java.io.FilePermission" "/var/atlassian/application-data/bamboo/xml-data/build-dir/RNDTEST-SOFTWARE-JDK18/junit4-ant/target/junit4-ant-2.5.4-SNAPSHOT.jar" "read")
08-May-2018 12:09:15 ("java.util.PropertyPermission" "*" "read")
08-May-2018 12:09:15 )
08-May-2018 12:09:15
08-May-2018 12:09:15
08-May-2018 12:09:15 access: access allowed ("java.lang.RuntimePermission" "setIO")
08-May-2018 12:09:15 java.lang.Exception: Stack trace
08-May-2018 12:09:15         at java.lang.Thread.dumpStack(Thread.java:1336)
08-May-2018 12:09:15         at java.security.AccessControlContext.checkPermission(AccessControlContext.java:419)
08-May-2018 12:09:15         at java.security.AccessController.checkPermission(AccessController.java:884)
08-May-2018 12:09:15         at java.lang.SecurityManager.checkPermission(SecurityManager.java:549)
08-May-2018 12:09:15         at java.lang.System.checkIO(System.java:253)
08-May-2018 12:09:15         at java.lang.System.setErr(System.java:199)
08-May-2018 12:09:15         at com.carrotsearch.ant.tasks.junit4.slave.SlaveMain$3.run(SlaveMain.java:466)
08-May-2018 12:09:15         at com.carrotsearch.ant.tasks.junit4.slave.SlaveMain$3.run(SlaveMain.java:451)
08-May-2018 12:09:15         at java.security.AccessController.doPrivileged(Native Method)
08-May-2018 12:09:15         at com.carrotsearch.ant.tasks.junit4.slave.SlaveMain.redirectStreams(SlaveMain.java:451)
08-May-2018 12:09:15         at com.carrotsearch.ant.tasks.junit4.slave.SlaveMain.main(SlaveMain.java:355)
08-May-2018 12:09:15         at com.carrotsearch.ant.tasks.junit4.slave.SlaveMainSafe.main(SlaveMainSafe.java:13)
08-May-2018 12:09:15 policy: getPermissions:
08-May-2018 12:09:15         PD CodeSource: (file:/var/atlassian/application-data/bamboo/xml-data/build-dir/RNDTEST-SOFTWARE-JDK18/junit4-ant/target/junit4-ant-2.5.4-SNAPSHOT.jar <no signer certificates>)
08-May-2018 12:09:15         PD ClassLoader: sun.misc.Launcher$AppClassLoader@42a57993
08-May-2018 12:09:15         PD Principals: <no principals>
08-May-2018 12:09:15 policy: evaluate codesources:
08-May-2018 12:09:15         Policy CodeSource: (file:/home/bamboo/jvms/oracle-jdk-1.8.0_162/jre/lib/ext/* <no signer certificates>)
08-May-2018 12:09:15         Active CodeSource: (file:/var/atlassian/application-data/bamboo/xml-data/build-dir/RNDTEST-SOFTWARE-JDK18/junit4-ant/target/junit4-ant-2.5.4-SNAPSHOT.jar <no signer certificates>)
08-May-2018 12:09:15 policy: evaluation (codesource) failed
08-May-2018 12:09:15 policy: evaluate codesources:
08-May-2018 12:09:15         Policy CodeSource: (file:/usr/java/packages/lib/ext/* <no signer certificates>)
08-May-2018 12:09:15         Active CodeSource: (file:/var/atlassian/application-data/bamboo/xml-data/build-dir/RNDTEST-SOFTWARE-JDK18/junit4-ant/target/junit4-ant-2.5.4-SNAPSHOT.jar <no signer certificates>)
08-May-2018 12:09:15 policy: evaluation (codesource) failed
08-May-2018 12:09:15 policy: evaluate codesources:
08-May-2018 12:09:15         Policy CodeSource: (file:/var/atlassian/application-data/bamboo/xml-data/build-dir/RNDTEST-SOFTWARE-JDK18/junit4-ant/target/junit4-ant-2.5.4-SNAPSHOT.jar <no signer certificates>)
08-May-2018 12:09:15         Active CodeSource: (file:/var/atlassian/application-data/bamboo/xml-data/build-dir/RNDTEST-SOFTWARE-JDK18/junit4-ant/target/junit4-ant-2.5.4-SNAPSHOT.jar <no signer certificates>)
08-May-2018 12:09:15 policy: evaluate principals:
08-May-2018 12:09:15         Policy Principals: []
08-May-2018 12:09:15         Active Principals: []
08-May-2018 12:09:15 policy:   granting ("java.lang.RuntimePermission" "setIO")
08-May-2018 12:09:15 policy: evaluation (codesource/principals) passed
08-May-2018 12:09:15 policy: evaluate codesources:
08-May-2018 12:09:15         Policy CodeSource: (file:/var/atlassian/application-data/bamboo/xml-data/build-dir/RNDTEST-SOFTWARE-JDK18/randomized-runner/target/randomizedtesting-runner-2.5.4-SNAPSHOT.jar <no signer certificates>)
08-May-2018 12:09:15         Active CodeSource: (file:/var/atlassian/application-data/bamboo/xml-data/build-dir/RNDTEST-SOFTWARE-JDK18/junit4-ant/target/junit4-ant-2.5.4-SNAPSHOT.jar <no signer certificates>)
08-May-2018 12:09:15 policy: evaluation (codesource) failed
08-May-2018 12:09:15 policy: evaluate codesources:
08-May-2018 12:09:15         Policy CodeSource: (file:/var/atlassian/application-data/bamboo/.m2/AGENT-61702145/repository/junit/junit/4.10/junit-4.10.jar <no signer certificates>)
08-May-2018 12:09:15         Active CodeSource: (file:/var/atlassian/application-data/bamboo/xml-data/build-dir/RNDTEST-SOFTWARE-JDK18/junit4-ant/target/junit4-ant-2.5.4-SNAPSHOT.jar <no signer certificates>)
08-May-2018 12:09:15 policy: evaluation (codesource) failed
08-May-2018 12:09:15 policy: evaluate codesources:
08-May-2018 12:09:15         Policy CodeSource: (null <no signer certificates>)
08-May-2018 12:09:15         Active CodeSource: (file:/var/atlassian/application-data/bamboo/xml-data/build-dir/RNDTEST-SOFTWARE-JDK18/junit4-ant/target/junit4-ant-2.5.4-SNAPSHOT.jar <no signer certificates>)
08-May-2018 12:09:15 policy: evaluate principals:
08-May-2018 12:09:15         Policy Principals: []
08-May-2018 12:09:15         Active Principals: []
08-May-2018 12:09:15 policy:   granting ("java.util.PropertyPermission" "*" "read")
08-May-2018 12:09:15 policy:   granting ("java.io.FilePermission" "<<ALL FILES>>" "read,write,execute,delete")
08-May-2018 12:09:15 policy: evaluation (codesource/principals) passed
08-May-2018 12:09:15 access: domain 0 ProtectionDomain  (file:/var/atlassian/application-data/bamboo/xml-data/build-dir/RNDTEST-SOFTWARE-JDK18/junit4-ant/target/junit4-ant-2.5.4-SNAPSHOT.jar <no signer certificates>)
08-May-2018 12:09:15 sun.misc.Launcher$AppClassLoader@42a57993
08-May-2018 12:09:15 <no principals>
08-May-2018 12:09:15 java.security.Permissions@378fd1ac (
08-May-2018 12:09:15 ("java.lang.RuntimePermission" "exitVM")
08-May-2018 12:09:15 ("java.lang.RuntimePermission" "setIO")
08-May-2018 12:09:15 ("java.io.FilePermission" "<<ALL FILES>>" "read,write,execute,delete")
08-May-2018 12:09:15 ("java.io.FilePermission" "/var/atlassian/application-data/bamboo/xml-data/build-dir/RNDTEST-SOFTWARE-JDK18/junit4-ant/target/junit4-ant-2.5.4-SNAPSHOT.jar" "read")
08-May-2018 12:09:15 ("java.util.PropertyPermission" "*" "read")
08-May-2018 12:09:15 )
08-May-2018 12:09:15
08-May-2018 12:09:15
08-May-2018 12:09:15 access: access allowed ("java.lang.RuntimePermission" "setIO")
08-May-2018 12:09:15 [INFO] <<< JVM J0: EOF ----
08-May-2018 12:09:15 [INFO] JVM J0:     0.29 ..     0.80 =     0.51s
08-May-2018 12:09:15 [INFO] Execution time total: 0.81 sec.
08-May-2018 12:09:15 [INFO] Tests summary: 1 suite, 2 tests
08-May-2018 12:09:15 [INFO] ------------------------------------------------------------------------
08-May-2018 12:09:15 [INFO] Reactor Summary:
08-May-2018 12:09:15 [INFO]
08-May-2018 12:09:15 [INFO] RandomizedTesting Parent POM ....................... SUCCESS [  0.698 s]
08-May-2018 12:09:15 [INFO] RandomizedTesting Randomized Runner ................ SUCCESS [ 28.277 s]
08-May-2018 12:09:15 [INFO] RandomizedTesting JUnit4 ANT Task .................. SUCCESS [01:43 min]
08-May-2018 12:09:15 [INFO] RandomizedTesting JUnit4 Maven Plugin .............. SUCCESS [  1.677 s]
08-May-2018 12:09:15 [INFO] RandomizedTesting JUnit4 Maven Plugin Tests ........ SUCCESS [  9.283 s]
08-May-2018 12:09:15 [INFO] RandomizedTesting Examples ......................... SUCCESS [  7.336 s]
08-May-2018 12:09:15 [INFO] RandomizedTesting ANT Examples ..................... SUCCESS [  8.166 s]
08-May-2018 12:09:15 [INFO] RandomizedTesting Security Manager Example ......... SUCCESS [  1.086 s]
08-May-2018 12:09:15 [INFO] ------------------------------------------------------------------------
08-May-2018 12:09:15 [INFO] BUILD SUCCESS
08-May-2018 12:09:15 [INFO] ------------------------------------------------------------------------
08-May-2018 12:09:15 [INFO] Total time: 02:40 min
08-May-2018 12:09:15 [INFO] Finished at: 2018-05-08T12:09:15+02:00
08-May-2018 12:09:15 [INFO] Final Memory: 60M/1591M
08-May-2018 12:09:15 [INFO] ------------------------------------------------------------------------
08-May-2018 12:09:15 Parsing test results under /var/atlassian/application-data/bamboo/xml-data/build-dir/RNDTEST-SOFTWARE-JDK18...
08-May-2018 12:09:15 Finished task 'Maven 3.x' with result: Success
08-May-2018 12:09:15 Running post build plugin 'NCover Results Collector'
08-May-2018 12:09:15 Running post build plugin 'Artifact Copier'
08-May-2018 12:09:15 Running post build plugin 'npm Cache Cleanup'
08-May-2018 12:09:15 Running post build plugin 'Clover Results Collector'
08-May-2018 12:09:15 Running post build plugin 'Docker Container Cleanup'
08-May-2018 12:09:15 Finalising the build...
08-May-2018 12:09:15 Stopping timer.
08-May-2018 12:09:15 Build RNDTEST-SOFTWARE-JDK18-187 completed.
08-May-2018 12:09:15 Running on server: post build plugin 'NCover Results Collector'
08-May-2018 12:09:15 Running on server: post build plugin 'Build Hanging Detection Configuration'
08-May-2018 12:09:15 Running on server: post build plugin 'Clover Delta Calculator'
08-May-2018 12:09:15 Running on server: post build plugin 'Maven Dependencies Postprocessor'
08-May-2018 12:09:15 All post build plugins have finished
08-May-2018 12:09:15 Generating build results summary...
08-May-2018 12:09:19 Saving build results to disk...
08-May-2018 12:09:19 Logging substituted variables...
08-May-2018 12:09:19 Indexing build results...
08-May-2018 12:09:19 Finished building RNDTEST-SOFTWARE-JDK18-187.