Build #164

Build: #164 failed

Job: JDK 1.8 failed

Stages & jobs

  1. Compile and test

  2. Package

Job result summary

Completed
Duration
1 minute
Revision
4cb0fc801273effbbf02b6499d3728afd6bde7db 4cb0fc801273effbbf02b6499d3728afd6bde7db
Total tests
2648
Fixed in
#166 (Code changes detected)

Tests

  • 2,648 tests in total
  • 62 tests failed
  • 62 failures are new
  • 1 minute taken in total.
New test failures 62
Status Test Duration
Collapse Failed TestChildVmSysprops sysprops History
< 1 sec
org.apache.tools.ant.BuildException: At least one slave process threw an exception, first: Cwd of a forked JVM already exists and is not empty and setOnNonEmptyWorkDirectory=FAIL: [/mnt/work/bamboo-home/xml-data/build-dir/RNDTEST-SOFTWARE-JDK18/junit4-ant/target/test-classes/J0/cwdconflict.tmp]
	at com.carrotsearch.ant.tasks.junit4.it.TestChildVmSysprops.sysprops(TestChildVmSysprops.java:10)
Caused by: org.apache.tools.ant.BuildException: Cwd of a forked JVM already exists and is not empty and setOnNonEmptyWorkDirectory=FAIL: [/mnt/work/bamboo-home/xml-data/build-dir/RNDTEST-SOFTWARE-JDK18/junit4-ant/target/test-classes/J0/cwdconflict.tmp]
Collapse Failed TestCrashesAndExceptions jvmcrash History
< 1 sec
java.lang.AssertionError: 
Expected: a string containing "was not empty, see:"
     got: "At least one slave process threw an exception, first: Cwd of a forked JVM already exists and is not empty and setOnNonEmptyWorkDirectory=FAIL: [/mnt/work/bamboo-home/xml-data/build-dir/RNDTEST-SOFTWARE-JDK18/junit4-ant/target/test-classes/J0/cwdconflict.tmp]"

java.lang.AssertionError: 

Expected: a string containing "was not empty, see:"
     got: "At least one slave process threw an exception, first: Cwd of a forked JVM already exists and is not empty and setOnNonEmptyWorkDirectory=FAIL: [/mnt/work/bamboo-home/xml-data/build-dir/RNDTEST-SOFTWARE-JDK18/junit4-ant/target/test-classes/J0/cwdconflict.tmp]"
(2 more lines...)
Collapse Failed TestCrashesAndExceptions slavehanging History
< 1 sec
org.apache.tools.ant.BuildException: At least one slave process threw an exception, first: Cwd of a forked JVM already exists and is not empty and setOnNonEmptyWorkDirectory=FAIL: [/mnt/work/bamboo-home/xml-data/build-dir/RNDTEST-SOFTWARE-JDK18/junit4-ant/target/test-classes/J0/cwdconflict.tmp]
	at com.carrotsearch.ant.tasks.junit4.it.TestCrashesAndExceptions.slavehanging(TestCrashesAndExceptions.java:12)
Caused by: org.apache.tools.ant.BuildException: Cwd of a forked JVM already exists and is not empty and setOnNonEmptyWorkDirectory=FAIL: [/mnt/work/bamboo-home/xml-data/build-dir/RNDTEST-SOFTWARE-JDK18/junit4-ant/target/test-classes/J0/cwdconflict.tmp]
Collapse Failed TestDuplicateResourceCollections duplicateResourceCollectionEntries History
< 1 sec
org.apache.tools.ant.BuildException: At least one slave process threw an exception, first: Cwd of a forked JVM already exists and is not empty and setOnNonEmptyWorkDirectory=FAIL: [/mnt/work/bamboo-home/xml-data/build-dir/RNDTEST-SOFTWARE-JDK18/junit4-ant/target/test-classes/J0/cwdconflict.tmp]
	at com.carrotsearch.ant.tasks.junit4.it.TestDuplicateResourceCollections.duplicateResourceCollectionEntries(TestDuplicateResourceCollections.java:10)
Caused by: org.apache.tools.ant.BuildException: Cwd of a forked JVM already exists and is not empty and setOnNonEmptyWorkDirectory=FAIL: [/mnt/work/bamboo-home/xml-data/build-dir/RNDTEST-SOFTWARE-JDK18/junit4-ant/target/test-classes/J0/cwdconflict.tmp]
Collapse Failed TestFileEncodings checkTypicalEncodings History
< 1 sec
org.apache.tools.ant.BuildException: The following error occurred while executing this line:
/mnt/work/bamboo-home/xml-data/build-dir/RNDTEST-SOFTWARE-JDK18/junit4-ant/target/test-classes/junit4.xml:921: At least one slave process threw an exception, first: Cwd of a forked JVM already exists and is not empty and setOnNonEmptyWorkDirectory=FAIL: [/mnt/work/bamboo-home/xml-data/build-dir/RNDTEST-SOFTWARE-JDK18/junit4-ant/target/test-classes/J0/cwdconflict.tmp]
org.apache.tools.ant.BuildException: 
The following error occurred while executing this line:
/mnt/work/bamboo-home/xml-data/build-dir/RNDTEST-SOFTWARE-JDK18/junit4-ant/target/test-classes/junit4.xml:921: At least one slave process threw an exception, first: Cwd of a forked JVM already exists and is not empty and setOnNonEmptyWorkDirectory=FAIL: [/mnt/work/bamboo-home/xml-data/build-dir/RNDTEST-SOFTWARE-JDK18/junit4-ant/target/test-classes/J0/cwdconflict.tmp]
	at com.carrotsearch.ant.tasks.junit4.it.TestFileEncodings.checkTypicalEncodings(TestFileEncodings.java:14)
Caused by: org.apache.tools.ant.BuildException: At least one slave process threw an exception, first: Cwd of a forked JVM already exists and is not empty and setOnNonEmptyWorkDirectory=FAIL: [/mnt/work/bamboo-home/xml-data/build-dir/RNDTEST-SOFTWARE-JDK18/junit4-ant/target/test-classes/J0/cwdconflict.tmp]
	at com.carrotsearch.ant.tasks.junit4.it.TestFileEncodings.checkTypicalEncodings(TestFileEncodings.java:14)
(1 more lines...)
Collapse Failed TestFiltering classfilter History
< 1 sec
org.apache.tools.ant.BuildException: At least one slave process threw an exception, first: Cwd of a forked JVM already exists and is not empty and setOnNonEmptyWorkDirectory=FAIL: [/mnt/work/bamboo-home/xml-data/build-dir/RNDTEST-SOFTWARE-JDK18/junit4-ant/target/test-classes/J0/cwdconflict.tmp]
	at com.carrotsearch.ant.tasks.junit4.it.TestFiltering.classfilter(TestFiltering.java:10)
Caused by: org.apache.tools.ant.BuildException: Cwd of a forked JVM already exists and is not empty and setOnNonEmptyWorkDirectory=FAIL: [/mnt/work/bamboo-home/xml-data/build-dir/RNDTEST-SOFTWARE-JDK18/junit4-ant/target/test-classes/J0/cwdconflict.tmp]
Collapse Failed TestFiltering filterexpression History
< 1 sec
org.apache.tools.ant.BuildException: At least one slave process threw an exception, first: Cwd of a forked JVM already exists and is not empty and setOnNonEmptyWorkDirectory=FAIL: [/mnt/work/bamboo-home/xml-data/build-dir/RNDTEST-SOFTWARE-JDK18/junit4-ant/target/test-classes/J0/cwdconflict.tmp]
	at com.carrotsearch.ant.tasks.junit4.it.TestFiltering.filterexpression(TestFiltering.java:22)
Caused by: org.apache.tools.ant.BuildException: Cwd of a forked JVM already exists and is not empty and setOnNonEmptyWorkDirectory=FAIL: [/mnt/work/bamboo-home/xml-data/build-dir/RNDTEST-SOFTWARE-JDK18/junit4-ant/target/test-classes/J0/cwdconflict.tmp]
Collapse Failed TestFiltering methodfilter History
< 1 sec
org.apache.tools.ant.BuildException: At least one slave process threw an exception, first: Cwd of a forked JVM already exists and is not empty and setOnNonEmptyWorkDirectory=FAIL: [/mnt/work/bamboo-home/xml-data/build-dir/RNDTEST-SOFTWARE-JDK18/junit4-ant/target/test-classes/J0/cwdconflict.tmp]
	at com.carrotsearch.ant.tasks.junit4.it.TestFiltering.methodfilter(TestFiltering.java:16)
Caused by: org.apache.tools.ant.BuildException: Cwd of a forked JVM already exists and is not empty and setOnNonEmptyWorkDirectory=FAIL: [/mnt/work/bamboo-home/xml-data/build-dir/RNDTEST-SOFTWARE-JDK18/junit4-ant/target/test-classes/J0/cwdconflict.tmp]
Collapse Failed TestHeartbeat testHeartbeat History
< 1 sec
org.apache.tools.ant.BuildException: At least one slave process threw an exception, first: Cwd of a forked JVM already exists and is not empty and setOnNonEmptyWorkDirectory=FAIL: [/mnt/work/bamboo-home/xml-data/build-dir/RNDTEST-SOFTWARE-JDK18/junit4-ant/target/test-classes/J0/cwdconflict.tmp]
	at com.carrotsearch.ant.tasks.junit4.it.TestHeartbeat.testHeartbeat(TestHeartbeat.java:12)
Caused by: org.apache.tools.ant.BuildException: Cwd of a forked JVM already exists and is not empty and setOnNonEmptyWorkDirectory=FAIL: [/mnt/work/bamboo-home/xml-data/build-dir/RNDTEST-SOFTWARE-JDK18/junit4-ant/target/test-classes/J0/cwdconflict.tmp]
Collapse Failed TestIfNoTestsOption allFilteredOut History
< 1 sec
java.lang.AssertionError: 
Expected: a string containing "There were no executed tests: 0 suites, 0 tests"
     got: "At least one slave process threw an exception, first: Cwd of a forked JVM already exists and is not empty and setOnNonEmptyWorkDirectory=FAIL: [/mnt/work/bamboo-home/xml-data/build-dir/RNDTEST-SOFTWARE-JDK18/junit4-ant/target/test-classes/J0/cwdconflict.tmp]"

java.lang.AssertionError: 

Expected: a string containing "There were no executed tests: 0 suites, 0 tests"
     got: "At least one slave process threw an exception, first: Cwd of a forked JVM already exists and is not empty and setOnNonEmptyWorkDirectory=FAIL: [/mnt/work/bamboo-home/xml-data/build-dir/RNDTEST-SOFTWARE-JDK18/junit4-ant/target/test-classes/J0/cwdconflict.tmp]"
(2 more lines...)
Collapse Failed TestIfNoTestsOption oneAssumptionIgnored History
< 1 sec
java.lang.AssertionError: 
Expected: a string containing "There were no executed tests: 1 suite, 1 test, 1 ignored"
     got: "At least one slave process threw an exception, first: Cwd of a forked JVM already exists and is not empty and setOnNonEmptyWorkDirectory=FAIL: [/mnt/work/bamboo-home/xml-data/build-dir/RNDTEST-SOFTWARE-JDK18/junit4-ant/target/test-classes/J0/cwdconflict.tmp]"

java.lang.AssertionError: 

Expected: a string containing "There were no executed tests: 1 suite, 1 test, 1 ignored"
     got: "At least one slave process threw an exception, first: Cwd of a forked JVM already exists and is not empty and setOnNonEmptyWorkDirectory=FAIL: [/mnt/work/bamboo-home/xml-data/build-dir/RNDTEST-SOFTWARE-JDK18/junit4-ant/target/test-classes/J0/cwdconflict.tmp]"
(2 more lines...)
Collapse Failed TestIfNoTestsOption oneError History
< 1 sec
java.lang.AssertionError: 
Expected: a string containing "There were test failures: 1 suite, 1 test, 1 error"
     got: "At least one slave process threw an exception, first: Cwd of a forked JVM already exists and is not empty and setOnNonEmptyWorkDirectory=FAIL: [/mnt/work/bamboo-home/xml-data/build-dir/RNDTEST-SOFTWARE-JDK18/junit4-ant/target/test-classes/J0/cwdconflict.tmp]"

java.lang.AssertionError: 

Expected: a string containing "There were test failures: 1 suite, 1 test, 1 error"
     got: "At least one slave process threw an exception, first: Cwd of a forked JVM already exists and is not empty and setOnNonEmptyWorkDirectory=FAIL: [/mnt/work/bamboo-home/xml-data/build-dir/RNDTEST-SOFTWARE-JDK18/junit4-ant/target/test-classes/J0/cwdconflict.tmp]"
(2 more lines...)
Collapse Failed TestIfNoTestsOption oneFailure History
< 1 sec
java.lang.AssertionError: 
Expected: a string containing "There were test failures: 1 suite, 1 test, 1 failure"
     got: "At least one slave process threw an exception, first: Cwd of a forked JVM already exists and is not empty and setOnNonEmptyWorkDirectory=FAIL: [/mnt/work/bamboo-home/xml-data/build-dir/RNDTEST-SOFTWARE-JDK18/junit4-ant/target/test-classes/J0/cwdconflict.tmp]"

java.lang.AssertionError: 

Expected: a string containing "There were test failures: 1 suite, 1 test, 1 failure"
     got: "At least one slave process threw an exception, first: Cwd of a forked JVM already exists and is not empty and setOnNonEmptyWorkDirectory=FAIL: [/mnt/work/bamboo-home/xml-data/build-dir/RNDTEST-SOFTWARE-JDK18/junit4-ant/target/test-classes/J0/cwdconflict.tmp]"
(2 more lines...)
Collapse Failed TestIfNoTestsOption oneIgnored History
< 1 sec
java.lang.AssertionError: 
Expected: a string containing "There were no executed tests: 1 suite, 1 test, 1 ignored"
     got: "At least one slave process threw an exception, first: Cwd of a forked JVM already exists and is not empty and setOnNonEmptyWorkDirectory=FAIL: [/mnt/work/bamboo-home/xml-data/build-dir/RNDTEST-SOFTWARE-JDK18/junit4-ant/target/test-classes/J0/cwdconflict.tmp]"

java.lang.AssertionError: 

Expected: a string containing "There were no executed tests: 1 suite, 1 test, 1 ignored"
     got: "At least one slave process threw an exception, first: Cwd of a forked JVM already exists and is not empty and setOnNonEmptyWorkDirectory=FAIL: [/mnt/work/bamboo-home/xml-data/build-dir/RNDTEST-SOFTWARE-JDK18/junit4-ant/target/test-classes/J0/cwdconflict.tmp]"
(2 more lines...)
Collapse Failed TestIfNoTestsOption oneSuccessfull History
< 1 sec
org.apache.tools.ant.BuildException: At least one slave process threw an exception, first: Cwd of a forked JVM already exists and is not empty and setOnNonEmptyWorkDirectory=FAIL: [/mnt/work/bamboo-home/xml-data/build-dir/RNDTEST-SOFTWARE-JDK18/junit4-ant/target/test-classes/J0/cwdconflict.tmp]
	at com.carrotsearch.ant.tasks.junit4.it.TestIfNoTestsOption.oneSuccessfull(TestIfNoTestsOption.java:25)
Caused by: org.apache.tools.ant.BuildException: Cwd of a forked JVM already exists and is not empty and setOnNonEmptyWorkDirectory=FAIL: [/mnt/work/bamboo-home/xml-data/build-dir/RNDTEST-SOFTWARE-JDK18/junit4-ant/target/test-classes/J0/cwdconflict.tmp]
Collapse Failed TestJvmLogging jvmverbose History
< 1 sec
org.apache.tools.ant.BuildException: At least one slave process threw an exception, first: Cwd of a forked JVM already exists and is not empty and setOnNonEmptyWorkDirectory=FAIL: [/mnt/work/bamboo-home/xml-data/build-dir/RNDTEST-SOFTWARE-JDK18/junit4-ant/target/test-classes/J0/cwdconflict.tmp]
	at com.carrotsearch.ant.tasks.junit4.it.TestJvmLogging.jvmverbose(TestJvmLogging.java:12)
Caused by: org.apache.tools.ant.BuildException: Cwd of a forked JVM already exists and is not empty and setOnNonEmptyWorkDirectory=FAIL: [/mnt/work/bamboo-home/xml-data/build-dir/RNDTEST-SOFTWARE-JDK18/junit4-ant/target/test-classes/J0/cwdconflict.tmp]
Collapse Failed TestJvmLogging sysouts History
< 1 sec
org.apache.tools.ant.BuildException: At least one slave process threw an exception, first: Cwd of a forked JVM already exists and is not empty and setOnNonEmptyWorkDirectory=FAIL: [/mnt/work/bamboo-home/xml-data/build-dir/RNDTEST-SOFTWARE-JDK18/junit4-ant/target/test-classes/J0/cwdconflict.tmp]
	at com.carrotsearch.ant.tasks.junit4.it.TestJvmLogging.sysouts(TestJvmLogging.java:18)
Caused by: org.apache.tools.ant.BuildException: Cwd of a forked JVM already exists and is not empty and setOnNonEmptyWorkDirectory=FAIL: [/mnt/work/bamboo-home/xml-data/build-dir/RNDTEST-SOFTWARE-JDK18/junit4-ant/target/test-classes/J0/cwdconflict.tmp]
Collapse Failed TestMiscJUnit4Attributes afterClassError History
< 1 sec
java.lang.AssertionError: 
Expected: a string containing "1 suite, 1 test, 1 suite-level error"
     got: "At least one slave process threw an exception, first: Cwd of a forked JVM already exists and is not empty and setOnNonEmptyWorkDirectory=FAIL: [/mnt/work/bamboo-home/xml-data/build-dir/RNDTEST-SOFTWARE-JDK18/junit4-ant/target/test-classes/J0/cwdconflict.tmp]"

java.lang.AssertionError: 

Expected: a string containing "1 suite, 1 test, 1 suite-level error"
     got: "At least one slave process threw an exception, first: Cwd of a forked JVM already exists and is not empty and setOnNonEmptyWorkDirectory=FAIL: [/mnt/work/bamboo-home/xml-data/build-dir/RNDTEST-SOFTWARE-JDK18/junit4-ant/target/test-classes/J0/cwdconflict.tmp]"
(2 more lines...)
Collapse Failed TestMiscJUnit4Attributes assertions History
< 1 sec
java.lang.AssertionError: 
Expected: a string containing "There were test failures"
     got: "At least one slave process threw an exception, first: Cwd of a forked JVM already exists and is not empty and setOnNonEmptyWorkDirectory=FAIL: [/mnt/work/bamboo-home/xml-data/build-dir/RNDTEST-SOFTWARE-JDK18/junit4-ant/target/test-classes/J0/cwdconflict.tmp]"

java.lang.AssertionError: 

Expected: a string containing "There were test failures"
     got: "At least one slave process threw an exception, first: Cwd of a forked JVM already exists and is not empty and setOnNonEmptyWorkDirectory=FAIL: [/mnt/work/bamboo-home/xml-data/build-dir/RNDTEST-SOFTWARE-JDK18/junit4-ant/target/test-classes/J0/cwdconflict.tmp]"
(2 more lines...)
Collapse Failed TestMiscJUnit4Attributes balancing History
< 1 sec
org.apache.tools.ant.BuildException: At least one slave process threw an exception, first: Cwd of a forked JVM already exists and is not empty and setOnNonEmptyWorkDirectory=FAIL: [/mnt/work/bamboo-home/xml-data/build-dir/RNDTEST-SOFTWARE-JDK18/junit4-ant/target/test-classes/J0/cwdconflict.tmp]
	at com.carrotsearch.ant.tasks.junit4.it.TestMiscJUnit4Attributes.balancing(TestMiscJUnit4Attributes.java:87)
Caused by: org.apache.tools.ant.BuildException: Cwd of a forked JVM already exists and is not empty and setOnNonEmptyWorkDirectory=FAIL: [/mnt/work/bamboo-home/xml-data/build-dir/RNDTEST-SOFTWARE-JDK18/junit4-ant/target/test-classes/J0/cwdconflict.tmp]
Collapse Failed TestMiscJUnit4Attributes balancing_nohints History
< 1 sec
org.apache.tools.ant.BuildException: At least one slave process threw an exception, first: Cwd of a forked JVM already exists and is not empty and setOnNonEmptyWorkDirectory=FAIL: [/mnt/work/bamboo-home/xml-data/build-dir/RNDTEST-SOFTWARE-JDK18/junit4-ant/target/test-classes/J0/cwdconflict.tmp]
	at com.carrotsearch.ant.tasks.junit4.it.TestMiscJUnit4Attributes.balancing_nohints(TestMiscJUnit4Attributes.java:96)
Caused by: org.apache.tools.ant.BuildException: Cwd of a forked JVM already exists and is not empty and setOnNonEmptyWorkDirectory=FAIL: [/mnt/work/bamboo-home/xml-data/build-dir/RNDTEST-SOFTWARE-JDK18/junit4-ant/target/test-classes/J0/cwdconflict.tmp]
Collapse Failed TestMiscJUnit4Attributes beforeClassError History
< 1 sec
java.lang.AssertionError: 
Expected: a string containing "1 suite, 0 tests, 1 suite-level error"
     got: "At least one slave process threw an exception, first: Cwd of a forked JVM already exists and is not empty and setOnNonEmptyWorkDirectory=FAIL: [/mnt/work/bamboo-home/xml-data/build-dir/RNDTEST-SOFTWARE-JDK18/junit4-ant/target/test-classes/J0/cwdconflict.tmp]"

java.lang.AssertionError: 

Expected: a string containing "1 suite, 0 tests, 1 suite-level error"
     got: "At least one slave process threw an exception, first: Cwd of a forked JVM already exists and is not empty and setOnNonEmptyWorkDirectory=FAIL: [/mnt/work/bamboo-home/xml-data/build-dir/RNDTEST-SOFTWARE-JDK18/junit4-ant/target/test-classes/J0/cwdconflict.tmp]"
(2 more lines...)
Collapse Failed TestMiscJUnit4Attributes hierarchicalSuiteDescription History
< 1 sec
java.lang.AssertionError: 
Expected: a string containing "1 suite, 2 tests, 3 suite-level errors, 1 error"
     got: "At least one slave process threw an exception, first: Cwd of a forked JVM already exists and is not empty and setOnNonEmptyWorkDirectory=FAIL: [/mnt/work/bamboo-home/xml-data/build-dir/RNDTEST-SOFTWARE-JDK18/junit4-ant/target/test-classes/J0/cwdconflict.tmp]"

java.lang.AssertionError: 

Expected: a string containing "1 suite, 2 tests, 3 suite-level errors, 1 error"
     got: "At least one slave process threw an exception, first: Cwd of a forked JVM already exists and is not empty and setOnNonEmptyWorkDirectory=FAIL: [/mnt/work/bamboo-home/xml-data/build-dir/RNDTEST-SOFTWARE-JDK18/junit4-ant/target/test-classes/J0/cwdconflict.tmp]"
(2 more lines...)
Collapse Failed TestMiscJUnit4Attributes ignoredSuite History
< 1 sec
org.apache.tools.ant.BuildException: At least one slave process threw an exception, first: Cwd of a forked JVM already exists and is not empty and setOnNonEmptyWorkDirectory=FAIL: [/mnt/work/bamboo-home/xml-data/build-dir/RNDTEST-SOFTWARE-JDK18/junit4-ant/target/test-classes/J0/cwdconflict.tmp]
	at com.carrotsearch.ant.tasks.junit4.it.TestMiscJUnit4Attributes.ignoredSuite(TestMiscJUnit4Attributes.java:24)
Caused by: org.apache.tools.ant.BuildException: Cwd of a forked JVM already exists and is not empty and setOnNonEmptyWorkDirectory=FAIL: [/mnt/work/bamboo-home/xml-data/build-dir/RNDTEST-SOFTWARE-JDK18/junit4-ant/target/test-classes/J0/cwdconflict.tmp]
Collapse Failed TestMiscJUnit4Attributes jvmarg History
< 1 sec
org.apache.tools.ant.BuildException: At least one slave process threw an exception, first: Cwd of a forked JVM already exists and is not empty and setOnNonEmptyWorkDirectory=FAIL: [/mnt/work/bamboo-home/xml-data/build-dir/RNDTEST-SOFTWARE-JDK18/junit4-ant/target/test-classes/J0/cwdconflict.tmp]
	at com.carrotsearch.ant.tasks.junit4.it.TestMiscJUnit4Attributes.jvmarg(TestMiscJUnit4Attributes.java:60)
Caused by: org.apache.tools.ant.BuildException: Cwd of a forked JVM already exists and is not empty and setOnNonEmptyWorkDirectory=FAIL: [/mnt/work/bamboo-home/xml-data/build-dir/RNDTEST-SOFTWARE-JDK18/junit4-ant/target/test-classes/J0/cwdconflict.tmp]
Collapse Failed TestMiscJUnit4Attributes maxmem History
< 1 sec
org.apache.tools.ant.BuildException: At least one slave process threw an exception, first: Cwd of a forked JVM already exists and is not empty and setOnNonEmptyWorkDirectory=FAIL: [/mnt/work/bamboo-home/xml-data/build-dir/RNDTEST-SOFTWARE-JDK18/junit4-ant/target/test-classes/J0/cwdconflict.tmp]
	at com.carrotsearch.ant.tasks.junit4.it.TestMiscJUnit4Attributes.maxmem(TestMiscJUnit4Attributes.java:55)
Caused by: org.apache.tools.ant.BuildException: Cwd of a forked JVM already exists and is not empty and setOnNonEmptyWorkDirectory=FAIL: [/mnt/work/bamboo-home/xml-data/build-dir/RNDTEST-SOFTWARE-JDK18/junit4-ant/target/test-classes/J0/cwdconflict.tmp]
Collapse Failed TestMiscJUnit4Attributes mergehints History
2 secs
org.apache.tools.ant.BuildException: At least one slave process threw an exception, first: Cwd of a forked JVM already exists and is not empty and setOnNonEmptyWorkDirectory=FAIL: [/mnt/work/bamboo-home/xml-data/build-dir/RNDTEST-SOFTWARE-JDK18/junit4-ant/target/test-classes/J0/cwdconflict.tmp]
	at com.carrotsearch.ant.tasks.junit4.it.TestMiscJUnit4Attributes.mergehints(TestMiscJUnit4Attributes.java:101)
Caused by: org.apache.tools.ant.BuildException: Cwd of a forked JVM already exists and is not empty and setOnNonEmptyWorkDirectory=FAIL: [/mnt/work/bamboo-home/xml-data/build-dir/RNDTEST-SOFTWARE-JDK18/junit4-ant/target/test-classes/J0/cwdconflict.tmp]
Collapse Failed TestMiscJUnit4Attributes reproducestring History
< 1 sec
org.apache.tools.ant.BuildException: At least one slave process threw an exception, first: Cwd of a forked JVM already exists and is not empty and setOnNonEmptyWorkDirectory=FAIL: [/mnt/work/bamboo-home/xml-data/build-dir/RNDTEST-SOFTWARE-JDK18/junit4-ant/target/test-classes/J0/cwdconflict.tmp]
	at com.carrotsearch.ant.tasks.junit4.it.TestMiscJUnit4Attributes.reproducestring(TestMiscJUnit4Attributes.java:75)
Caused by: org.apache.tools.ant.BuildException: Cwd of a forked JVM already exists and is not empty and setOnNonEmptyWorkDirectory=FAIL: [/mnt/work/bamboo-home/xml-data/build-dir/RNDTEST-SOFTWARE-JDK18/junit4-ant/target/test-classes/J0/cwdconflict.tmp]
Collapse Failed TestMiscJUnit4Attributes seedpassing History
< 1 sec
org.apache.tools.ant.BuildException: At least one slave process threw an exception, first: Cwd of a forked JVM already exists and is not empty and setOnNonEmptyWorkDirectory=FAIL: [/mnt/work/bamboo-home/xml-data/build-dir/RNDTEST-SOFTWARE-JDK18/junit4-ant/target/test-classes/J0/cwdconflict.tmp]
	at com.carrotsearch.ant.tasks.junit4.it.TestMiscJUnit4Attributes.seedpassing(TestMiscJUnit4Attributes.java:65)
Caused by: org.apache.tools.ant.BuildException: Cwd of a forked JVM already exists and is not empty and setOnNonEmptyWorkDirectory=FAIL: [/mnt/work/bamboo-home/xml-data/build-dir/RNDTEST-SOFTWARE-JDK18/junit4-ant/target/test-classes/J0/cwdconflict.tmp]
Collapse Failed TestMiscJUnit4Attributes statuses History
< 1 sec
java.lang.AssertionError: 
Expected: a string containing "1 suite, 5 tests, 1 error, 1 failure, 2 ignored (1 assumption)"
     got: "At least one slave process threw an exception, first: Cwd of a forked JVM already exists and is not empty and setOnNonEmptyWorkDirectory=FAIL: [/mnt/work/bamboo-home/xml-data/build-dir/RNDTEST-SOFTWARE-JDK18/junit4-ant/target/test-classes/J0/cwdconflict.tmp]"

java.lang.AssertionError: 

Expected: a string containing "1 suite, 5 tests, 1 error, 1 failure, 2 ignored (1 assumption)"
     got: "At least one slave process threw an exception, first: Cwd of a forked JVM already exists and is not empty and setOnNonEmptyWorkDirectory=FAIL: [/mnt/work/bamboo-home/xml-data/build-dir/RNDTEST-SOFTWARE-JDK18/junit4-ant/target/test-classes/J0/cwdconflict.tmp]"
(2 more lines...)
Collapse Failed TestOutputCapture outofordersysouts History
< 1 sec
org.apache.tools.ant.BuildException: At least one slave process threw an exception, first: Cwd of a forked JVM already exists and is not empty and setOnNonEmptyWorkDirectory=FAIL: [/mnt/work/bamboo-home/xml-data/build-dir/RNDTEST-SOFTWARE-JDK18/junit4-ant/target/test-classes/J0/cwdconflict.tmp]
	at com.carrotsearch.ant.tasks.junit4.it.TestOutputCapture.outofordersysouts(TestOutputCapture.java:20)
Caused by: org.apache.tools.ant.BuildException: Cwd of a forked JVM already exists and is not empty and setOnNonEmptyWorkDirectory=FAIL: [/mnt/work/bamboo-home/xml-data/build-dir/RNDTEST-SOFTWARE-JDK18/junit4-ant/target/test-classes/J0/cwdconflict.tmp]
Collapse Failed TestOutputCapture staticScopeOutput History
< 1 sec
org.apache.tools.ant.BuildException: At least one slave process threw an exception, first: Cwd of a forked JVM already exists and is not empty and setOnNonEmptyWorkDirectory=FAIL: [/mnt/work/bamboo-home/xml-data/build-dir/RNDTEST-SOFTWARE-JDK18/junit4-ant/target/test-classes/J0/cwdconflict.tmp]
	at com.carrotsearch.ant.tasks.junit4.it.TestOutputCapture.staticScopeOutput(TestOutputCapture.java:25)
Caused by: org.apache.tools.ant.BuildException: Cwd of a forked JVM already exists and is not empty and setOnNonEmptyWorkDirectory=FAIL: [/mnt/work/bamboo-home/xml-data/build-dir/RNDTEST-SOFTWARE-JDK18/junit4-ant/target/test-classes/J0/cwdconflict.tmp]
Collapse Failed TestOutputCapture sysstreams History
< 1 sec
org.apache.tools.ant.BuildException: At least one slave process threw an exception, first: Cwd of a forked JVM already exists and is not empty and setOnNonEmptyWorkDirectory=FAIL: [/mnt/work/bamboo-home/xml-data/build-dir/RNDTEST-SOFTWARE-JDK18/junit4-ant/target/test-classes/J0/cwdconflict.tmp]
	at com.carrotsearch.ant.tasks.junit4.it.TestOutputCapture.sysstreams(TestOutputCapture.java:12)
Caused by: org.apache.tools.ant.BuildException: Cwd of a forked JVM already exists and is not empty and setOnNonEmptyWorkDirectory=FAIL: [/mnt/work/bamboo-home/xml-data/build-dir/RNDTEST-SOFTWARE-JDK18/junit4-ant/target/test-classes/J0/cwdconflict.tmp]
Collapse Failed TestPreconditions nojunit History
< 1 sec
java.lang.AssertionError: 
Expected: a string containing "Forked JVM's classpath must include a junit4 JAR"
     got: "At least one slave process threw an exception, first: Cwd of a forked JVM already exists and is not empty and setOnNonEmptyWorkDirectory=FAIL: [/mnt/work/bamboo-home/xml-data/build-dir/RNDTEST-SOFTWARE-JDK18/junit4-ant/target/test-classes/J0/cwdconflict.tmp]"

java.lang.AssertionError: 

Expected: a string containing "Forked JVM's classpath must include a junit4 JAR"
     got: "At least one slave process threw an exception, first: Cwd of a forked JVM already exists and is not empty and setOnNonEmptyWorkDirectory=FAIL: [/mnt/work/bamboo-home/xml-data/build-dir/RNDTEST-SOFTWARE-JDK18/junit4-ant/target/test-classes/J0/cwdconflict.tmp]"
(2 more lines...)
Collapse Failed TestPreconditions oldjunit History
< 1 sec
java.lang.AssertionError: Log did not contain: 'Forked JVM's classpath must use JUnit 4.10 or newer'
	at com.carrotsearch.ant.tasks.junit4.it.TestPreconditions.oldjunit(TestPreconditions.java:16)
Collapse Failed TestReplication pseudoBalancing History
< 1 sec
org.apache.tools.ant.BuildException: At least one slave process threw an exception, first: Cwd of a forked JVM already exists and is not empty and setOnNonEmptyWorkDirectory=FAIL: [/mnt/work/bamboo-home/xml-data/build-dir/RNDTEST-SOFTWARE-JDK18/junit4-ant/target/test-classes/J0/cwdconflict.tmp]
	at com.carrotsearch.ant.tasks.junit4.it.TestReplication.pseudoBalancing(TestReplication.java:35)
Caused by: org.apache.tools.ant.BuildException: Cwd of a forked JVM already exists and is not empty and setOnNonEmptyWorkDirectory=FAIL: [/mnt/work/bamboo-home/xml-data/build-dir/RNDTEST-SOFTWARE-JDK18/junit4-ant/target/test-classes/J0/cwdconflict.tmp]
Collapse Failed TestReplication replicationAndBalancing History
< 1 sec
org.apache.tools.ant.BuildException: At least one slave process threw an exception, first: Cwd of a forked JVM already exists and is not empty and setOnNonEmptyWorkDirectory=FAIL: [/mnt/work/bamboo-home/xml-data/build-dir/RNDTEST-SOFTWARE-JDK18/junit4-ant/target/test-classes/J0/cwdconflict.tmp]
	at com.carrotsearch.ant.tasks.junit4.it.TestReplication.replicationAndBalancing(TestReplication.java:24)
Caused by: org.apache.tools.ant.BuildException: Cwd of a forked JVM already exists and is not empty and setOnNonEmptyWorkDirectory=FAIL: [/mnt/work/bamboo-home/xml-data/build-dir/RNDTEST-SOFTWARE-JDK18/junit4-ant/target/test-classes/J0/cwdconflict.tmp]
Collapse Failed TestReplication singleSuiteReplication History
< 1 sec
org.apache.tools.ant.BuildException: At least one slave process threw an exception, first: Cwd of a forked JVM already exists and is not empty and setOnNonEmptyWorkDirectory=FAIL: [/mnt/work/bamboo-home/xml-data/build-dir/RNDTEST-SOFTWARE-JDK18/junit4-ant/target/test-classes/J0/cwdconflict.tmp]
	at com.carrotsearch.ant.tasks.junit4.it.TestReplication.singleSuiteReplication(TestReplication.java:15)
Caused by: org.apache.tools.ant.BuildException: Cwd of a forked JVM already exists and is not empty and setOnNonEmptyWorkDirectory=FAIL: [/mnt/work/bamboo-home/xml-data/build-dir/RNDTEST-SOFTWARE-JDK18/junit4-ant/target/test-classes/J0/cwdconflict.tmp]
Collapse Failed TestSourceSuitesAsInput sourcesuites History
< 1 sec
org.apache.tools.ant.BuildException: At least one slave process threw an exception, first: Cwd of a forked JVM already exists and is not empty and setOnNonEmptyWorkDirectory=FAIL: [/mnt/work/bamboo-home/xml-data/build-dir/RNDTEST-SOFTWARE-JDK18/junit4-ant/target/test-classes/J0/cwdconflict.tmp]
	at com.carrotsearch.ant.tasks.junit4.it.TestSourceSuitesAsInput.sourcesuites(TestSourceSuitesAsInput.java:9)
Caused by: org.apache.tools.ant.BuildException: Cwd of a forked JVM already exists and is not empty and setOnNonEmptyWorkDirectory=FAIL: [/mnt/work/bamboo-home/xml-data/build-dir/RNDTEST-SOFTWARE-JDK18/junit4-ant/target/test-classes/J0/cwdconflict.tmp]
Collapse Failed TestStackOverflowInEventEmitter stackoverflow History
< 1 sec
java.lang.AssertionError: 
Expected: a string containing "Quit event not received from the forked process?"
     got: "At least one slave process threw an exception, first: Cwd of a forked JVM already exists and is not empty and setOnNonEmptyWorkDirectory=FAIL: [/mnt/work/bamboo-home/xml-data/build-dir/RNDTEST-SOFTWARE-JDK18/junit4-ant/target/test-classes/J0/cwdconflict.tmp]"

java.lang.AssertionError: 

Expected: a string containing "Quit event not received from the forked process?"
     got: "At least one slave process threw an exception, first: Cwd of a forked JVM already exists and is not empty and setOnNonEmptyWorkDirectory=FAIL: [/mnt/work/bamboo-home/xml-data/build-dir/RNDTEST-SOFTWARE-JDK18/junit4-ant/target/test-classes/J0/cwdconflict.tmp]"
(2 more lines...)
Collapse Failed TestStatsProperties allFilteredOut History
< 1 sec
org.apache.tools.ant.BuildException: At least one slave process threw an exception, first: Cwd of a forked JVM already exists and is not empty and setOnNonEmptyWorkDirectory=FAIL: [/mnt/work/bamboo-home/xml-data/build-dir/RNDTEST-SOFTWARE-JDK18/junit4-ant/target/test-classes/J0/cwdconflict.tmp]
	at com.carrotsearch.ant.tasks.junit4.it.TestStatsProperties.allFilteredOut(TestStatsProperties.java:10)
Caused by: org.apache.tools.ant.BuildException: Cwd of a forked JVM already exists and is not empty and setOnNonEmptyWorkDirectory=FAIL: [/mnt/work/bamboo-home/xml-data/build-dir/RNDTEST-SOFTWARE-JDK18/junit4-ant/target/test-classes/J0/cwdconflict.tmp]
Collapse Failed TestSuiteClassesBad notinstantiable History
< 1 sec
java.lang.AssertionError: 
Expected: a string containing "There were test failures: 1 suite, 1 test, 1 error"
     got: "At least one slave process threw an exception, first: Cwd of a forked JVM already exists and is not empty and setOnNonEmptyWorkDirectory=FAIL: [/mnt/work/bamboo-home/xml-data/build-dir/RNDTEST-SOFTWARE-JDK18/junit4-ant/target/test-classes/J0/cwdconflict.tmp]"

java.lang.AssertionError: 

Expected: a string containing "There were test failures: 1 suite, 1 test, 1 error"
     got: "At least one slave process threw an exception, first: Cwd of a forked JVM already exists and is not empty and setOnNonEmptyWorkDirectory=FAIL: [/mnt/work/bamboo-home/xml-data/build-dir/RNDTEST-SOFTWARE-JDK18/junit4-ant/target/test-classes/J0/cwdconflict.tmp]"
(2 more lines...)
Collapse Failed TestSuiteDuplicates suiteduplicate History
< 1 sec
org.apache.tools.ant.BuildException: At least one slave process threw an exception, first: Cwd of a forked JVM already exists and is not empty and setOnNonEmptyWorkDirectory=FAIL: [/mnt/work/bamboo-home/xml-data/build-dir/RNDTEST-SOFTWARE-JDK18/junit4-ant/target/test-classes/J0/cwdconflict.tmp]
	at com.carrotsearch.ant.tasks.junit4.it.TestSuiteDuplicates.suiteduplicate(TestSuiteDuplicates.java:10)
Caused by: org.apache.tools.ant.BuildException: Cwd of a forked JVM already exists and is not empty and setOnNonEmptyWorkDirectory=FAIL: [/mnt/work/bamboo-home/xml-data/build-dir/RNDTEST-SOFTWARE-JDK18/junit4-ant/target/test-classes/J0/cwdconflict.tmp]
Collapse Failed TestSysProperties env History
< 1 sec
org.apache.tools.ant.BuildException: At least one slave process threw an exception, first: Cwd of a forked JVM already exists and is not empty and setOnNonEmptyWorkDirectory=FAIL: [/mnt/work/bamboo-home/xml-data/build-dir/RNDTEST-SOFTWARE-JDK18/junit4-ant/target/test-classes/J0/cwdconflict.tmp]
	at com.carrotsearch.ant.tasks.junit4.it.TestSysProperties.env(TestSysProperties.java:37)
Caused by: org.apache.tools.ant.BuildException: Cwd of a forked JVM already exists and is not empty and setOnNonEmptyWorkDirectory=FAIL: [/mnt/work/bamboo-home/xml-data/build-dir/RNDTEST-SOFTWARE-JDK18/junit4-ant/target/test-classes/J0/cwdconflict.tmp]
Collapse Failed TestSysProperties failureProperty History
< 1 sec
org.apache.tools.ant.BuildException: At least one slave process threw an exception, first: Cwd of a forked JVM already exists and is not empty and setOnNonEmptyWorkDirectory=FAIL: [/mnt/work/bamboo-home/xml-data/build-dir/RNDTEST-SOFTWARE-JDK18/junit4-ant/target/test-classes/J0/cwdconflict.tmp]
	at com.carrotsearch.ant.tasks.junit4.it.TestSysProperties.failureProperty(TestSysProperties.java:12)
Caused by: org.apache.tools.ant.BuildException: Cwd of a forked JVM already exists and is not empty and setOnNonEmptyWorkDirectory=FAIL: [/mnt/work/bamboo-home/xml-data/build-dir/RNDTEST-SOFTWARE-JDK18/junit4-ant/target/test-classes/J0/cwdconflict.tmp]
Collapse Failed TestSysProperties failureTypePassing History
< 1 sec
org.apache.tools.ant.BuildException: At least one slave process threw an exception, first: Cwd of a forked JVM already exists and is not empty and setOnNonEmptyWorkDirectory=FAIL: [/mnt/work/bamboo-home/xml-data/build-dir/RNDTEST-SOFTWARE-JDK18/junit4-ant/target/test-classes/J0/cwdconflict.tmp]
	at com.carrotsearch.ant.tasks.junit4.it.TestSysProperties.failureTypePassing(TestSysProperties.java:17)
Caused by: org.apache.tools.ant.BuildException: Cwd of a forked JVM already exists and is not empty and setOnNonEmptyWorkDirectory=FAIL: [/mnt/work/bamboo-home/xml-data/build-dir/RNDTEST-SOFTWARE-JDK18/junit4-ant/target/test-classes/J0/cwdconflict.tmp]
Collapse Failed TestSysProperties iters History
< 1 sec
org.apache.tools.ant.BuildException: At least one slave process threw an exception, first: Cwd of a forked JVM already exists and is not empty and setOnNonEmptyWorkDirectory=FAIL: [/mnt/work/bamboo-home/xml-data/build-dir/RNDTEST-SOFTWARE-JDK18/junit4-ant/target/test-classes/J0/cwdconflict.tmp]
	at com.carrotsearch.ant.tasks.junit4.it.TestSysProperties.iters(TestSysProperties.java:42)
Caused by: org.apache.tools.ant.BuildException: Cwd of a forked JVM already exists and is not empty and setOnNonEmptyWorkDirectory=FAIL: [/mnt/work/bamboo-home/xml-data/build-dir/RNDTEST-SOFTWARE-JDK18/junit4-ant/target/test-classes/J0/cwdconflict.tmp]
Collapse Failed TestSysProperties sysproperty History
< 1 sec
org.apache.tools.ant.BuildException: At least one slave process threw an exception, first: Cwd of a forked JVM already exists and is not empty and setOnNonEmptyWorkDirectory=FAIL: [/mnt/work/bamboo-home/xml-data/build-dir/RNDTEST-SOFTWARE-JDK18/junit4-ant/target/test-classes/J0/cwdconflict.tmp]
	at com.carrotsearch.ant.tasks.junit4.it.TestSysProperties.sysproperty(TestSysProperties.java:32)
Caused by: org.apache.tools.ant.BuildException: Cwd of a forked JVM already exists and is not empty and setOnNonEmptyWorkDirectory=FAIL: [/mnt/work/bamboo-home/xml-data/build-dir/RNDTEST-SOFTWARE-JDK18/junit4-ant/target/test-classes/J0/cwdconflict.tmp]
Collapse Failed TestTextReport errorsSoFarIndicator History
< 1 sec
org.apache.tools.ant.BuildException: At least one slave process threw an exception, first: Cwd of a forked JVM already exists and is not empty and setOnNonEmptyWorkDirectory=FAIL: [/mnt/work/bamboo-home/xml-data/build-dir/RNDTEST-SOFTWARE-JDK18/junit4-ant/target/test-classes/J0/cwdconflict.tmp]
	at com.carrotsearch.ant.tasks.junit4.it.TestTextReport.errorsSoFarIndicator(TestTextReport.java:114)
Caused by: org.apache.tools.ant.BuildException: Cwd of a forked JVM already exists and is not empty and setOnNonEmptyWorkDirectory=FAIL: [/mnt/work/bamboo-home/xml-data/build-dir/RNDTEST-SOFTWARE-JDK18/junit4-ant/target/test-classes/J0/cwdconflict.tmp]
Collapse Failed TestTextReport failureslist History
< 1 sec
org.apache.tools.ant.BuildException: At least one slave process threw an exception, first: Cwd of a forked JVM already exists and is not empty and setOnNonEmptyWorkDirectory=FAIL: [/mnt/work/bamboo-home/xml-data/build-dir/RNDTEST-SOFTWARE-JDK18/junit4-ant/target/test-classes/J0/cwdconflict.tmp]
	at com.carrotsearch.ant.tasks.junit4.it.TestTextReport.failureslist(TestTextReport.java:88)
Caused by: org.apache.tools.ant.BuildException: Cwd of a forked JVM already exists and is not empty and setOnNonEmptyWorkDirectory=FAIL: [/mnt/work/bamboo-home/xml-data/build-dir/RNDTEST-SOFTWARE-JDK18/junit4-ant/target/test-classes/J0/cwdconflict.tmp]

Error summary

The build generated some errors. See the full build log for more details.

[junit4.preconf]         at com.carrotsearch.ant.tasks.junit4.JUnit4.getWorkingDirectory(JUnit4.java:1719)
[junit4.preconf]         at com.carrotsearch.ant.tasks.junit4.JUnit4.forkProcess(JUnit4.java:1624)
[junit4.preconf]         at com.carrotsearch.ant.tasks.junit4.JUnit4.executeSlave(JUnit4.java:1481)
[junit4.preconf]         at com.carrotsearch.ant.tasks.junit4.JUnit4.access$000(JUnit4.java:125)
[junit4.preconf]         at com.carrotsearch.ant.tasks.junit4.JUnit4$2.call(JUnit4.java:981)
[junit4.preconf]         at com.carrotsearch.ant.tasks.junit4.JUnit4$2.call(JUnit4.java:978)
[junit4.preconf]         at java.util.concurrent.FutureTask.run(FutureTask.java:266)
[junit4.preconf]         at java.util.concurrent.ThreadPoolExecutor.runWorker(ThreadPoolExecutor.java:1142)
[junit4.preconf]         at java.util.concurrent.ThreadPoolExecutor$Worker.run(ThreadPoolExecutor.java:617)
[junit4.preconf]         at java.lang.Thread.run(Thread.java:745)
[junit4.preconf] ERROR: JVM J0 ended with an exception: Cwd of a forked JVM already exists and is not empty and setOnNonEmptyWorkDirectory=FAIL: [/mnt/work/bamboo-home/xml-data/build-dir/RNDTEST-SOFTWARE-JDK18/junit4-ant/target/test-classes/J0/cwdconflict.tmp]
[junit4.preconf]         at com.carrotsearch.ant.tasks.junit4.JUnit4.getWorkingDirectory(JUnit4.java:1719)
[junit4.preconf]         at com.carrotsearch.ant.tasks.junit4.JUnit4.forkProcess(JUnit4.java:1624)
[junit4.preconf]         at com.carrotsearch.ant.tasks.junit4.JUnit4.executeSlave(JUnit4.java:1481)
[junit4.preconf]         at com.carrotsearch.ant.tasks.junit4.JUnit4.access$000(JUnit4.java:125)
[junit4.preconf]         at com.carrotsearch.ant.tasks.junit4.JUnit4$2.call(JUnit4.java:981)
[junit4.preconf]         at com.carrotsearch.ant.tasks.junit4.JUnit4$2.call(JUnit4.java:978)
[junit4.preconf]         at java.util.concurrent.FutureTask.run(FutureTask.java:266)
[junit4.preconf]         at java.util.concurrent.ThreadPoolExecutor.runWorker(ThreadPoolExecutor.java:1142)
[junit4.preconf]         at java.util.concurrent.ThreadPoolExecutor$Worker.run(ThreadPoolExecutor.java:617)
[junit4.preconf]         at java.lang.Thread.run(Thread.java:745)
[junit4.preconf] ERROR: JVM J0 ended with an exception: Cwd of a forked JVM already exists and is not empty and setOnNonEmptyWorkDirectory=FAIL: [/mnt/work/bamboo-home/xml-data/build-dir/RNDTEST-SOFTWARE-JDK18/junit4-ant/target/test-classes/J0/cwdconflict.tmp]
[junit4.preconf]         at com.carrotsearch.ant.tasks.junit4.JUnit4.getWorkingDirectory(JUnit4.java:1719)
[junit4.preconf]         at com.carrotsearch.ant.tasks.junit4.JUnit4.forkProcess(JUnit4.java:1624)
[junit4.preconf]         at com.carrotsearch.ant.tasks.junit4.JUnit4.executeSlave(JUnit4.java:1481)
[junit4.preconf]         at com.carrotsearch.ant.tasks.junit4.JUnit4.access$000(JUnit4.java:125)
[junit4.preconf]         at com.carrotsearch.ant.tasks.junit4.JUnit4$2.call(JUnit4.java:981)
[junit4.preconf]         at com.carrotsearch.ant.tasks.junit4.JUnit4$2.call(JUnit4.java:978)
[junit4.preconf]         at java.util.concurrent.FutureTask.run(FutureTask.java:266)
[junit4.preconf]         at java.util.concurrent.ThreadPoolExecutor.runWorker(ThreadPoolExecutor.java:1142)
[junit4.preconf]         at java.util.concurrent.ThreadPoolExecutor$Worker.run(ThreadPoolExecutor.java:617)
[junit4.preconf]         at java.lang.Thread.run(Thread.java:745)
[junit4:junit4] ERROR: JVM J0 ended with an exception: Cwd of a forked JVM already exists and is not empty and setOnNonEmptyWorkDirectory=FAIL: [/mnt/work/bamboo-home/xml-data/build-dir/RNDTEST-SOFTWARE-JDK18/junit4-ant/target/test-classes/J0/cwdconflict.tmp]
[junit4:junit4]         at com.carrotsearch.ant.tasks.junit4.JUnit4.getWorkingDirectory(JUnit4.java:1719)
[junit4:junit4]         at com.carrotsearch.ant.tasks.junit4.JUnit4.forkProcess(JUnit4.java:1624)
[junit4:junit4]         at com.carrotsearch.ant.tasks.junit4.JUnit4.executeSlave(JUnit4.java:1481)
[junit4:junit4]         at com.carrotsearch.ant.tasks.junit4.JUnit4.access$000(JUnit4.java:125)
[junit4:junit4]         at com.carrotsearch.ant.tasks.junit4.JUnit4$2.call(JUnit4.java:981)
[junit4:junit4]         at com.carrotsearch.ant.tasks.junit4.JUnit4$2.call(JUnit4.java:978)
[junit4:junit4]         at java.util.concurrent.FutureTask.run(FutureTask.java:266)
[junit4:junit4]         at java.util.concurrent.ThreadPoolExecutor.runWorker(ThreadPoolExecutor.java:1142)
[junit4:junit4]         at java.util.concurrent.ThreadPoolExecutor$Worker.run(ThreadPoolExecutor.java:617)
[junit4:junit4]         at java.lang.Thread.run(Thread.java:745)
[junit4:junit4] ERROR: JVM J0 ended with an exception: Cwd of a forked JVM already exists and is not empty and setOnNonEmptyWorkDirectory=FAIL: [/mnt/work/bamboo-home/xml-data/build-dir/RNDTEST-SOFTWARE-JDK18/junit4-ant/target/test-classes/J0/cwdconflict.tmp]
[junit4:junit4]         at com.carrotsearch.ant.tasks.junit4.JUnit4.getWorkingDirectory(JUnit4.java:1719)
[junit4:junit4]         at com.carrotsearch.ant.tasks.junit4.JUnit4.forkProcess(JUnit4.java:1624)
[junit4:junit4]         at com.carrotsearch.ant.tasks.junit4.JUnit4.executeSlave(JUnit4.java:1481)
[junit4:junit4]         at com.carrotsearch.ant.tasks.junit4.JUnit4.access$000(JUnit4.java:125)
[junit4:junit4]         at com.carrotsearch.ant.tasks.junit4.JUnit4$2.call(JUnit4.java:981)
[junit4:junit4]         at com.carrotsearch.ant.tasks.junit4.JUnit4$2.call(JUnit4.java:978)
[junit4:junit4]         at java.util.concurrent.FutureTask.run(FutureTask.java:266)
[junit4:junit4]         at java.util.concurrent.ThreadPoolExecutor.runWorker(ThreadPoolExecutor.java:1142)
[junit4:junit4]         at java.util.concurrent.ThreadPoolExecutor$Worker.run(ThreadPoolExecutor.java:617)
[junit4:junit4]         at java.lang.Thread.run(Thread.java:745)
[junit4:junit4] ERROR: JVM J0 ended with an exception: Cwd of a forked JVM already exists and is not empty and setOnNonEmptyWorkDirectory=FAIL: [/mnt/work/bamboo-home/xml-data/build-dir/RNDTEST-SOFTWARE-JDK18/junit4-ant/target/test-classes/J0/cwdconflict.tmp]
[junit4:junit4]         at com.carrotsearch.ant.tasks.junit4.JUnit4.getWorkingDirectory(JUnit4.java:1719)
[junit4:junit4]         at com.carrotsearch.ant.tasks.junit4.JUnit4.forkProcess(JUnit4.java:1624)
[junit4:junit4]         at com.carrotsearch.ant.tasks.junit4.JUnit4.executeSlave(JUnit4.java:1481)
[junit4:junit4]         at com.carrotsearch.ant.tasks.junit4.JUnit4.access$000(JUnit4.java:125)
[junit4:junit4]         at com.carrotsearch.ant.tasks.junit4.JUnit4$2.call(JUnit4.java:981)
[junit4:junit4]         at com.carrotsearch.ant.tasks.junit4.JUnit4$2.call(JUnit4.java:978)
[junit4:junit4]         at java.util.concurrent.FutureTask.run(FutureTask.java:266)
[junit4:junit4]         at java.util.concurrent.ThreadPoolExecutor.runWorker(ThreadPoolExecutor.java:1142)
[junit4:junit4]         at java.util.concurrent.ThreadPoolExecutor$Worker.run(ThreadPoolExecutor.java:617)
[junit4:junit4]         at java.lang.Thread.run(Thread.java:745)
[junit4:junit4] ERROR: JVM J0 ended with an exception: Cwd of a forked JVM already exists and is not empty and setOnNonEmptyWorkDirectory=FAIL: [/mnt/work/bamboo-home/xml-data/build-dir/RNDTEST-SOFTWARE-JDK18/junit4-ant/target/test-classes/J0/cwdconflict.tmp]
[junit4:junit4]         at com.carrotsearch.ant.tasks.junit4.JUnit4.getWorkingDirectory(JUnit4.java:1719)
[junit4:junit4]         at com.carrotsearch.ant.tasks.junit4.JUnit4.forkProcess(JUnit4.java:1624)
[junit4:junit4]         at com.carrotsearch.ant.tasks.junit4.JUnit4.executeSlave(JUnit4.java:1481)
[junit4:junit4]         at com.carrotsearch.ant.tasks.junit4.JUnit4.access$000(JUnit4.java:125)
[junit4:junit4]         at com.carrotsearch.ant.tasks.junit4.JUnit4$2.call(JUnit4.java:981)
[junit4:junit4]         at com.carrotsearch.ant.tasks.junit4.JUnit4$2.call(JUnit4.java:978)
[junit4:junit4]         at java.util.concurrent.FutureTask.run(FutureTask.java:266)
[junit4:junit4]         at java.util.concurrent.ThreadPoolExecutor.runWorker(ThreadPoolExecutor.java:1142)
[junit4:junit4]         at java.util.concurrent.ThreadPoolExecutor$Worker.run(ThreadPoolExecutor.java:617)
[junit4:junit4]         at java.lang.Thread.run(Thread.java:745)
    [junit] Test com.carrotsearch.ant.tasks.junit4.tests.bad.TestAbstract FAILED
    [junit] Test com.carrotsearch.ant.tasks.junit4.tests.bad.TestPackagePrivate FAILED
[junit4.preconf] ERROR: JVM J0 ended with an exception: Cwd of a forked JVM already exists and is not empty and setOnNonEmptyWorkDirectory=FAIL: [/mnt/work/bamboo-home/xml-data/build-dir/RNDTEST-SOFTWARE-JDK18/junit4-ant/target/test-classes/J0/cwdconflict.tmp]
[junit4.preconf]         at com.carrotsearch.ant.tasks.junit4.JUnit4.getWorkingDirectory(JUnit4.java:1719)
[junit4.preconf]         at com.carrotsearch.ant.tasks.junit4.JUnit4.forkProcess(JUnit4.java:1624)
[junit4.preconf]         at com.carrotsearch.ant.tasks.junit4.JUnit4.executeSlave(JUnit4.java:1481)
[junit4.preconf]         at com.carrotsearch.ant.tasks.junit4.JUnit4.access$000(JUnit4.java:125)
[junit4.preconf]         at com.carrotsearch.ant.tasks.junit4.JUnit4$2.call(JUnit4.java:981)
[junit4.preconf]         at com.carrotsearch.ant.tasks.junit4.JUnit4$2.call(JUnit4.java:978)
[junit4.preconf]         at java.util.concurrent.FutureTask.run(FutureTask.java:266)
[junit4.preconf]         at java.util.concurrent.ThreadPoolExecutor.runWorker(ThreadPoolExecutor.java:1142)
[junit4.preconf]         at java.util.concurrent.ThreadPoolExecutor$Worker.run(ThreadPoolExecutor.java:617)
[junit4.preconf]         at java.lang.Thread.run(Thread.java:745)
[junit4.preconf] ERROR: JVM J1 ended with an exception: Cwd of a forked JVM already exists and is not empty and setOnNonEmptyWorkDirectory=FAIL: [/mnt/work/bamboo-home/xml-data/build-dir/RNDTEST-SOFTWARE-JDK18/junit4-ant/target/test-classes/J1/cwdconflict.tmp]
[junit4.preconf]         at com.carrotsearch.ant.tasks.junit4.JUnit4.getWorkingDirectory(JUnit4.java:1719)
[junit4.preconf]         at com.carrotsearch.ant.tasks.junit4.JUnit4.forkProcess(JUnit4.java:1624)
[junit4.preconf]         at com.carrotsearch.ant.tasks.junit4.JUnit4.executeSlave(JUnit4.java:1481)
[junit4.preconf]         at com.carrotsearch.ant.tasks.junit4.JUnit4.access$000(JUnit4.java:125)
[junit4.preconf]         at com.carrotsearch.ant.tasks.junit4.JUnit4$2.call(JUnit4.java:981)
[junit4.preconf]         at com.carrotsearch.ant.tasks.junit4.JUnit4$2.call(JUnit4.java:978)
[junit4.preconf]         at java.util.concurrent.FutureTask.run(FutureTask.java:266)
[junit4.preconf]         at java.util.concurrent.ThreadPoolExecutor.runWorker(ThreadPoolExecutor.java:1142)
[junit4.preconf]         at java.util.concurrent.ThreadPoolExecutor$Worker.run(ThreadPoolExecutor.java:617)
[junit4.preconf]         at java.lang.Thread.run(Thread.java:745)