Build #20

Build: #20 was successful

Job: JDK 1.7 was successful

Stages & jobs

  1. Compile and test

  2. Package

Build log

The build generated 801 lines of output. Download or view full build log

10-Mar-2014 11:45:56 Build RandomizedTesting - Software - JDK 1.7 #20 (RNDTEST-SOFTWARE-JDK17-20) started building on agent WINDEX 4
10-Mar-2014 11:45:56 Build working directory is E:\xml-data\build-dir\RNDTEST-SOFTWARE-JDK17
10-Mar-2014 11:45:56 Executing build RandomizedTesting - Software - JDK 1.7 #20 (RNDTEST-SOFTWARE-JDK17-20)
10-Mar-2014 11:45:56 Starting task 'Checkout Default Repository' of type 'com.atlassian.bamboo.plugins.vcs:task.vcs.checkout'
10-Mar-2014 11:45:56 Updating source code to revision: c133a197194f61d2b320d8bd033d73cb9642b4df
10-Mar-2014 11:45:57 Fetching 'refs/heads/master' from 'https://github.com/carrotsearch/randomizedtesting.git'. Will try to do a shallow fetch.
10-Mar-2014 11:45:58 From https://github.com/carrotsearch/randomizedtesting
10-Mar-2014 11:45:58 + ff09aef...c133a19 master     -> master  (forced update)
10-Mar-2014 11:45:58 Checking out revision c133a197194f61d2b320d8bd033d73cb9642b4df.
10-Mar-2014 11:45:58 Already on 'master'
10-Mar-2014 11:45:58 Updated source code to revision: c133a197194f61d2b320d8bd033d73cb9642b4df
10-Mar-2014 11:45:58 Finished task 'Checkout Default Repository'
10-Mar-2014 11:45:58 Running pre-build action: VCS Version Collector
10-Mar-2014 11:45:58 Running pre-build action: Clover Grails PreBuild Action
10-Mar-2014 11:45:58 Starting task 'Maven 3.x' of type 'com.atlassian.bamboo.plugins.maven:task.builder.mvn3'
10-Mar-2014 11:45:58
Beginning to execute external process for build 'RandomizedTesting - Software - JDK 1.7 #20 (RNDTEST-SOFTWARE-JDK17-20)'
... running command line:
d:\bamboo\tools\apache-maven-3.0.4\bin\mvn.bat --batch-mode -Djava.io.tmpdir=e:\bamboo-home-4\temp\RNDTEST-SOFTWARE-JDK17 clean verify
... in: E:\xml-data\build-dir\RNDTEST-SOFTWARE-JDK17
... using extra environment variables:
bamboo_carrotsearch_download_staging_path=/srv/vhosts/staging-get.carrotsearch.com
bamboo_carrot2_download_host=gamma.carrotsearch.com
bamboo_carrotsearch_download_official_path=~/sites/download.carrotsearch.com
JAVA_HOME=d:\dev\java\jdk\oracle-jdk1.7.0
bamboo_carrotsearch_labs_ssh=carrotse@site5.carrot2.org:~/sites/labs.carrotsearch.com
useMavenReturnCode=false
bamboo_carrotsearch_secure_ssh=seccarro@site5.carrot2.org:~/www
bamboo_carrot2_website_ssh=carrot2o@site5.carrot2.org:~/sites/project.carrot2.org
bamboo_carrotsearch_download_staging_user=bamboo
bamboo_carrot2_download_path=/srv/vhosts/get.carrot2.org
M2_HOME=d:\bamboo\tools\apache-maven-3.0.4
bamboo_carrotsearch_download_official_host=download.carrotsearch.com
bamboo_csssprites_download_user=bamboo
bamboo_carrotsearch_download_staging_host=gamma.carrotsearch.com
bamboo_csssprites_download_path=/srv/vhosts/get.csssprites.org
bamboo_carrot2_download_user=bamboo
MAVEN2_HOME=d:\bamboo\tools\apache-maven-3.0.4
bamboo_carrotsearch_website_ssh=carrotse@site5.carrot2.org:~/sites/www.carrotsearch.com
bamboo_carrotsearch_download_official_user=carrotse
bamboo_csssprites_download_host=gamma.carrotsearch.com
Path=d:\dev\java\jdk\oracle-jdk1.7.0\bin;C:\Windows\system32;C:\Windows;C:\Windows\System32\Wbem;C:\Windows\System32\WindowsPowerShell\v1.0\;d:\dev\scm\git\cmd;d:\bamboo\tools\apache-ant-1.8.2\bin;d:\bamboo\tools\apache-maven-3.0.4\bin;d:\dev\java\jdk\oracle-jdk1.7.0\bin;d:\tools\bin;d:\dev\scm\git\bin
10-Mar-2014 11:45:59 [INFO] Scanning for projects...
10-Mar-2014 11:45:59 [INFO] ------------------------------------------------------------------------
10-Mar-2014 11:45:59 [INFO] Reactor Build Order:
10-Mar-2014 11:45:59 [INFO]
10-Mar-2014 11:45:59 [INFO] RandomizedTesting Parent POM
10-Mar-2014 11:45:59 [INFO] RandomizedTesting Randomized Runner
10-Mar-2014 11:45:59 [INFO] RandomizedTesting JUnit4 ANT Task
10-Mar-2014 11:45:59 [INFO] RandomizedTesting JUnit4 Maven Plugin
10-Mar-2014 11:45:59 [INFO] RandomizedTesting JUnit4 Maven Plugin Tests
10-Mar-2014 11:45:59 [INFO] RandomizedTesting Examples
10-Mar-2014 11:45:59 [INFO] RandomizedTesting ANT Examples
10-Mar-2014 11:45:59 [INFO] RandomizedTesting Packaging
10-Mar-2014 11:45:59 [INFO]                                                                         
10-Mar-2014 11:45:59 [INFO] ------------------------------------------------------------------------
10-Mar-2014 11:45:59 [INFO] Building RandomizedTesting Parent POM 2.1.0-SNAPSHOT
10-Mar-2014 11:45:59 [INFO] ------------------------------------------------------------------------
10-Mar-2014 11:45:59 [INFO]
10-Mar-2014 11:45:59 [INFO] --- maven-clean-plugin:2.4.1:clean (default-clean) @ randomizedtesting-parent ---
10-Mar-2014 11:45:59 [INFO]
10-Mar-2014 11:45:59 [INFO] --- maven-enforcer-plugin:1.2:enforce (enforce-maven) @ randomizedtesting-parent ---
10-Mar-2014 11:46:00 [INFO]                                                                         
10-Mar-2014 11:46:00 [INFO] ------------------------------------------------------------------------
10-Mar-2014 11:46:00 [INFO] Building RandomizedTesting Randomized Runner 2.1.0-SNAPSHOT
10-Mar-2014 11:46:00 [INFO] ------------------------------------------------------------------------
10-Mar-2014 11:46:00 [INFO]
10-Mar-2014 11:46:00 [INFO] --- maven-clean-plugin:2.4.1:clean (default-clean) @ randomizedtesting-runner ---
10-Mar-2014 11:46:00 [INFO] Deleting E:\xml-data\build-dir\RNDTEST-SOFTWARE-JDK17\randomized-runner\target
10-Mar-2014 11:46:00 [INFO]
10-Mar-2014 11:46:00 [INFO] --- maven-enforcer-plugin:1.2:enforce (enforce-maven) @ randomizedtesting-runner ---
10-Mar-2014 11:46:00 [INFO]
10-Mar-2014 11:46:00 [INFO] --- maven-resources-plugin:2.5:resources (default-resources) @ randomizedtesting-runner ---
10-Mar-2014 11:46:00 [debug] execute contextualize
10-Mar-2014 11:46:00 [INFO] Using 'UTF-8' encoding to copy filtered resources.
10-Mar-2014 11:46:00 [INFO] skip non existing resourceDirectory E:\xml-data\build-dir\RNDTEST-SOFTWARE-JDK17\randomized-runner\src\main\resources
10-Mar-2014 11:46:00 [INFO]
10-Mar-2014 11:46:00 [INFO] --- maven-compiler-plugin:3.1:compile (default-compile) @ randomizedtesting-runner ---
10-Mar-2014 11:46:00 [INFO] Changes detected - recompiling the module!
10-Mar-2014 11:46:00 [INFO] Compiling 78 source files to E:\xml-data\build-dir\RNDTEST-SOFTWARE-JDK17\randomized-runner\target\classes
10-Mar-2014 11:46:01 [WARNING] /E:/xml-data/build-dir/RNDTEST-SOFTWARE-JDK17/randomized-runner/src/main/java/com/carrotsearch/randomizedtesting/RandomizedRunner.java: Some input files use unchecked or unsafe operations.
10-Mar-2014 11:46:01 [WARNING] /E:/xml-data/build-dir/RNDTEST-SOFTWARE-JDK17/randomized-runner/src/main/java/com/carrotsearch/randomizedtesting/RandomizedRunner.java: Recompile with -Xlint:unchecked for details.
10-Mar-2014 11:46:01 [INFO]
10-Mar-2014 11:46:01 [INFO] --- maven-bundle-plugin:2.3.4:manifest (bundle-manifest) @ randomizedtesting-runner ---
10-Mar-2014 11:46:02 [INFO]
10-Mar-2014 11:46:02 [INFO] --- maven-resources-plugin:2.5:testResources (default-testResources) @ randomizedtesting-runner ---
10-Mar-2014 11:46:02 [debug] execute contextualize
10-Mar-2014 11:46:02 [INFO] Using 'UTF-8' encoding to copy filtered resources.
10-Mar-2014 11:46:02 [INFO] skip non existing resourceDirectory E:\xml-data\build-dir\RNDTEST-SOFTWARE-JDK17\randomized-runner\src\test\resources
10-Mar-2014 11:46:02 [INFO]
10-Mar-2014 11:46:02 [INFO] --- maven-compiler-plugin:3.1:testCompile (default-testCompile) @ randomizedtesting-runner ---
10-Mar-2014 11:46:02 [INFO] Changes detected - recompiling the module!
10-Mar-2014 11:46:02 [INFO] Compiling 78 source files to E:\xml-data\build-dir\RNDTEST-SOFTWARE-JDK17\randomized-runner\target\test-classes
10-Mar-2014 11:46:02 [WARNING] /E:/xml-data/build-dir/RNDTEST-SOFTWARE-JDK17/randomized-runner/src/test/java/com/carrotsearch/randomizedtesting/contracts/TestBeforeAfterMethodOrder.java: E:\xml-data\build-dir\RNDTEST-SOFTWARE-JDK17\randomized-runner\src\test\java\com\carrotsearch\randomizedtesting\contracts\TestBeforeAfterMethodOrder.java uses or overrides a deprecated API.
10-Mar-2014 11:46:02 [WARNING] /E:/xml-data/build-dir/RNDTEST-SOFTWARE-JDK17/randomized-runner/src/test/java/com/carrotsearch/randomizedtesting/contracts/TestBeforeAfterMethodOrder.java: Recompile with -Xlint:deprecation for details.
10-Mar-2014 11:46:02 [INFO]
10-Mar-2014 11:46:02 [INFO] --- maven-surefire-plugin:2.10:test (default-test) @ randomizedtesting-runner ---
10-Mar-2014 11:46:03 [INFO] Surefire report directory: E:\xml-data\build-dir\RNDTEST-SOFTWARE-JDK17\randomized-runner\target\surefire-reports
10-Mar-2014 11:46:03
10-Mar-2014 11:46:03 -------------------------------------------------------
10-Mar-2014 11:46:03 T E S T S
10-Mar-2014 11:46:03 -------------------------------------------------------
10-Mar-2014 11:46:03 Running com.carrotsearch.randomizedtesting.contracts.TestAnnotationInheritance
10-Mar-2014 11:46:03 Tests run: 1, Failures: 0, Errors: 0, Skipped: 0, Time elapsed: 0.094 sec
10-Mar-2014 11:46:03 Running com.carrotsearch.randomizedtesting.contracts.TestAssumptionsAtClassLevel
10-Mar-2014 11:46:03 Tests run: 1, Failures: 0, Errors: 0, Skipped: 0, Time elapsed: 0.015 sec
10-Mar-2014 11:46:03 Running com.carrotsearch.randomizedtesting.contracts.TestBeforeAfterMethodOrder
10-Mar-2014 11:46:03 Tests run: 2, Failures: 0, Errors: 0, Skipped: 0, Time elapsed: 0.094 sec
10-Mar-2014 11:46:03 Running com.carrotsearch.randomizedtesting.contracts.TestClassLevelIgnore
10-Mar-2014 11:46:03 Tests run: 1, Failures: 0, Errors: 0, Skipped: 0, Time elapsed: 0 sec
10-Mar-2014 11:46:03 Running com.carrotsearch.randomizedtesting.contracts.TestClassRules
10-Mar-2014 11:46:03 Tests run: 1, Failures: 0, Errors: 0, Skipped: 0, Time elapsed: 0.015 sec
10-Mar-2014 11:46:03 Running com.carrotsearch.randomizedtesting.generators.TestCodepointSetGenerator
10-Mar-2014 11:46:03 Tests run: 125, Failures: 0, Errors: 0, Skipped: 0, Time elapsed: 0.25 sec
10-Mar-2014 11:46:03 Running com.carrotsearch.randomizedtesting.generators.TestRandomPicks
10-Mar-2014 11:46:03 Tests run: 4, Failures: 0, Errors: 0, Skipped: 0, Time elapsed: 0 sec
10-Mar-2014 11:46:03 Running com.carrotsearch.randomizedtesting.generators.TestRealisticUnicodeGenerator
10-Mar-2014 11:46:03 Tests run: 41, Failures: 0, Errors: 0, Skipped: 0, Time elapsed: 0.047 sec
10-Mar-2014 11:46:03 Running com.carrotsearch.randomizedtesting.generators.TestUnicodeGenerator
10-Mar-2014 11:46:03 Tests run: 41, Failures: 0, Errors: 0, Skipped: 0, Time elapsed: 0.047 sec
10-Mar-2014 11:46:03 Running com.carrotsearch.randomizedtesting.rules.TestNoClassHooksShadowingRule
10-Mar-2014 11:46:03 Tests run: 3, Failures: 0, Errors: 0, Skipped: 0, Time elapsed: 0.031 sec
10-Mar-2014 11:46:03 Running com.carrotsearch.randomizedtesting.rules.TestNoInstanceHooksOverridesRule
10-Mar-2014 11:46:03 Tests run: 4, Failures: 0, Errors: 0, Skipped: 0, Time elapsed: 0.031 sec
10-Mar-2014 11:46:03 Running com.carrotsearch.randomizedtesting.rules.TestStaticFieldsInvariantRule
10-Mar-2014 11:46:03 Tests run: 3, Failures: 0, Errors: 0, Skipped: 0, Time elapsed: 0.016 sec
10-Mar-2014 11:46:03 Running com.carrotsearch.randomizedtesting.rules.TestSystemPropertiesInvariantRule
10-Mar-2014 11:46:03 Tests run: 4, Failures: 0, Errors: 0, Skipped: 0, Time elapsed: 0.015 sec
10-Mar-2014 11:46:03 Running com.carrotsearch.randomizedtesting.TestChildTestGroupThreads
10-Mar-2014 11:46:03 Tests run: 1, Failures: 0, Errors: 0, Skipped: 0, Time elapsed: 0 sec
10-Mar-2014 11:46:03 Running com.carrotsearch.randomizedtesting.TestClassMethodFiltering
10-Mar-2014 11:46:04 Tests run: 5, Failures: 0, Errors: 0, Skipped: 0, Time elapsed: 0.031 sec
10-Mar-2014 11:46:04 Running com.carrotsearch.randomizedtesting.TestContextRandom
10-Mar-2014 11:46:04 Tests run: 3, Failures: 0, Errors: 0, Skipped: 1, Time elapsed: 0.016 sec
10-Mar-2014 11:46:04 Running com.carrotsearch.randomizedtesting.TestCustomMethodProvider
10-Mar-2014 11:46:04 Tests run: 2, Failures: 0, Errors: 0, Skipped: 0, Time elapsed: 0 sec
10-Mar-2014 11:46:04 Running com.carrotsearch.randomizedtesting.TestExpected
10-Mar-2014 11:46:04 Tests run: 2, Failures: 0, Errors: 0, Skipped: 0, Time elapsed: 0 sec
10-Mar-2014 11:46:04 Running com.carrotsearch.randomizedtesting.TestFailurePropagationCompatibility
10-Mar-2014 11:46:04 Tests run: 1, Failures: 0, Errors: 0, Skipped: 0, Time elapsed: 0.234 sec
10-Mar-2014 11:46:04 Running com.carrotsearch.randomizedtesting.TestFilterExpressionParser
10-Mar-2014 11:46:04 Tests run: 5, Failures: 0, Errors: 0, Skipped: 0, Time elapsed: 0 sec
10-Mar-2014 11:46:04 Running com.carrotsearch.randomizedtesting.TestFilteringWarnings
10-Mar-2014 11:46:04 Tests run: 4, Failures: 0, Errors: 0, Skipped: 0, Time elapsed: 0.015 sec
10-Mar-2014 11:46:04 Running com.carrotsearch.randomizedtesting.TestFormattingRandomSeeds
10-Mar-2014 11:46:04 Tests run: 1003, Failures: 0, Errors: 0, Skipped: 0, Time elapsed: 0.499 sec
10-Mar-2014 11:46:04 Running com.carrotsearch.randomizedtesting.TestHookMethodOrderWithExceptions
10-Mar-2014 11:46:04 Tests run: 20, Failures: 0, Errors: 0, Skipped: 0, Time elapsed: 0.031 sec
10-Mar-2014 11:46:04 Running com.carrotsearch.randomizedtesting.TestHooksWithEmptyTestSet
10-Mar-2014 11:46:04 Tests run: 1, Failures: 0, Errors: 0, Skipped: 0, Time elapsed: 0 sec
10-Mar-2014 11:46:04 Running com.carrotsearch.randomizedtesting.TestIgnoredRunCount
10-Mar-2014 11:46:04 Tests run: 1, Failures: 0, Errors: 0, Skipped: 0, Time elapsed: 0 sec
10-Mar-2014 11:46:04 Running com.carrotsearch.randomizedtesting.TestInstantiationTime
10-Mar-2014 11:46:04 Tests run: 1, Failures: 0, Errors: 0, Skipped: 0, Time elapsed: 0 sec
10-Mar-2014 11:46:04 Running com.carrotsearch.randomizedtesting.TestIterationsAnnotation
10-Mar-2014 11:46:04 Tests run: 10, Failures: 0, Errors: 0, Skipped: 0, Time elapsed: 0 sec
10-Mar-2014 11:46:04 Running com.carrotsearch.randomizedtesting.TestJ9SysThreads
10-Mar-2014 11:46:04 Tests run: 1, Failures: 0, Errors: 0, Skipped: 0, Time elapsed: 0 sec
10-Mar-2014 11:46:04 Running com.carrotsearch.randomizedtesting.TestJUnit3MethodProvider
10-Mar-2014 11:46:04 Tests run: 3, Failures: 0, Errors: 0, Skipped: 0, Time elapsed: 0 sec
10-Mar-2014 11:46:04 Running com.carrotsearch.randomizedtesting.TestListenersAnnotation
10-Mar-2014 11:46:04 Tests run: 1, Failures: 0, Errors: 0, Skipped: 0, Time elapsed: 0 sec
10-Mar-2014 11:46:04 Running com.carrotsearch.randomizedtesting.TestMacSysThreads
10-Mar-2014 11:46:09 Tests run: 1, Failures: 0, Errors: 0, Skipped: 0, Time elapsed: 5.039 sec
10-Mar-2014 11:46:09 Running com.carrotsearch.randomizedtesting.TestManyThreadsOOM
10-Mar-2014 11:46:14 Tests run: 10, Failures: 0, Errors: 0, Skipped: 0, Time elapsed: 4.306 sec
10-Mar-2014 11:46:14 Running com.carrotsearch.randomizedtesting.TestNightlyMode
10-Mar-2014 11:46:14 Tests run: 3, Failures: 0, Errors: 0, Skipped: 0, Time elapsed: 0.015 sec
10-Mar-2014 11:46:14 Running com.carrotsearch.randomizedtesting.TestOutOfScopeRandomUse
10-Mar-2014 11:46:14 Tests run: 2, Failures: 0, Errors: 0, Skipped: 0, Time elapsed: 0 sec
10-Mar-2014 11:46:14 Running com.carrotsearch.randomizedtesting.TestOverlappingMethodProviders
10-Mar-2014 11:46:14 Tests run: 1, Failures: 0, Errors: 0, Skipped: 0, Time elapsed: 0 sec
10-Mar-2014 11:46:14 Running com.carrotsearch.randomizedtesting.TestOverridingDefaultExceptionHandler
10-Mar-2014 11:46:14 Tests run: 1, Failures: 0, Errors: 0, Skipped: 0, Time elapsed: 0.016 sec
10-Mar-2014 11:46:14 Running com.carrotsearch.randomizedtesting.TestParameterized
10-Mar-2014 11:46:14 Tests run: 3, Failures: 0, Errors: 0, Skipped: 0, Time elapsed: 0.031 sec
10-Mar-2014 11:46:14 Running com.carrotsearch.randomizedtesting.TestRandomInStaticInitializer
10-Mar-2014 11:46:14 Tests run: 1, Failures: 0, Errors: 0, Skipped: 0, Time elapsed: 0.016 sec
10-Mar-2014 11:46:14 Running com.carrotsearch.randomizedtesting.TestRandomizedTest
10-Mar-2014 11:46:14 Tests run: 19, Failures: 0, Errors: 0, Skipped: 0, Time elapsed: 0.234 sec
10-Mar-2014 11:46:14 Running com.carrotsearch.randomizedtesting.TestResourceDisposal
10-Mar-2014 11:46:14 Tests run: 3, Failures: 0, Errors: 0, Skipped: 0, Time elapsed: 0.015 sec
10-Mar-2014 11:46:14 Running com.carrotsearch.randomizedtesting.TestRules
10-Mar-2014 11:46:14 Tests run: 2, Failures: 0, Errors: 0, Skipped: 0, Time elapsed: 0.016 sec
10-Mar-2014 11:46:14 Running com.carrotsearch.randomizedtesting.TestSeedDecorator
10-Mar-2014 11:46:14 Tests run: 1, Failures: 0, Errors: 0, Skipped: 0, Time elapsed: 0 sec
10-Mar-2014 11:46:14 Running com.carrotsearch.randomizedtesting.TestSeedFixing
10-Mar-2014 11:46:14 Tests run: 1, Failures: 0, Errors: 0, Skipped: 0, Time elapsed: 0 sec
10-Mar-2014 11:46:14 Running com.carrotsearch.randomizedtesting.TestSeedFixingWithProperties
10-Mar-2014 11:46:14 Tests run: 2, Failures: 0, Errors: 0, Skipped: 0, Time elapsed: 0.016 sec
10-Mar-2014 11:46:14 Running com.carrotsearch.randomizedtesting.TestSeedParameterOptional
10-Mar-2014 11:46:14 Tests run: 1, Failures: 0, Errors: 0, Skipped: 0, Time elapsed: 0 sec
10-Mar-2014 11:46:14 Running com.carrotsearch.randomizedtesting.TestSeedRepeatable
10-Mar-2014 11:46:14 Tests run: 1, Failures: 0, Errors: 0, Skipped: 0, Time elapsed: 0 sec
10-Mar-2014 11:46:14 Running com.carrotsearch.randomizedtesting.TestSetSeedLocked
10-Mar-2014 11:46:14 Tests run: 1, Failures: 0, Errors: 0, Skipped: 0, Time elapsed: 0 sec
10-Mar-2014 11:46:14 Running com.carrotsearch.randomizedtesting.TestStackAugmentation
10-Mar-2014 11:46:14 Tests run: 3, Failures: 0, Errors: 0, Skipped: 0, Time elapsed: 0 sec
10-Mar-2014 11:46:14 Running com.carrotsearch.randomizedtesting.TestTestFiltering
10-Mar-2014 11:46:14 Tests run: 1, Failures: 0, Errors: 0, Skipped: 0, Time elapsed: 0.016 sec
10-Mar-2014 11:46:14 Running com.carrotsearch.randomizedtesting.TestTestGroups
10-Mar-2014 11:46:14 Tests run: 4, Failures: 0, Errors: 0, Skipped: 0, Time elapsed: 0.031 sec
10-Mar-2014 11:46:14 Running com.carrotsearch.randomizedtesting.TestThreadNameContainsTestName
10-Mar-2014 11:46:14 Tests run: 3, Failures: 0, Errors: 0, Skipped: 0, Time elapsed: 0 sec
10-Mar-2014 11:46:14 Running com.carrotsearch.randomizedtesting.TestUncaughtExceptionsDuplicated
10-Mar-2014 11:46:14 Tests run: 3, Failures: 0, Errors: 0, Skipped: 0, Time elapsed: 0.016 sec
10-Mar-2014 11:46:14 Running com.carrotsearch.randomizedtesting.TestValidation
10-Mar-2014 11:46:14 Tests run: 1, Failures: 0, Errors: 0, Skipped: 0, Time elapsed: 0.015 sec
10-Mar-2014 11:46:14 Running com.carrotsearch.randomizedtesting.timeouts.Test001TimeoutSuite
10-Mar-2014 11:46:18 Tests run: 8, Failures: 0, Errors: 0, Skipped: 0, Time elapsed: 4.243 sec
10-Mar-2014 11:46:18 Running com.carrotsearch.randomizedtesting.timeouts.Test002TimeoutMethod
10-Mar-2014 11:46:19 Tests run: 4, Failures: 0, Errors: 0, Skipped: 0, Time elapsed: 0.188 sec
10-Mar-2014 11:46:19 Running com.carrotsearch.randomizedtesting.timeouts.Test003ThreadLeaksMethod
10-Mar-2014 11:46:19 Tests run: 8, Failures: 0, Errors: 0, Skipped: 0, Time elapsed: 0.078 sec
10-Mar-2014 11:46:19 Running com.carrotsearch.randomizedtesting.timeouts.Test004ThreadLeaksSuite
10-Mar-2014 11:46:19 Tests run: 8, Failures: 0, Errors: 0, Skipped: 0, Time elapsed: 0.031 sec
10-Mar-2014 11:46:19 Running com.carrotsearch.randomizedtesting.timeouts.Test005ThreadLeaksSystemThreads
10-Mar-2014 11:46:19 Tests run: 1, Failures: 0, Errors: 0, Skipped: 0, Time elapsed: 0.078 sec
10-Mar-2014 11:46:19 Running com.carrotsearch.randomizedtesting.timeouts.Test006TimeoutAndThreadLeak
10-Mar-2014 11:46:23 Tests run: 8, Failures: 0, Errors: 0, Skipped: 0, Time elapsed: 4.227 sec
10-Mar-2014 11:46:23 Running com.carrotsearch.randomizedtesting.timeouts.Test007UncaughtExceptions
10-Mar-2014 11:46:23 Tests run: 2, Failures: 0, Errors: 0, Skipped: 0, Time elapsed: 0 sec
10-Mar-2014 11:46:23 Running com.carrotsearch.randomizedtesting.timeouts.Test008SeedsAnnotation
10-Mar-2014 11:46:23 Tests run: 1, Failures: 0, Errors: 0, Skipped: 0, Time elapsed: 0.031 sec
10-Mar-2014 11:46:23 Running com.carrotsearch.randomizedtesting.timeouts.Test009TimeoutOrNotIdenticalSequence
10-Mar-2014 11:46:23 Tests run: 1, Failures: 0, Errors: 0, Skipped: 0, Time elapsed: 0.016 sec
10-Mar-2014 11:46:23 Running com.carrotsearch.randomizedtesting.timeouts.Test010Zombies
10-Mar-2014 11:46:24 Tests run: 8, Failures: 0, Errors: 0, Skipped: 0, Time elapsed: 0.78 sec
10-Mar-2014 11:46:24 Running com.carrotsearch.randomizedtesting.timeouts.Test011RunawayThreads
10-Mar-2014 11:46:24 Tests run: 5, Failures: 0, Errors: 0, Skipped: 0, Time elapsed: 0.531 sec
10-Mar-2014 11:46:24 Running com.carrotsearch.randomizedtesting.timeouts.Test012RunawayThreadsKilledAtOnce
10-Mar-2014 11:46:24 Tests run: 1, Failures: 0, Errors: 0, Skipped: 0, Time elapsed: 0.031 sec
10-Mar-2014 11:46:24 Running com.carrotsearch.randomizedtesting.timeouts.Test013ThreadLeaksScopeNone
10-Mar-2014 11:46:24 Tests run: 8, Failures: 0, Errors: 0, Skipped: 0, Time elapsed: 0.031 sec
10-Mar-2014 11:46:24 Running com.carrotsearch.randomizedtesting.timeouts.Test014Timeout
10-Mar-2014 11:46:25 Tests run: 1, Failures: 0, Errors: 0, Skipped: 0, Time elapsed: 0.234 sec
10-Mar-2014 11:46:25 Running com.carrotsearch.randomizedtesting.timeouts.Test015TimeoutOverride
10-Mar-2014 11:46:26 Tests run: 2, Failures: 0, Errors: 0, Skipped: 0, Time elapsed: 1.264 sec
10-Mar-2014 11:46:26 Running com.carrotsearch.randomizedtesting.timeouts.Test016ThreadLeaksCustomFilters
10-Mar-2014 11:46:26 Tests run: 1, Failures: 0, Errors: 0, Skipped: 0, Time elapsed: 0 sec
10-Mar-2014 11:46:26 Running com.carrotsearch.randomizedtesting.timeouts.Test017ThreadLeaksCustomFiltersException
10-Mar-2014 11:46:26 Tests run: 1, Failures: 0, Errors: 0, Skipped: 0, Time elapsed: 0.015 sec
10-Mar-2014 11:46:26 Running com.carrotsearch.randomizedtesting.timeouts.Test018TimeoutStacks
10-Mar-2014 11:46:27 Tests run: 1, Failures: 0, Errors: 0, Skipped: 0, Time elapsed: 1.046 sec
10-Mar-2014 11:46:27 Running com.carrotsearch.randomizedtesting.timeouts.Test019ThreadLeakGroup
10-Mar-2014 11:46:27 Tests run: 3, Failures: 0, Errors: 0, Skipped: 0, Time elapsed: 0 sec
10-Mar-2014 11:46:27
10-Mar-2014 11:46:27 Results :
10-Mar-2014 11:46:27
10-Mar-2014 11:46:27 Tests run: 1435, Failures: 0, Errors: 0, Skipped: 1
10-Mar-2014 11:46:27
10-Mar-2014 11:46:27 [INFO]
10-Mar-2014 11:46:27 [INFO] --- maven-jar-plugin:2.3.2:jar (default-jar) @ randomizedtesting-runner ---
10-Mar-2014 11:46:27 [INFO] Building jar: E:\xml-data\build-dir\RNDTEST-SOFTWARE-JDK17\randomized-runner\target\randomizedtesting-runner-2.1.0-SNAPSHOT.jar
10-Mar-2014 11:46:27 [INFO]                                                                         
10-Mar-2014 11:46:27 [INFO] ------------------------------------------------------------------------
10-Mar-2014 11:46:27 [INFO] Building RandomizedTesting JUnit4 ANT Task 2.1.0-SNAPSHOT
10-Mar-2014 11:46:27 [INFO] ------------------------------------------------------------------------
10-Mar-2014 11:46:27 [INFO]
10-Mar-2014 11:46:27 [INFO] --- maven-clean-plugin:2.4.1:clean (default-clean) @ junit4-ant ---
10-Mar-2014 11:46:27 [INFO] Deleting E:\xml-data\build-dir\RNDTEST-SOFTWARE-JDK17\junit4-ant\target
10-Mar-2014 11:46:27 [INFO]
10-Mar-2014 11:46:27 [INFO] --- maven-enforcer-plugin:1.2:enforce (enforce-maven) @ junit4-ant ---
10-Mar-2014 11:46:27 [INFO]
10-Mar-2014 11:46:27 [INFO] --- maven-resources-plugin:2.5:resources (default-resources) @ junit4-ant ---
10-Mar-2014 11:46:27 [debug] execute contextualize
10-Mar-2014 11:46:27 [INFO] Using 'UTF-8' encoding to copy filtered resources.
10-Mar-2014 11:46:27 [INFO] Copying 15 resources
10-Mar-2014 11:46:27 [INFO]
10-Mar-2014 11:46:27 [INFO] --- maven-compiler-plugin:3.1:compile (default-compile) @ junit4-ant ---
10-Mar-2014 11:46:28 [INFO] Changes detected - recompiling the module!
10-Mar-2014 11:46:28 [INFO] Compiling 94 source files to E:\xml-data\build-dir\RNDTEST-SOFTWARE-JDK17\junit4-ant\target\classes
10-Mar-2014 11:46:28 [INFO]
10-Mar-2014 11:46:28 [INFO] --- maven-resources-plugin:2.5:testResources (default-testResources) @ junit4-ant ---
10-Mar-2014 11:46:28 [debug] execute contextualize
10-Mar-2014 11:46:28 [INFO] Using 'UTF-8' encoding to copy filtered resources.
10-Mar-2014 11:46:28 [INFO] Copying 2 resources
10-Mar-2014 11:46:28 [INFO]
10-Mar-2014 11:46:28 [INFO] --- maven-compiler-plugin:3.1:testCompile (default-testCompile) @ junit4-ant ---
10-Mar-2014 11:46:28 [INFO] Changes detected - recompiling the module!
10-Mar-2014 11:46:28 [INFO] Compiling 97 source files to E:\xml-data\build-dir\RNDTEST-SOFTWARE-JDK17\junit4-ant\target\test-classes
10-Mar-2014 11:46:28 [INFO]
10-Mar-2014 11:46:28 [INFO] --- maven-surefire-plugin:2.10:test (default-test) @ junit4-ant ---
10-Mar-2014 11:46:28 [INFO] Surefire report directory: E:\xml-data\build-dir\RNDTEST-SOFTWARE-JDK17\junit4-ant\target\surefire-reports
10-Mar-2014 11:46:28
10-Mar-2014 11:46:28 -------------------------------------------------------
10-Mar-2014 11:46:28 T E S T S
10-Mar-2014 11:46:28 -------------------------------------------------------
10-Mar-2014 11:46:28 Running com.carrotsearch.ant.tasks.junit4.TestEventBusSanityCheck
10-Mar-2014 11:46:32 Tests run: 100, Failures: 0, Errors: 0, Skipped: 0, Time elapsed: 3.832 sec
10-Mar-2014 11:46:32 Running com.carrotsearch.ant.tasks.junit4.TestJsonByteArrayRoundtrip
10-Mar-2014 11:46:33 Tests run: 101, Failures: 0, Errors: 0, Skipped: 0, Time elapsed: 0.296 sec
10-Mar-2014 11:46:33 Running com.carrotsearch.ant.tasks.junit4.TestXmlStringsRoundtrip
10-Mar-2014 11:46:33 Tests run: 101, Failures: 0, Errors: 0, Skipped: 0, Time elapsed: 0.359 sec
10-Mar-2014 11:46:33
10-Mar-2014 11:46:33 Results :
10-Mar-2014 11:46:33
10-Mar-2014 11:46:33 Tests run: 302, Failures: 0, Errors: 0, Skipped: 0
10-Mar-2014 11:46:33
10-Mar-2014 11:46:33 [INFO]
10-Mar-2014 11:46:33 [INFO] --- maven-jar-plugin:2.3.2:jar (default-jar) @ junit4-ant ---
10-Mar-2014 11:46:33 [INFO] Building jar: E:\xml-data\build-dir\RNDTEST-SOFTWARE-JDK17\junit4-ant\target\junit4-ant-2.1.0-SNAPSHOT.jar
10-Mar-2014 11:46:33 [INFO]
10-Mar-2014 11:46:33 [INFO] --- maven-dependency-plugin:2.3:copy-dependencies (copy-dependencies) @ junit4-ant ---
10-Mar-2014 11:46:33 [INFO] Copying junit-4.10.jar to E:\xml-data\build-dir\RNDTEST-SOFTWARE-JDK17\junit4-ant\target\dependency\junit-4.10.jar
10-Mar-2014 11:46:33 [INFO] Copying randomizedtesting-runner-2.1.0-SNAPSHOT.jar to E:\xml-data\build-dir\RNDTEST-SOFTWARE-JDK17\junit4-ant\target\dependency\randomizedtesting-runner-2.1.0-SNAPSHOT.jar
10-Mar-2014 11:46:33 [INFO] Copying asm-5.0_BETA.jar to E:\xml-data\build-dir\RNDTEST-SOFTWARE-JDK17\junit4-ant\target\dependency\asm-5.0_BETA.jar
10-Mar-2014 11:46:33 [INFO]
10-Mar-2014 11:46:33 [INFO] >>> exec-maven-plugin:1.2.1:java (default) @ junit4-ant >>>
10-Mar-2014 11:46:33 [INFO]
10-Mar-2014 11:46:33 [INFO] --- maven-enforcer-plugin:1.2:enforce (enforce-maven) @ junit4-ant ---
10-Mar-2014 11:46:33 [INFO]
10-Mar-2014 11:46:33 [INFO] <<< exec-maven-plugin:1.2.1:java (default) @ junit4-ant <<<
10-Mar-2014 11:46:33 [INFO]
10-Mar-2014 11:46:33 [INFO] --- exec-maven-plugin:1.2.1:java (default) @ junit4-ant ---
10-Mar-2014 11:46:33 Dumping rt.jar path to: E:\xml-data\build-dir\RNDTEST-SOFTWARE-JDK17\junit4-ant\target/rt.jar.pro
10-Mar-2014 11:46:33 [INFO]
10-Mar-2014 11:46:33 [INFO] --- proguard-maven-plugin:2.0.4:proguard (default) @ junit4-ant ---
10-Mar-2014 11:46:33 [INFO] execute ProGuard [-injars, 'C:\Users\bamboo\.m2\repository\com\google\guava\guava\16.0.1\guava-16.0.1.jar'(!META-INF/MANIFEST.MF,!com/google/common/eventbus/SynchronizedEventHandler.class), -injars, 'C:\Users\bamboo\.m2\repository\org\ow2\asm\asm\5.0_BETA\asm-5.0_BETA.jar'(!META-INF/MANIFEST.MF), -injars, 'C:\Users\bamboo\.m2\repository\commons-io\commons-io\2.3\commons-io-2.3.jar'(!META-INF/MANIFEST.MF), -injars, 'C:\Users\bamboo\.m2\repository\org\simpleframework\simple-xml\2.6.2\simple-xml-2.6.2.jar'(!META-INF/MANIFEST.MF), -injars, 'C:\Users\bamboo\.m2\repository\com\google\code\gson\gson\2.0\gson-2.0.jar'(!META-INF/MANIFEST.MF), -injars, 'E:\xml-data\build-dir\RNDTEST-SOFTWARE-JDK17\randomized-runner\target\randomizedtesting-runner-2.1.0-SNAPSHOT.jar'(!META-INF/MANIFEST.MF), -injars, 'E:\xml-data\build-dir\RNDTEST-SOFTWARE-JDK17\junit4-ant\target\junit4-ant-2.1.0-SNAPSHOT_proguard_base.jar', -outjars, 'E:\xml-data\build-dir\RNDTEST-SOFTWARE-JDK17\junit4-ant\target\junit4-ant-2.1.0-SNAPSHOT.jar', -include, 'E:\xml-data\build-dir\RNDTEST-SOFTWARE-JDK17\junit4-ant\src\proguard\rules.pro', -libraryjars, 'C:\Users\bamboo\.m2\repository\org\apache\ant\ant\1.8.2\ant-1.8.2.jar', -libraryjars, 'C:\Users\bamboo\.m2\repository\org\apache\ant\ant-launcher\1.8.2\ant-launcher-1.8.2.jar', -libraryjars, 'C:\Users\bamboo\.m2\repository\org\apache\ant\ant-junit\1.8.2\ant-junit-1.8.2.jar', -libraryjars, 'C:\Users\bamboo\.m2\repository\junit\junit\4.10\junit-4.10.jar', -libraryjars, 'C:\Users\bamboo\.m2\repository\stax\stax-api\1.0.1\stax-api-1.0.1.jar', -libraryjars, 'C:\Users\bamboo\.m2\repository\stax\stax\1.2.0\stax-1.2.0.jar', -libraryjars, 'C:\Users\bamboo\.m2\repository\xpp3\xpp3\1.1.3.3\xpp3-1.1.3.3.jar', -printmapping, 'E:\xml-data\build-dir\RNDTEST-SOFTWARE-JDK17\junit4-ant\target\proguard_map.txt', -printseeds, 'E:\xml-data\build-dir\RNDTEST-SOFTWARE-JDK17\junit4-ant\target\proguard_seeds.txt', -include E:\xml-data\build-dir\RNDTEST-SOFTWARE-JDK17\junit4-ant\target/rt.jar.pro, -printusage E:\xml-data\build-dir\RNDTEST-SOFTWARE-JDK17\junit4-ant\target/proguard_dead.txt]
10-Mar-2014 11:46:33 [INFO] proguard jar: E:\xml-data\build-dir\RNDTEST-SOFTWARE-JDK17\junit4-ant\lib\proguard.jar
10-Mar-2014 11:46:34 [proguard] ProGuard, version 4.7 beta2
10-Mar-2014 11:46:34 [proguard] Reading program jar [C:\Users\bamboo\.m2\repository\com\google\guava\guava\16.0.1\guava-16.0.1.jar] (filtered)
10-Mar-2014 11:46:34 [proguard] Reading program jar [C:\Users\bamboo\.m2\repository\org\ow2\asm\asm\5.0_BETA\asm-5.0_BETA.jar] (filtered)
10-Mar-2014 11:46:34 [proguard] Reading program jar [C:\Users\bamboo\.m2\repository\commons-io\commons-io\2.3\commons-io-2.3.jar] (filtered)
10-Mar-2014 11:46:34 [proguard] Reading program jar [C:\Users\bamboo\.m2\repository\org\simpleframework\simple-xml\2.6.2\simple-xml-2.6.2.jar] (filtered)
10-Mar-2014 11:46:34 [proguard] Reading program jar [C:\Users\bamboo\.m2\repository\com\google\code\gson\gson\2.0\gson-2.0.jar] (filtered)
10-Mar-2014 11:46:34 [proguard] Reading program jar [E:\xml-data\build-dir\RNDTEST-SOFTWARE-JDK17\randomized-runner\target\randomizedtesting-runner-2.1.0-SNAPSHOT.jar] (filtered)
10-Mar-2014 11:46:34 [proguard] Reading program jar [E:\xml-data\build-dir\RNDTEST-SOFTWARE-JDK17\junit4-ant\target\junit4-ant-2.1.0-SNAPSHOT_proguard_base.jar]
10-Mar-2014 11:46:34 [proguard] Reading library jar [C:\Users\bamboo\.m2\repository\org\apache\ant\ant\1.8.2\ant-1.8.2.jar]
10-Mar-2014 11:46:35 [proguard] Reading library jar [C:\Users\bamboo\.m2\repository\org\apache\ant\ant-launcher\1.8.2\ant-launcher-1.8.2.jar]
10-Mar-2014 11:46:35 [proguard] Reading library jar [C:\Users\bamboo\.m2\repository\org\apache\ant\ant-junit\1.8.2\ant-junit-1.8.2.jar]
10-Mar-2014 11:46:35 [proguard] Reading library jar [C:\Users\bamboo\.m2\repository\junit\junit\4.10\junit-4.10.jar]
10-Mar-2014 11:46:35 [proguard] Reading library jar [C:\Users\bamboo\.m2\repository\stax\stax-api\1.0.1\stax-api-1.0.1.jar]
10-Mar-2014 11:46:35 [proguard] Reading library jar [C:\Users\bamboo\.m2\repository\stax\stax\1.2.0\stax-1.2.0.jar]
10-Mar-2014 11:46:35 [proguard] Reading library jar [C:\Users\bamboo\.m2\repository\xpp3\xpp3\1.1.3.3\xpp3-1.1.3.3.jar]
10-Mar-2014 11:46:35 [proguard] Reading library jar [D:\dev\java\jdk\oracle-jdk1.7.0\jre\lib\rt.jar] (filtered)
10-Mar-2014 11:46:37 [proguard] Preparing output jar [E:\xml-data\build-dir\RNDTEST-SOFTWARE-JDK17\junit4-ant\target\junit4-ant-2.1.0-SNAPSHOT.jar]
10-Mar-2014 11:46:37 [proguard]   Copying resources from program jar [C:\Users\bamboo\.m2\repository\com\google\guava\guava\16.0.1\guava-16.0.1.jar] (filtered)
10-Mar-2014 11:46:37 [proguard]   Copying resources from program jar [C:\Users\bamboo\.m2\repository\org\ow2\asm\asm\5.0_BETA\asm-5.0_BETA.jar] (filtered)
10-Mar-2014 11:46:37 [proguard]   Copying resources from program jar [C:\Users\bamboo\.m2\repository\commons-io\commons-io\2.3\commons-io-2.3.jar] (filtered)
10-Mar-2014 11:46:37 [proguard]   Copying resources from program jar [C:\Users\bamboo\.m2\repository\org\simpleframework\simple-xml\2.6.2\simple-xml-2.6.2.jar] (filtered)
10-Mar-2014 11:46:37 [proguard]   Copying resources from program jar [C:\Users\bamboo\.m2\repository\com\google\code\gson\gson\2.0\gson-2.0.jar] (filtered)
10-Mar-2014 11:46:37 [proguard]   Copying resources from program jar [E:\xml-data\build-dir\RNDTEST-SOFTWARE-JDK17\randomized-runner\target\randomizedtesting-runner-2.1.0-SNAPSHOT.jar] (filtered)
10-Mar-2014 11:46:37 [proguard]   Copying resources from program jar [E:\xml-data\build-dir\RNDTEST-SOFTWARE-JDK17\junit4-ant\target\junit4-ant-2.1.0-SNAPSHOT_proguard_base.jar]
10-Mar-2014 11:46:38 [INFO]
10-Mar-2014 11:46:38 [INFO] --- maven-surefire-plugin:2.10:test (surefire-it) @ junit4-ant ---
10-Mar-2014 11:46:38 [INFO] Surefire report directory: E:\xml-data\build-dir\RNDTEST-SOFTWARE-JDK17\junit4-ant\target\surefire-reports
10-Mar-2014 11:46:38
10-Mar-2014 11:46:38 -------------------------------------------------------
10-Mar-2014 11:46:38 T E S T S
10-Mar-2014 11:46:38 -------------------------------------------------------
10-Mar-2014 11:46:38 Running com.carrotsearch.ant.tasks.junit4.it.TestAltJavaVendors
10-Mar-2014 11:46:38 Tests run: 1, Failures: 0, Errors: 0, Skipped: 1, Time elapsed: 0.39 sec
10-Mar-2014 11:46:38 Running com.carrotsearch.ant.tasks.junit4.it.TestAntXmlReport
10-Mar-2014 11:46:39 Tests run: 1, Failures: 0, Errors: 0, Skipped: 0, Time elapsed: 1.279 sec
10-Mar-2014 11:46:39 Running com.carrotsearch.ant.tasks.junit4.it.TestChildVmSysprops
10-Mar-2014 11:46:40 Tests run: 1, Failures: 0, Errors: 0, Skipped: 0, Time elapsed: 0.873 sec
10-Mar-2014 11:46:40 Running com.carrotsearch.ant.tasks.junit4.it.TestCrashesAndExceptions
10-Mar-2014 11:46:44 Tests run: 2, Failures: 0, Errors: 0, Skipped: 0, Time elapsed: 3.277 sec
10-Mar-2014 11:46:44 Running com.carrotsearch.ant.tasks.junit4.it.TestCwdConflict
10-Mar-2014 11:46:44 Tests run: 1, Failures: 0, Errors: 0, Skipped: 0, Time elapsed: 0.78 sec
10-Mar-2014 11:46:44 Running com.carrotsearch.ant.tasks.junit4.it.TestDuplicateResourceCollections
10-Mar-2014 11:46:46 Tests run: 1, Failures: 0, Errors: 0, Skipped: 0, Time elapsed: 1.326 sec
10-Mar-2014 11:46:46 Running com.carrotsearch.ant.tasks.junit4.it.TestFileEncodings
10-Mar-2014 11:46:49 Tests run: 1, Failures: 0, Errors: 0, Skipped: 0, Time elapsed: 3.51 sec
10-Mar-2014 11:46:49 Running com.carrotsearch.ant.tasks.junit4.it.TestFiltering
10-Mar-2014 11:46:51 Tests run: 3, Failures: 0, Errors: 0, Skipped: 0, Time elapsed: 2.277 sec
10-Mar-2014 11:46:51 Running com.carrotsearch.ant.tasks.junit4.it.TestHeartbeat
10-Mar-2014 11:46:55 Tests run: 1, Failures: 0, Errors: 0, Skipped: 0, Time elapsed: 3.666 sec
10-Mar-2014 11:46:55 Running com.carrotsearch.ant.tasks.junit4.it.TestIfNoTestsOption
10-Mar-2014 11:47:00 Tests run: 6, Failures: 0, Errors: 0, Skipped: 0, Time elapsed: 4.399 sec
10-Mar-2014 11:47:00 Running com.carrotsearch.ant.tasks.junit4.it.TestJsonReport
10-Mar-2014 11:47:01 Tests run: 1, Failures: 0, Errors: 0, Skipped: 0, Time elapsed: 1.092 sec
10-Mar-2014 11:47:01 Running com.carrotsearch.ant.tasks.junit4.it.TestJUnitCompat
10-Mar-2014 11:47:01 Tests run: 3, Failures: 0, Errors: 0, Skipped: 0, Time elapsed: 0.141 sec
10-Mar-2014 11:47:01 Running com.carrotsearch.ant.tasks.junit4.it.TestJvmLogging
10-Mar-2014 11:47:02 Tests run: 2, Failures: 0, Errors: 0, Skipped: 0, Time elapsed: 1.482 sec
10-Mar-2014 11:47:02 Running com.carrotsearch.ant.tasks.junit4.it.TestMiscJUnit4Attributes
10-Mar-2014 11:47:21 Tests run: 16, Failures: 0, Errors: 0, Skipped: 0, Time elapsed: 18.985 sec
10-Mar-2014 11:47:21 Running com.carrotsearch.ant.tasks.junit4.it.TestOomCode
10-Mar-2014 11:47:21 Tests run: 1, Failures: 0, Errors: 0, Skipped: 1, Time elapsed: 0 sec
10-Mar-2014 11:47:21 Running com.carrotsearch.ant.tasks.junit4.it.TestOomPermGen
10-Mar-2014 11:47:21 Tests run: 1, Failures: 0, Errors: 0, Skipped: 1, Time elapsed: 0 sec
10-Mar-2014 11:47:21 Running com.carrotsearch.ant.tasks.junit4.it.TestOutputCapture
10-Mar-2014 11:47:24 Tests run: 3, Failures: 0, Errors: 0, Skipped: 0, Time elapsed: 2.454 sec
10-Mar-2014 11:47:24 Running com.carrotsearch.ant.tasks.junit4.it.TestPickSeed
10-Mar-2014 11:47:28 Tests run: 1, Failures: 0, Errors: 0, Skipped: 0, Time elapsed: 4.056 sec
10-Mar-2014 11:47:28 Running com.carrotsearch.ant.tasks.junit4.it.TestPreconditions
10-Mar-2014 11:47:35 Tests run: 4, Failures: 0, Errors: 0, Skipped: 0, Time elapsed: 7.129 sec
10-Mar-2014 11:47:35 Running com.carrotsearch.ant.tasks.junit4.it.TestReplication
10-Mar-2014 11:47:38 Tests run: 3, Failures: 0, Errors: 0, Skipped: 0, Time elapsed: 3.619 sec
10-Mar-2014 11:47:38 Running com.carrotsearch.ant.tasks.junit4.it.TestShutdownHookDeadlock
10-Mar-2014 11:47:45 Tests run: 1, Failures: 0, Errors: 0, Skipped: 0, Time elapsed: 6.552 sec
10-Mar-2014 11:47:45 Running com.carrotsearch.ant.tasks.junit4.it.TestSourceSuitesAsInput
10-Mar-2014 11:47:46 Tests run: 1, Failures: 0, Errors: 0, Skipped: 0, Time elapsed: 0.702 sec
10-Mar-2014 11:47:46 Running com.carrotsearch.ant.tasks.junit4.it.TestStatsProperties
10-Mar-2014 11:47:47 Tests run: 1, Failures: 0, Errors: 0, Skipped: 0, Time elapsed: 1.264 sec
10-Mar-2014 11:47:47 Running com.carrotsearch.ant.tasks.junit4.it.TestSuiteClassesBad
10-Mar-2014 11:47:48 Tests run: 2, Failures: 0, Errors: 0, Skipped: 0, Time elapsed: 0.749 sec
10-Mar-2014 11:47:48 Running com.carrotsearch.ant.tasks.junit4.it.TestSuiteDuplicates
10-Mar-2014 11:47:48 Tests run: 1, Failures: 0, Errors: 0, Skipped: 0, Time elapsed: 0.733 sec
10-Mar-2014 11:47:48 Running com.carrotsearch.ant.tasks.junit4.it.TestSysoutOOM
10-Mar-2014 11:47:52 Tests run: 1, Failures: 0, Errors: 0, Skipped: 0, Time elapsed: 3.167 sec
10-Mar-2014 11:47:52 Running com.carrotsearch.ant.tasks.junit4.it.TestSysProperties
10-Mar-2014 11:47:57 Tests run: 6, Failures: 0, Errors: 0, Skipped: 0, Time elapsed: 5.116 sec
10-Mar-2014 11:47:57 Running com.carrotsearch.ant.tasks.junit4.it.TestSysPropertySet
10-Mar-2014 11:47:58 Tests run: 1, Failures: 0, Errors: 0, Skipped: 0, Time elapsed: 0.734 sec
10-Mar-2014 11:47:58 Running com.carrotsearch.ant.tasks.junit4.it.TestTextReport
10-Mar-2014 11:48:17 Tests run: 12, Failures: 0, Errors: 0, Skipped: 0, Time elapsed: 19.375 sec
10-Mar-2014 11:48:17 Running com.carrotsearch.ant.tasks.junit4.it.TestUnhandledSlaveFailure
10-Mar-2014 11:48:20 Tests run: 1, Failures: 0, Errors: 0, Skipped: 0, Time elapsed: 2.839 sec
10-Mar-2014 11:48:20 Running com.carrotsearch.ant.tasks.junit4.it.TestWeirdClasses
10-Mar-2014 11:48:20 Tests run: 1, Failures: 0, Errors: 0, Skipped: 0, Time elapsed: 0.094 sec
10-Mar-2014 11:48:20
10-Mar-2014 11:48:20 Results :
10-Mar-2014 11:48:20
10-Mar-2014 11:48:20 Tests run: 81, Failures: 0, Errors: 0, Skipped: 3
10-Mar-2014 11:48:20
10-Mar-2014 11:48:20 [INFO]                                                                         
10-Mar-2014 11:48:20 [INFO] ------------------------------------------------------------------------
10-Mar-2014 11:48:20 [INFO] Building RandomizedTesting JUnit4 Maven Plugin 2.1.0-SNAPSHOT
10-Mar-2014 11:48:20 [INFO] ------------------------------------------------------------------------
10-Mar-2014 11:48:20 [INFO]
10-Mar-2014 11:48:20 [INFO] --- maven-clean-plugin:2.4.1:clean (default-clean) @ junit4-maven-plugin ---
10-Mar-2014 11:48:20 [INFO] Deleting E:\xml-data\build-dir\RNDTEST-SOFTWARE-JDK17\junit4-maven-plugin\target
10-Mar-2014 11:48:20 [INFO]
10-Mar-2014 11:48:20 [INFO] --- maven-enforcer-plugin:1.2:enforce (enforce-maven) @ junit4-maven-plugin ---
10-Mar-2014 11:48:20 [INFO]
10-Mar-2014 11:48:20 [INFO] --- maven-plugin-plugin:3.2:helpmojo (generated-helpmojo) @ junit4-maven-plugin ---
10-Mar-2014 11:48:20 [INFO] Using 'UTF-8' encoding to read mojo metadata.
10-Mar-2014 11:48:20 [INFO] Applying mojo extractor for language: java
10-Mar-2014 11:48:20 [INFO] Mojo extractor for language: java found 1 mojo descriptors.
10-Mar-2014 11:48:20 [INFO]
10-Mar-2014 11:48:20 [INFO] --- maven-plugin-plugin:3.2:descriptor (default-descriptor) @ junit4-maven-plugin ---
10-Mar-2014 11:48:20 [INFO] Using 'UTF-8' encoding to read mojo metadata.
10-Mar-2014 11:48:20 [INFO] Applying mojo extractor for language: java
10-Mar-2014 11:48:20 [INFO] Mojo extractor for language: java found 2 mojo descriptors.
10-Mar-2014 11:48:20 [INFO]
10-Mar-2014 11:48:20 [INFO] --- maven-resources-plugin:2.5:resources (default-resources) @ junit4-maven-plugin ---
10-Mar-2014 11:48:20 [debug] execute contextualize
10-Mar-2014 11:48:20 [INFO] Using 'UTF-8' encoding to copy filtered resources.
10-Mar-2014 11:48:20 [INFO] skip non existing resourceDirectory E:\xml-data\build-dir\RNDTEST-SOFTWARE-JDK17\junit4-maven-plugin\src\main\resources
10-Mar-2014 11:48:20 [INFO]
10-Mar-2014 11:48:20 [INFO] --- maven-compiler-plugin:3.1:compile (default-compile) @ junit4-maven-plugin ---
10-Mar-2014 11:48:20 [INFO] Changes detected - recompiling the module!
10-Mar-2014 11:48:20 [INFO] Compiling 3 source files to E:\xml-data\build-dir\RNDTEST-SOFTWARE-JDK17\junit4-maven-plugin\target\classes
10-Mar-2014 11:48:21 [INFO]
10-Mar-2014 11:48:21 [INFO] --- maven-resources-plugin:2.5:testResources (default-testResources) @ junit4-maven-plugin ---
10-Mar-2014 11:48:21 [debug] execute contextualize
10-Mar-2014 11:48:21 [INFO] Using 'UTF-8' encoding to copy filtered resources.
10-Mar-2014 11:48:21 [INFO] skip non existing resourceDirectory E:\xml-data\build-dir\RNDTEST-SOFTWARE-JDK17\junit4-maven-plugin\src\test\resources
10-Mar-2014 11:48:21 [INFO]
10-Mar-2014 11:48:21 [INFO] --- maven-compiler-plugin:3.1:testCompile (default-testCompile) @ junit4-maven-plugin ---
10-Mar-2014 11:48:21 [INFO] No sources to compile
10-Mar-2014 11:48:21 [INFO]
10-Mar-2014 11:48:21 [INFO] --- maven-surefire-plugin:2.10:test (default-test) @ junit4-maven-plugin ---
10-Mar-2014 11:48:21 [INFO] No tests to run.
10-Mar-2014 11:48:21 [INFO] Surefire report directory: E:\xml-data\build-dir\RNDTEST-SOFTWARE-JDK17\junit4-maven-plugin\target\surefire-reports
10-Mar-2014 11:48:21
10-Mar-2014 11:48:21 -------------------------------------------------------
10-Mar-2014 11:48:21 T E S T S
10-Mar-2014 11:48:21 -------------------------------------------------------
10-Mar-2014 11:48:21
10-Mar-2014 11:48:21 Results :
10-Mar-2014 11:48:21
10-Mar-2014 11:48:21 Tests run: 0, Failures: 0, Errors: 0, Skipped: 0
10-Mar-2014 11:48:21
10-Mar-2014 11:48:21 [INFO]
10-Mar-2014 11:48:21 [INFO] --- maven-jar-plugin:2.3.2:jar (default-jar) @ junit4-maven-plugin ---
10-Mar-2014 11:48:21 [INFO] Building jar: E:\xml-data\build-dir\RNDTEST-SOFTWARE-JDK17\junit4-maven-plugin\target\junit4-maven-plugin-2.1.0-SNAPSHOT.jar
10-Mar-2014 11:48:21 [INFO]
10-Mar-2014 11:48:21 [INFO] --- maven-plugin-plugin:3.2:addPluginArtifactMetadata (default-addPluginArtifactMetadata) @ junit4-maven-plugin ---
10-Mar-2014 11:48:21 [INFO]                                                                         
10-Mar-2014 11:48:21 [INFO] ------------------------------------------------------------------------
10-Mar-2014 11:48:21 [INFO] Building RandomizedTesting JUnit4 Maven Plugin Tests 2.1.0-SNAPSHOT
10-Mar-2014 11:48:21 [INFO] ------------------------------------------------------------------------
10-Mar-2014 11:48:21 [INFO]
10-Mar-2014 11:48:21 [INFO] --- maven-clean-plugin:2.4.1:clean (default-clean) @ junit4-maven-plugin-tests ---
10-Mar-2014 11:48:21 [INFO] Deleting E:\xml-data\build-dir\RNDTEST-SOFTWARE-JDK17\junit4-maven-plugin-tests\target
10-Mar-2014 11:48:21 [INFO]
10-Mar-2014 11:48:21 [INFO] --- maven-enforcer-plugin:1.2:enforce (enforce-maven) @ junit4-maven-plugin-tests ---
10-Mar-2014 11:48:21 [INFO]
10-Mar-2014 11:48:21 [INFO] --- maven-resources-plugin:2.5:resources (default-resources) @ junit4-maven-plugin-tests ---
10-Mar-2014 11:48:21 [debug] execute contextualize
10-Mar-2014 11:48:21 [INFO] Using 'UTF-8' encoding to copy filtered resources.
10-Mar-2014 11:48:21 [INFO] skip non existing resourceDirectory E:\xml-data\build-dir\RNDTEST-SOFTWARE-JDK17\junit4-maven-plugin-tests\src\main\resources
10-Mar-2014 11:48:21 [INFO]
10-Mar-2014 11:48:21 [INFO] --- maven-compiler-plugin:3.1:compile (default-compile) @ junit4-maven-plugin-tests ---
10-Mar-2014 11:48:21 [INFO] No sources to compile
10-Mar-2014 11:48:21 [INFO]
10-Mar-2014 11:48:21 [INFO] --- maven-resources-plugin:2.5:testResources (default-testResources) @ junit4-maven-plugin-tests ---
10-Mar-2014 11:48:21 [debug] execute contextualize
10-Mar-2014 11:48:21 [INFO] Using 'UTF-8' encoding to copy filtered resources.
10-Mar-2014 11:48:21 [INFO] skip non existing resourceDirectory E:\xml-data\build-dir\RNDTEST-SOFTWARE-JDK17\junit4-maven-plugin-tests\src\test\resources
10-Mar-2014 11:48:21 [INFO]
10-Mar-2014 11:48:21 [INFO] --- maven-compiler-plugin:3.1:testCompile (default-testCompile) @ junit4-maven-plugin-tests ---
10-Mar-2014 11:48:21 [INFO] Changes detected - recompiling the module!
10-Mar-2014 11:48:21 [INFO] Compiling 1 source file to E:\xml-data\build-dir\RNDTEST-SOFTWARE-JDK17\junit4-maven-plugin-tests\target\test-classes
10-Mar-2014 11:48:21 [INFO]
10-Mar-2014 11:48:21 [INFO] --- maven-surefire-plugin:2.10:test (default-test) @ junit4-maven-plugin-tests ---
10-Mar-2014 11:48:21 [INFO] Surefire report directory: E:\xml-data\build-dir\RNDTEST-SOFTWARE-JDK17\junit4-maven-plugin-tests\target\surefire-reports
10-Mar-2014 11:48:21
10-Mar-2014 11:48:21 -------------------------------------------------------
10-Mar-2014 11:48:21 T E S T S
10-Mar-2014 11:48:21 -------------------------------------------------------
10-Mar-2014 11:48:21
10-Mar-2014 11:48:21 Results :
10-Mar-2014 11:48:21
10-Mar-2014 11:48:21 Tests run: 0, Failures: 0, Errors: 0, Skipped: 0
10-Mar-2014 11:48:21
10-Mar-2014 11:48:21 [INFO]
10-Mar-2014 11:48:21 [INFO] --- maven-jar-plugin:2.3.2:jar (default-jar) @ junit4-maven-plugin-tests ---
10-Mar-2014 11:48:21 [WARNING] JAR will be empty - no content was marked for inclusion!
10-Mar-2014 11:48:21 [INFO] Building jar: E:\xml-data\build-dir\RNDTEST-SOFTWARE-JDK17\junit4-maven-plugin-tests\target\junit4-maven-plugin-tests-2.1.0-SNAPSHOT.jar
10-Mar-2014 11:48:21 [INFO]
10-Mar-2014 11:48:21 [INFO] --- maven-invoker-plugin:1.5:install (integration-test) @ junit4-maven-plugin-tests ---
10-Mar-2014 11:48:22 [INFO] Installing E:\xml-data\build-dir\RNDTEST-SOFTWARE-JDK17\randomized-runner\pom.xml to E:\xml-data\build-dir\RNDTEST-SOFTWARE-JDK17\junit4-maven-plugin-tests\target\local-repo\com\carrotsearch\randomizedtesting\randomizedtesting-runner\2.1.0-SNAPSHOT\randomizedtesting-runner-2.1.0-SNAPSHOT.pom
10-Mar-2014 11:48:22 [INFO] Installing E:\xml-data\build-dir\RNDTEST-SOFTWARE-JDK17\randomized-runner\target\randomizedtesting-runner-2.1.0-SNAPSHOT.jar to E:\xml-data\build-dir\RNDTEST-SOFTWARE-JDK17\junit4-maven-plugin-tests\target\local-repo\com\carrotsearch\randomizedtesting\randomizedtesting-runner\2.1.0-SNAPSHOT\randomizedtesting-runner-2.1.0-SNAPSHOT.jar
10-Mar-2014 11:48:22 [INFO] Installing E:\xml-data\build-dir\RNDTEST-SOFTWARE-JDK17\pom.xml to E:\xml-data\build-dir\RNDTEST-SOFTWARE-JDK17\junit4-maven-plugin-tests\target\local-repo\com\carrotsearch\randomizedtesting\randomizedtesting-parent\2.1.0-SNAPSHOT\randomizedtesting-parent-2.1.0-SNAPSHOT.pom
10-Mar-2014 11:48:22 [INFO] Installing E:\xml-data\build-dir\RNDTEST-SOFTWARE-JDK17\junit4-maven-plugin\pom.xml to E:\xml-data\build-dir\RNDTEST-SOFTWARE-JDK17\junit4-maven-plugin-tests\target\local-repo\com\carrotsearch\randomizedtesting\junit4-maven-plugin\2.1.0-SNAPSHOT\junit4-maven-plugin-2.1.0-SNAPSHOT.pom
10-Mar-2014 11:48:22 [INFO] Installing E:\xml-data\build-dir\RNDTEST-SOFTWARE-JDK17\junit4-maven-plugin\target\junit4-maven-plugin-2.1.0-SNAPSHOT.jar to E:\xml-data\build-dir\RNDTEST-SOFTWARE-JDK17\junit4-maven-plugin-tests\target\local-repo\com\carrotsearch\randomizedtesting\junit4-maven-plugin\2.1.0-SNAPSHOT\junit4-maven-plugin-2.1.0-SNAPSHOT.jar
10-Mar-2014 11:48:22 [INFO] Installing E:\xml-data\build-dir\RNDTEST-SOFTWARE-JDK17\junit4-ant\pom.xml to E:\xml-data\build-dir\RNDTEST-SOFTWARE-JDK17\junit4-maven-plugin-tests\target\local-repo\com\carrotsearch\randomizedtesting\junit4-ant\2.1.0-SNAPSHOT\junit4-ant-2.1.0-SNAPSHOT.pom
10-Mar-2014 11:48:22 [INFO] Installing E:\xml-data\build-dir\RNDTEST-SOFTWARE-JDK17\junit4-ant\target\junit4-ant-2.1.0-SNAPSHOT.jar to E:\xml-data\build-dir\RNDTEST-SOFTWARE-JDK17\junit4-maven-plugin-tests\target\local-repo\com\carrotsearch\randomizedtesting\junit4-ant\2.1.0-SNAPSHOT\junit4-ant-2.1.0-SNAPSHOT.jar
10-Mar-2014 11:48:22 [INFO] Installing E:\xml-data\build-dir\RNDTEST-SOFTWARE-JDK17\junit4-maven-plugin-tests\pom.xml to E:\xml-data\build-dir\RNDTEST-SOFTWARE-JDK17\junit4-maven-plugin-tests\target\local-repo\com\carrotsearch\randomizedtesting\junit4-maven-plugin-tests\2.1.0-SNAPSHOT\junit4-maven-plugin-tests-2.1.0-SNAPSHOT.pom
10-Mar-2014 11:48:22 [INFO] Installing E:\xml-data\build-dir\RNDTEST-SOFTWARE-JDK17\junit4-maven-plugin-tests\target\junit4-maven-plugin-tests-2.1.0-SNAPSHOT.jar to E:\xml-data\build-dir\RNDTEST-SOFTWARE-JDK17\junit4-maven-plugin-tests\target\local-repo\com\carrotsearch\randomizedtesting\junit4-maven-plugin-tests\2.1.0-SNAPSHOT\junit4-maven-plugin-tests-2.1.0-SNAPSHOT.jar
10-Mar-2014 11:48:22 [INFO]
10-Mar-2014 11:48:22 [INFO] --- maven-invoker-plugin:1.5:run (integration-test) @ junit4-maven-plugin-tests ---
10-Mar-2014 11:48:22 [INFO] Building: 01-basic-test\pom.xml
10-Mar-2014 11:48:26 [INFO] ..SUCCESS (4.1 s)
10-Mar-2014 11:48:26 [INFO] -------------------------------------------------
10-Mar-2014 11:48:26 [INFO] Build Summary:
10-Mar-2014 11:48:26 [INFO]   Passed: 1, Failed: 0, Errors: 0, Skipped: 0
10-Mar-2014 11:48:26 [INFO] -------------------------------------------------
10-Mar-2014 11:48:26 [INFO]                                                                         
10-Mar-2014 11:48:26 [INFO] ------------------------------------------------------------------------
10-Mar-2014 11:48:26 [INFO] Building RandomizedTesting Examples 2.1.0-SNAPSHOT
10-Mar-2014 11:48:26 [INFO] ------------------------------------------------------------------------
10-Mar-2014 11:48:26 [INFO]
10-Mar-2014 11:48:26 [INFO] --- maven-clean-plugin:2.4.1:clean (default-clean) @ randomizedtesting-examples ---
10-Mar-2014 11:48:26 [INFO] Deleting E:\xml-data\build-dir\RNDTEST-SOFTWARE-JDK17\examples\maven\target
10-Mar-2014 11:48:26 [INFO]
10-Mar-2014 11:48:26 [INFO] --- maven-enforcer-plugin:1.2:enforce (enforce-maven) @ randomizedtesting-examples ---
10-Mar-2014 11:48:26 [INFO]
10-Mar-2014 11:48:26 [INFO] --- maven-resources-plugin:2.5:resources (default-resources) @ randomizedtesting-examples ---
10-Mar-2014 11:48:26 [debug] execute contextualize
10-Mar-2014 11:48:26 [INFO] Using 'UTF-8' encoding to copy filtered resources.
10-Mar-2014 11:48:26 [INFO] skip non existing resourceDirectory E:\xml-data\build-dir\RNDTEST-SOFTWARE-JDK17\examples\maven\src\main\resources
10-Mar-2014 11:48:26 [INFO]
10-Mar-2014 11:48:26 [INFO] --- maven-compiler-plugin:3.1:compile (default-compile) @ randomizedtesting-examples ---
10-Mar-2014 11:48:26 [INFO] Changes detected - recompiling the module!
10-Mar-2014 11:48:26 [INFO] Compiling 25 source files to E:\xml-data\build-dir\RNDTEST-SOFTWARE-JDK17\examples\maven\target\classes
10-Mar-2014 11:48:26 [INFO]
10-Mar-2014 11:48:26 [INFO] --- maven-resources-plugin:2.5:testResources (default-testResources) @ randomizedtesting-examples ---
10-Mar-2014 11:48:26 [debug] execute contextualize
10-Mar-2014 11:48:26 [INFO] Using 'UTF-8' encoding to copy filtered resources.
10-Mar-2014 11:48:26 [INFO] skip non existing resourceDirectory E:\xml-data\build-dir\RNDTEST-SOFTWARE-JDK17\examples\maven\src\test\resources
10-Mar-2014 11:48:26 [INFO]
10-Mar-2014 11:48:26 [INFO] --- maven-compiler-plugin:3.1:testCompile (default-testCompile) @ randomizedtesting-examples ---
10-Mar-2014 11:48:26 [INFO] No sources to compile
10-Mar-2014 11:48:26 [INFO]
10-Mar-2014 11:48:26 [INFO] --- maven-surefire-plugin:2.10:test (default-test) @ randomizedtesting-examples ---
10-Mar-2014 11:48:26 [INFO] Tests are skipped.
10-Mar-2014 11:48:26 [INFO]
10-Mar-2014 11:48:26 [INFO] --- junit4-maven-plugin:2.1.0-SNAPSHOT:junit4 (junit4-tests) @ randomizedtesting-examples ---
10-Mar-2014 11:48:26 [INFO] <JUnit4> says olá! Master seed: BEEE8BF9CAB3537
10-Mar-2014 11:48:26 [INFO] Your default console's encoding may not display certain unicode glyphs: windows-1250
10-Mar-2014 11:48:26 Executing 25 suites with 1 JVM.
10-Mar-2014 11:48:26
10-Mar-2014 11:48:27 Started J0 PID(1964@WINDEX).
10-Mar-2014 11:48:27 IGNOR/A 0.03s | Test011NightlyTests.nightlyOnlyWithAssume
10-Mar-2014 11:48:27 OK      0.02s | Test011NightlyTests.scaling
10-Mar-2014 11:48:27 IGNOR/A 0.00s | Test011NightlyTests.nightlyOnly
10-Mar-2014 11:48:27 FAILURE 0.02s | Test014Listeners.failure <<<
10-Mar-2014 11:48:28 OK      0.05s | Test010Lingering.executorLeak {#0 seed=[BEEE8BF9CAB3537:56FC064D423FEADE]}
10-Mar-2014 11:48:28 OK      0.03s | Test010Lingering.executorLeak {#1 seed=[BEEE8BF9CAB3537:E2AABAB176FD21F2]}
10-Mar-2014 11:48:28 OK      0.03s | Test010Lingering.executorLeak {#2 seed=[BEEE8BF9CAB3537:6C432C6D27396939]}
10-Mar-2014 11:48:28 OK      0.03s | Test010Lingering.executorLeak {#3 seed=[BEEE8BF9CAB3537:5DAD87884BC73210]}
10-Mar-2014 11:48:28 OK      0.03s | Test010Lingering.executorLeak {#4 seed=[BEEE8BF9CAB3537:116C0225EACFF2AB]}
10-Mar-2014 11:48:28 OK      0.03s | Test010Lingering.executorLeak {#5 seed=[BEEE8BF9CAB3537:8096D17A9773BFAB]}
10-Mar-2014 11:48:28 OK      0.03s | Test010Lingering.executorLeak {#6 seed=[BEEE8BF9CAB3537:BE48B5FC8543AFAD]}
10-Mar-2014 11:48:28 OK      0.03s | Test010Lingering.executorLeak {#7 seed=[BEEE8BF9CAB3537:22FB2F86A6573B03]}
10-Mar-2014 11:48:28 OK      0.03s | Test010Lingering.executorLeak {#8 seed=[BEEE8BF9CAB3537:1057CAE8D19C2C59]}
10-Mar-2014 11:48:28 OK      0.03s | Test010Lingering.executorLeak {#9 seed=[BEEE8BF9CAB3537:C7DC9C52B5CB1B0B]}
10-Mar-2014 11:48:28 OK      1.08s | Test010Lingering.lingerForLeftOverThread
10-Mar-2014 11:48:28 IGNOR/A 0.02s | Test012TestGroups.usesDisplay
10-Mar-2014 11:48:28 ERROR   0.00s | Test006BeforeClassFailureRR (suite) <<<
10-Mar-2014 11:48:28 OK      0.00s | Test005WithOutput.stderr_stdout_interwoven
10-Mar-2014 11:48:28 OK      0.00s | Test005WithOutput.stderr
10-Mar-2014 11:48:28 OK      0.02s | Test005WithOutput.longline
10-Mar-2014 11:48:28 OK      0.00s | Test005WithOutput.stderr_eol
10-Mar-2014 11:48:28 OK      0.00s | Test005WithOutput.stdout_eol
10-Mar-2014 11:48:28 OK      0.00s | Test005WithOutput.stdout
10-Mar-2014 11:48:28 ERROR   0.00s | Test007BeforeClassError (suite) <<<
10-Mar-2014 11:48:28 OK      0.00s | Test007ParameterizedTests.paramsWithRepeatAndSeeds {#0 value=1 string=abc seed=[BEEE8BF9CAB3537:DEADBEEF]}
10-Mar-2014 11:48:28 OK      0.00s | Test007ParameterizedTests.paramsWithRepeatAndSeeds {#1 value=1 string=abc seed=[BEEE8BF9CAB3537:DEADBEEF]}
10-Mar-2014 11:48:28 OK      0.00s | Test007ParameterizedTests.paramsWithRepeatAndSeeds {#2 value=1 string=abc seed=[BEEE8BF9CAB3537:CAFEBABE]}
10-Mar-2014 11:48:28 OK      0.00s | Test007ParameterizedTests.paramsWithRepeatAndSeeds {#3 value=1 string=abc seed=[BEEE8BF9CAB3537:CAFEBABE]}
10-Mar-2014 11:48:28 OK      0.02s | Test007ParameterizedTests.simpleArgumentsConsumer {value=1 string=abc}
10-Mar-2014 11:48:28 OK      0.00s | Test007ParameterizedTests.paramsWithRepeatAndSeeds {#0 value=2 string=def seed=[BEEE8BF9CAB3537:DEADBEEF]}
10-Mar-2014 11:48:28 OK      0.00s | Test007ParameterizedTests.paramsWithRepeatAndSeeds {#1 value=2 string=def seed=[BEEE8BF9CAB3537:DEADBEEF]}
10-Mar-2014 11:48:28 OK      0.00s | Test007ParameterizedTests.paramsWithRepeatAndSeeds {#2 value=2 string=def seed=[BEEE8BF9CAB3537:CAFEBABE]}
10-Mar-2014 11:48:28 OK      0.00s | Test007ParameterizedTests.paramsWithRepeatAndSeeds {#3 value=2 string=def seed=[BEEE8BF9CAB3537:CAFEBABE]}
10-Mar-2014 11:48:28 OK      0.00s | Test007ParameterizedTests.simpleArgumentsConsumer {value=2 string=def}
10-Mar-2014 11:48:29 ERROR   0.00s | Test009ThreadLeaks.leftOverThread <<<
10-Mar-2014 11:48:29 OK      1.01s | Test009ThreadLeaks.noLeakHere
10-Mar-2014 11:48:29 ERROR   0.00s | Test002SuiteFailure (suite) <<<
10-Mar-2014 11:48:29 FAILURE 0.00s | Test004SuiteOfNested$Subclass1.failure <<<
10-Mar-2014 11:48:29 ERROR   0.00s | Test004SuiteOfNested$Subclass1.error <<<
10-Mar-2014 11:48:29 OK      0.00s | Test004SuiteOfNested$Subclass1.passed
10-Mar-2014 11:48:29 IGNOR/A 0.00s | Test004SuiteOfNested$Subclass1.ignored_assumption
10-Mar-2014 11:48:29 FAILURE 0.00s | Test004SuiteOfNested$Subclass2.failure <<<
10-Mar-2014 11:48:29 ERROR   0.00s | Test004SuiteOfNested$Subclass2.error <<<
10-Mar-2014 11:48:29 OK      0.00s | Test004SuiteOfNested$Subclass2.passed
10-Mar-2014 11:48:29 IGNOR/A 0.02s | Test004SuiteOfNested$Subclass2.ignored_assumption
10-Mar-2014 11:48:29 FAILURE 0.00s | Test004SuiteOfNested$Subclass3.failure <<<
10-Mar-2014 11:48:29 ERROR   0.00s | Test004SuiteOfNested$Subclass3.error <<<
10-Mar-2014 11:48:29 OK      0.00s | Test004SuiteOfNested$Subclass3.passed
10-Mar-2014 11:48:29 IGNOR/A 0.00s | Test004SuiteOfNested$Subclass3.ignored_assumption
10-Mar-2014 11:48:29 OK      0.00s | Test002ExtendingRandomizedTest.getContextByHand
10-Mar-2014 11:48:29 OK      0.00s | Test002ExtendingRandomizedTest.getContextFromSuper
10-Mar-2014 11:48:29 OK      0.00s | Test006RepeatingTests.halfAndHalf {#0 seed=[BEEE8BF9CAB3537:3C8B9868CEF5804B]}
10-Mar-2014 11:48:29 OK      0.00s | Test006RepeatingTests.halfAndHalf {#1 seed=[BEEE8BF9CAB3537:88DD2494FA374B67]}
10-Mar-2014 11:48:29 OK      0.00s | Test006RepeatingTests.halfAndHalf {#2 seed=[BEEE8BF9CAB3537:634B248ABF303AC]}
10-Mar-2014 11:48:29 FAILURE 0.00s | Test006RepeatingTests.halfAndHalf {#3 seed=[BEEE8BF9CAB3537:37DA19ADC70D5885]} <<<
10-Mar-2014 11:48:29 OK      0.02s | Test006RepeatingTests.halfAndHalf {#4 seed=[BEEE8BF9CAB3537:7B1B9C006605983E]}
10-Mar-2014 11:48:29 FAILURE 0.00s | Test006RepeatingTests.halfAndHalf {#5 seed=[BEEE8BF9CAB3537:EAE14F5F1BB9D53E]} <<<
10-Mar-2014 11:48:29 FAILURE 0.00s | Test006RepeatingTests.halfAndHalf {#6 seed=[BEEE8BF9CAB3537:D43F2BD90989C538]} <<<
10-Mar-2014 11:48:29 FAILURE 0.00s | Test006RepeatingTests.halfAndHalf {#7 seed=[BEEE8BF9CAB3537:488CB1A32A9D5196]} <<<
10-Mar-2014 11:48:29 OK      0.00s | Test006RepeatingTests.halfAndHalf {#8 seed=[BEEE8BF9CAB3537:7A2054CD5D5646CC]}
10-Mar-2014 11:48:29 FAILURE 0.02s | Test006RepeatingTests.halfAndHalf {#9 seed=[BEEE8BF9CAB3537:ADAB02773901719E]} <<<
10-Mar-2014 11:48:29 FAILURE 0.00s | Test006RepeatingTests.repeatFailure {#0 seed=[BEEE8BF9CAB3537:F00DDEAD]} <<<
10-Mar-2014 11:48:29 FAILURE 0.00s | Test006RepeatingTests.repeatFailure {#1 seed=[BEEE8BF9CAB3537:F00DDEAD]} <<<
10-Mar-2014 11:48:29 FAILURE 0.00s | Test006RepeatingTests.repeatFailure {#2 seed=[BEEE8BF9CAB3537:F00DDEAD]} <<<
10-Mar-2014 11:48:29 FAILURE 0.02s | Test006RepeatingTests.repeatFailure {#3 seed=[BEEE8BF9CAB3537:F00DDEAD]} <<<
10-Mar-2014 11:48:29 FAILURE 0.00s | Test006RepeatingTests.repeatFailure {#4 seed=[BEEE8BF9CAB3537:F00DDEAD]} <<<
10-Mar-2014 11:48:29 ERROR   0.00s | Test006BeforeClassFailure (suite) <<<
10-Mar-2014 11:48:29 ERROR   0.02s | Test003MultipleFailures.testCase <<<
10-Mar-2014 11:48:29 ERROR   0.00s | Test003MultipleFailures (suite) <<<
10-Mar-2014 11:48:30 OK      0.00s | Test004MoreRandomness$OrderRandomized.method2
10-Mar-2014 11:48:30 OK      0.00s | Test004MoreRandomness$OrderRandomized.method3
10-Mar-2014 11:48:30 OK      0.00s | Test004MoreRandomness$OrderRandomized.method1
10-Mar-2014 11:48:30 OK      0.00s | Test004MoreRandomness$OrderRandomizedButFixed.method2
10-Mar-2014 11:48:30 OK      0.00s | Test004MoreRandomness$OrderRandomizedButFixed.method3
10-Mar-2014 11:48:30 OK      0.00s | Test004MoreRandomness$OrderRandomizedButFixed.method1
10-Mar-2014 11:48:30 OK      0.00s | Test004MoreRandomness$OrderRegression.regression {#0 seed=[BEEE8BF9CAB3537:DEADBEEF]}
10-Mar-2014 11:48:30 OK      0.00s | Test004MoreRandomness$OrderRegression.regression {#1 seed=[BEEE8BF9CAB3537:2864B7B964E326C7]}
10-Mar-2014 11:48:30 FAILURE 0.00s | Test001AllStatuses.failure <<<
10-Mar-2014 11:48:30 ERROR   0.00s | Test001AllStatuses.error <<<
10-Mar-2014 11:48:30 OK      0.00s | Test001AllStatuses.passed
10-Mar-2014 11:48:30 IGNOR/A 0.00s | Test001AllStatuses.ignored_assumption
10-Mar-2014 11:48:30 OK      0.00s | Test001SimpleUseCase.success
10-Mar-2014 11:48:30 OK      0.00s | Test003UsingRandomness.fixedTesting
10-Mar-2014 11:48:30 FAILURE 0.02s | Test003UsingRandomness.randomizedTesting <<<
10-Mar-2014 11:48:30 ERROR   0.00s | Test003UsingRandomness.expectNoException <<<
10-Mar-2014 11:48:30 FAILURE 0.00s | Test005RecoveringRandomSeed.failure <<<
10-Mar-2014 11:48:30 OK      0.02s | Test005RecoveringRandomSeed.printContext
10-Mar-2014 11:48:32 ERROR   0.53s | Test008Timeouts.standardAnnotation <<<
10-Mar-2014 11:48:32 ERROR   0.53s | Test008Timeouts.timeoutAnnotation <<<
10-Mar-2014 11:48:32 ERROR   0.00s | Test015CustomMethodProviders.initializationError <<<
10-Mar-2014 11:48:32 ERROR   0.00s | Test007BeforeClassErrorRR (suite) <<<
10-Mar-2014 11:48:33
10-Mar-2014 11:48:33 Tests with failures (first 3 out of 33):
10-Mar-2014 11:48:33   - com.carrotsearch.examples.randomizedrunner.Test014Listeners.failure
10-Mar-2014 11:48:33   - com.carrotsearch.examples.randomizedrunner.reports.Test006BeforeClassFailureRR (suite)
10-Mar-2014 11:48:33   - com.carrotsearch.examples.randomizedrunner.reports.Test007BeforeClassError (suite)
10-Mar-2014 11:48:33
10-Mar-2014 11:48:33
10-Mar-2014 11:48:33 [INFO] JVM J0:     0.31 ..     6.43 =     6.11s
10-Mar-2014 11:48:33 [INFO] Execution time total: 6.44 sec.
10-Mar-2014 11:48:33 [INFO] Tests summary: 25 suites, 90 tests, 7 suite-level errors, 10 errors, 17 failures, 12 ignored (7 assumptions)
10-Mar-2014 11:48:33 [INFO]
10-Mar-2014 11:48:33 [INFO] --- maven-jar-plugin:2.3.2:jar (default-jar) @ randomizedtesting-examples ---
10-Mar-2014 11:48:33 [INFO] Building jar: E:\xml-data\build-dir\RNDTEST-SOFTWARE-JDK17\examples\maven\target\randomizedtesting-examples-2.1.0-SNAPSHOT.jar
10-Mar-2014 11:48:33 [INFO]                                                                         
10-Mar-2014 11:48:33 [INFO] ------------------------------------------------------------------------
10-Mar-2014 11:48:33 [INFO] Building RandomizedTesting ANT Examples 2.1.0-SNAPSHOT
10-Mar-2014 11:48:33 [INFO] ------------------------------------------------------------------------
10-Mar-2014 11:48:33 [INFO]
10-Mar-2014 11:48:33 [INFO] --- maven-clean-plugin:2.4.1:clean (default-clean) @ randomizedtesting-examples-ant ---
10-Mar-2014 11:48:33 [INFO] Deleting E:\xml-data\build-dir\RNDTEST-SOFTWARE-JDK17\examples\ant\target
10-Mar-2014 11:48:33 [INFO]
10-Mar-2014 11:48:33 [INFO] --- maven-enforcer-plugin:1.2:enforce (enforce-maven) @ randomizedtesting-examples-ant ---
10-Mar-2014 11:48:33 [INFO]
10-Mar-2014 11:48:33 [INFO] --- maven-resources-plugin:2.5:resources (default-resources) @ randomizedtesting-examples-ant ---
10-Mar-2014 11:48:33 [debug] execute contextualize
10-Mar-2014 11:48:33 [INFO] Using 'UTF-8' encoding to copy filtered resources.
10-Mar-2014 11:48:33 [INFO] skip non existing resourceDirectory E:\xml-data\build-dir\RNDTEST-SOFTWARE-JDK17\examples\ant\src\main\resources
10-Mar-2014 11:48:33 [INFO]
10-Mar-2014 11:48:33 [INFO] --- maven-compiler-plugin:3.1:compile (default-compile) @ randomizedtesting-examples-ant ---
10-Mar-2014 11:48:33 [INFO] No sources to compile
10-Mar-2014 11:48:33 [INFO]
10-Mar-2014 11:48:33 [INFO] --- maven-resources-plugin:2.5:testResources (default-testResources) @ randomizedtesting-examples-ant ---
10-Mar-2014 11:48:33 [debug] execute contextualize
10-Mar-2014 11:48:33 [INFO] Using 'UTF-8' encoding to copy filtered resources.
10-Mar-2014 11:48:33 [INFO] skip non existing resourceDirectory E:\xml-data\build-dir\RNDTEST-SOFTWARE-JDK17\examples\ant\src\test\resources
10-Mar-2014 11:48:33 [INFO]
10-Mar-2014 11:48:33 [INFO] --- maven-compiler-plugin:3.1:testCompile (default-testCompile) @ randomizedtesting-examples-ant ---
10-Mar-2014 11:48:33 [INFO] No sources to compile
10-Mar-2014 11:48:33 [INFO]
10-Mar-2014 11:48:33 [INFO] --- maven-surefire-plugin:2.10:test (default-test) @ randomizedtesting-examples-ant ---
10-Mar-2014 11:48:33 [INFO] No tests to run.
10-Mar-2014 11:48:33 [INFO] Surefire report directory: E:\xml-data\build-dir\RNDTEST-SOFTWARE-JDK17\examples\ant\target\surefire-reports
10-Mar-2014 11:48:33
10-Mar-2014 11:48:33 -------------------------------------------------------
10-Mar-2014 11:48:33 T E S T S
10-Mar-2014 11:48:33 -------------------------------------------------------
10-Mar-2014 11:48:33
10-Mar-2014 11:48:33 Results :
10-Mar-2014 11:48:33
10-Mar-2014 11:48:33 Tests run: 0, Failures: 0, Errors: 0, Skipped: 0
10-Mar-2014 11:48:33
10-Mar-2014 11:48:33 [INFO]
10-Mar-2014 11:48:33 [INFO] --- maven-jar-plugin:2.3.2:jar (default-jar) @ randomizedtesting-examples-ant ---
10-Mar-2014 11:48:33 [WARNING] JAR will be empty - no content was marked for inclusion!
10-Mar-2014 11:48:33 [INFO] Building jar: E:\xml-data\build-dir\RNDTEST-SOFTWARE-JDK17\examples\ant\target\randomizedtesting-examples-ant-2.1.0-SNAPSHOT.jar
10-Mar-2014 11:48:33 [INFO]
10-Mar-2014 11:48:33 [INFO] --- maven-dependency-plugin:2.3:copy-dependencies (copy-dependencies) @ randomizedtesting-examples-ant ---
10-Mar-2014 11:48:33 [INFO] Copying junit-4.10.jar to E:\xml-data\build-dir\RNDTEST-SOFTWARE-JDK17\examples\ant\target\lib\junit-4.10.jar
10-Mar-2014 11:48:33 [INFO] Copying randomizedtesting-examples-2.1.0-SNAPSHOT.jar to E:\xml-data\build-dir\RNDTEST-SOFTWARE-JDK17\examples\ant\target\lib\randomizedtesting-examples-2.1.0-SNAPSHOT.jar
10-Mar-2014 11:48:33 [INFO] Copying junit4-ant-2.1.0-SNAPSHOT.jar to E:\xml-data\build-dir\RNDTEST-SOFTWARE-JDK17\examples\ant\target\lib\junit4-ant-2.1.0-SNAPSHOT.jar
10-Mar-2014 11:48:33 [INFO] Copying randomizedtesting-runner-2.1.0-SNAPSHOT.jar to E:\xml-data\build-dir\RNDTEST-SOFTWARE-JDK17\examples\ant\target\lib\randomizedtesting-runner-2.1.0-SNAPSHOT.jar
10-Mar-2014 11:48:33 [INFO]
10-Mar-2014 11:48:33 [INFO] --- maven-antrun-plugin:1.7:run (ant-run-tests) @ randomizedtesting-examples-ant ---
10-Mar-2014 11:48:33 [INFO] Executing tasks
10-Mar-2014 11:48:33
10-Mar-2014 11:48:33 main:
10-Mar-2014 11:48:33 Trying to override old definition of task javac
10-Mar-2014 11:48:33
10-Mar-2014 11:48:33 classpath.resolve:
10-Mar-2014 11:48:33
10-Mar-2014 11:48:33 compile:
10-Mar-2014 11:48:33     [mkdir] Created dir: E:\xml-data\build-dir\RNDTEST-SOFTWARE-JDK17\examples\ant\target\classes
10-Mar-2014 11:48:33     [javac] Compiling 25 source files to E:\xml-data\build-dir\RNDTEST-SOFTWARE-JDK17\examples\ant\target\classes
10-Mar-2014 11:48:33 warning: [options] bootstrap class path not set in conjunction with -source 1.6
10-Mar-2014 11:48:33 1 warning
10-Mar-2014 11:48:33
10-Mar-2014 11:48:33 test:
10-Mar-2014 11:48:34 [junit4:junit4] <JUnit4> says cześć! Master seed: F52932ACC1CFB634
10-Mar-2014 11:48:40 [junit4:junit4] JVM J0:     0.31 ..     6.21 =     5.90s
10-Mar-2014 11:48:40 [junit4:junit4] Execution time total: 6.22 sec.
10-Mar-2014 11:48:40 [junitreport] Processing E:\xml-data\build-dir\RNDTEST-SOFTWARE-JDK17\examples\ant\target\test-report-xml\TESTS-TestSuites.xml to e:\bamboo-home-4\temp\RNDTEST-SOFTWARE-JDK17\null937146942
10-Mar-2014 11:48:40 [junitreport] Loading stylesheet jar:file:/C:/Users/bamboo/.m2/repository/org/apache/ant/ant-junit/1.8.2/ant-junit-1.8.2.jar!/org/apache/tools/ant/taskdefs/optional/junit/xsl/junit-frames.xsl
10-Mar-2014 11:48:40 [junitreport] Transform time: 421ms
10-Mar-2014 11:48:40 [junitreport] Deleting: e:\bamboo-home-4\temp\RNDTEST-SOFTWARE-JDK17\null937146942
10-Mar-2014 11:48:40      [echo]
10-Mar-2014 11:48:40      [echo]
10-Mar-2014 11:48:40      [echo] Done. See reports under target/.
10-Mar-2014 11:48:40      [echo]
10-Mar-2014 11:48:40      [echo]         
10-Mar-2014 11:48:40 [INFO] Executed tasks
10-Mar-2014 11:48:40 [INFO]                                                                         
10-Mar-2014 11:48:40 [INFO] ------------------------------------------------------------------------
10-Mar-2014 11:48:40 [INFO] Building RandomizedTesting Packaging 2.1.0-SNAPSHOT
10-Mar-2014 11:48:40 [INFO] ------------------------------------------------------------------------
10-Mar-2014 11:48:40 [INFO]
10-Mar-2014 11:48:40 [INFO] --- maven-clean-plugin:2.4.1:clean (default-clean) @ randomizedtesting-packaging ---
10-Mar-2014 11:48:40 [INFO] Deleting E:\xml-data\build-dir\RNDTEST-SOFTWARE-JDK17\packaging\target
10-Mar-2014 11:48:40 [INFO]
10-Mar-2014 11:48:40 [INFO] --- maven-enforcer-plugin:1.2:enforce (enforce-maven) @ randomizedtesting-packaging ---
10-Mar-2014 11:48:40 [INFO]
10-Mar-2014 11:48:40 [INFO] --- maven-resources-plugin:2.5:resources (default-resources) @ randomizedtesting-packaging ---
10-Mar-2014 11:48:40 [debug] execute contextualize
10-Mar-2014 11:48:40 [INFO] Using 'UTF-8' encoding to copy filtered resources.
10-Mar-2014 11:48:40 [INFO] skip non existing resourceDirectory E:\xml-data\build-dir\RNDTEST-SOFTWARE-JDK17\packaging\src\main\resources
10-Mar-2014 11:48:40 [INFO]
10-Mar-2014 11:48:40 [INFO] --- maven-compiler-plugin:3.1:compile (default-compile) @ randomizedtesting-packaging ---
10-Mar-2014 11:48:40 [INFO] No sources to compile
10-Mar-2014 11:48:40 [INFO]
10-Mar-2014 11:48:40 [INFO] --- maven-resources-plugin:2.5:testResources (default-testResources) @ randomizedtesting-packaging ---
10-Mar-2014 11:48:40 [debug] execute contextualize
10-Mar-2014 11:48:40 [INFO] Using 'UTF-8' encoding to copy filtered resources.
10-Mar-2014 11:48:40 [INFO] skip non existing resourceDirectory E:\xml-data\build-dir\RNDTEST-SOFTWARE-JDK17\packaging\src\test\resources
10-Mar-2014 11:48:40 [INFO]
10-Mar-2014 11:48:40 [INFO] --- maven-compiler-plugin:3.1:testCompile (default-testCompile) @ randomizedtesting-packaging ---
10-Mar-2014 11:48:40 [INFO] No sources to compile
10-Mar-2014 11:48:40 [INFO]
10-Mar-2014 11:48:40 [INFO] --- maven-surefire-plugin:2.10:test (default-test) @ randomizedtesting-packaging ---
10-Mar-2014 11:48:40 [INFO] No tests to run.
10-Mar-2014 11:48:40 [INFO] Surefire report directory: E:\xml-data\build-dir\RNDTEST-SOFTWARE-JDK17\packaging\target\surefire-reports
10-Mar-2014 11:48:40
10-Mar-2014 11:48:40 -------------------------------------------------------
10-Mar-2014 11:48:40 T E S T S
10-Mar-2014 11:48:40 -------------------------------------------------------
10-Mar-2014 11:48:41
10-Mar-2014 11:48:41 Results :
10-Mar-2014 11:48:41
10-Mar-2014 11:48:41 Tests run: 0, Failures: 0, Errors: 0, Skipped: 0
10-Mar-2014 11:48:41
10-Mar-2014 11:48:41 [INFO]
10-Mar-2014 11:48:41 [INFO] --- maven-jar-plugin:2.3.2:jar (default-jar) @ randomizedtesting-packaging ---
10-Mar-2014 11:48:41 [WARNING] JAR will be empty - no content was marked for inclusion!
10-Mar-2014 11:48:41 [INFO] Building jar: E:\xml-data\build-dir\RNDTEST-SOFTWARE-JDK17\packaging\target\randomizedtesting-packaging-2.1.0-SNAPSHOT.jar
10-Mar-2014 11:48:41 [INFO] ------------------------------------------------------------------------
10-Mar-2014 11:48:41 [INFO] Reactor Summary:
10-Mar-2014 11:48:41 [INFO]
10-Mar-2014 11:48:41 [INFO] RandomizedTesting Parent POM ...................... SUCCESS [0.343s]
10-Mar-2014 11:48:41 [INFO] RandomizedTesting Randomized Runner ............... SUCCESS [27.768s]
10-Mar-2014 11:48:41 [INFO] RandomizedTesting JUnit4 ANT Task ................. SUCCESS [1:52.491s]
10-Mar-2014 11:48:41 [INFO] RandomizedTesting JUnit4 Maven Plugin ............. SUCCESS [0.890s]
10-Mar-2014 11:48:41 [INFO] RandomizedTesting JUnit4 Maven Plugin Tests ....... SUCCESS [4.960s]
10-Mar-2014 11:48:41 [INFO] RandomizedTesting Examples ........................ SUCCESS [7.005s]
10-Mar-2014 11:48:41 [INFO] RandomizedTesting ANT Examples .................... SUCCESS [7.769s]
10-Mar-2014 11:48:41 [INFO] RandomizedTesting Packaging ....................... SUCCESS [0.109s]
10-Mar-2014 11:48:41 [INFO] ------------------------------------------------------------------------
10-Mar-2014 11:48:41 [INFO] BUILD SUCCESS
10-Mar-2014 11:48:41 [INFO] ------------------------------------------------------------------------
10-Mar-2014 11:48:41 [INFO] Total time: 2:41.601s
10-Mar-2014 11:48:41 [INFO] Finished at: Mon Mar 10 11:48:41 CET 2014
10-Mar-2014 11:48:41 [INFO] Final Memory: 38M/613M
10-Mar-2014 11:48:41 [INFO] ------------------------------------------------------------------------
10-Mar-2014 11:48:41 Parsing test results...
10-Mar-2014 11:48:41 Finished task 'Maven 3.x'
10-Mar-2014 11:48:41 Running post build plugin 'Artifact Copier'
10-Mar-2014 11:48:41 Running post build plugin 'NCover Results Collector'
10-Mar-2014 11:48:41 Running post build plugin 'Clover Results Collector'
10-Mar-2014 11:48:41 Finalising the build...
10-Mar-2014 11:48:41 Stopping timer.
10-Mar-2014 11:48:41 Build RNDTEST-SOFTWARE-JDK17-20 completed.
10-Mar-2014 11:48:55 Running on server: post build plugin 'NCover Results Collector'
10-Mar-2014 11:48:55 Running on server: post build plugin 'Clover Delta Calculator'
10-Mar-2014 11:48:55 Running on server: post build plugin 'Build Hanging Detection Configuration'
10-Mar-2014 11:48:55 Running on server: post build plugin 'Maven Dependencies Postprocessor'
10-Mar-2014 11:48:55 All post build plugins have finished
10-Mar-2014 11:48:55 Generating build results summary...
10-Mar-2014 11:48:56 Saving build results to disk...
10-Mar-2014 11:48:56 Indexing build results...
10-Mar-2014 11:48:56 Finished building RNDTEST-SOFTWARE-JDK17-20.