Build #187

Build: #187 failed

Job: JDK 1.7 failed

Stages & jobs

  1. Compile and test

  2. Package

Build log

The build generated 3,392 lines of output.The output is too long and has been truncated to the last 1,000 lines. Download or view full build log

08-May-2018 12:06:59 Finished: testFoo {p0=7}
08-May-2018 12:06:59 Started : testFoo {p0=8}
08-May-2018 12:06:59 Finished: testFoo {p0=8}
08-May-2018 12:06:59 Started : testFoo {p0=9}
08-May-2018 12:06:59 Finished: testFoo {p0=9}
08-May-2018 12:06:59 Run finished: run=10, ignored=0, failures=0, assumptions=0
08-May-2018 12:06:59
08-May-2018 12:06:59 Run started.
08-May-2018 12:06:59 Started : testFoo {p0=0}
08-May-2018 12:06:59 Finished: testFoo {p0=0}
08-May-2018 12:06:59 Started : testFoo {p0=1}
08-May-2018 12:06:59 Finished: testFoo {p0=1}
08-May-2018 12:06:59 Started : testFoo {p0=2}
08-May-2018 12:06:59 Finished: testFoo {p0=2}
08-May-2018 12:06:59 Started : testFoo {p0=3}
08-May-2018 12:06:59 Finished: testFoo {p0=3}
08-May-2018 12:06:59 Started : testFoo {p0=4}
08-May-2018 12:06:59 Finished: testFoo {p0=4}
08-May-2018 12:06:59 Started : testFoo {p0=5}
08-May-2018 12:06:59 Finished: testFoo {p0=5}
08-May-2018 12:06:59 Started : testFoo {p0=6}
08-May-2018 12:06:59 Finished: testFoo {p0=6}
08-May-2018 12:06:59 Started : testFoo {p0=7}
08-May-2018 12:06:59 Finished: testFoo {p0=7}
08-May-2018 12:06:59 Started : testFoo {p0=8}
08-May-2018 12:06:59 Finished: testFoo {p0=8}
08-May-2018 12:06:59 Started : testFoo {p0=9}
08-May-2018 12:06:59 Finished: testFoo {p0=9}
08-May-2018 12:06:59 Run finished: run=10, ignored=0, failures=0, assumptions=0
08-May-2018 12:06:59
08-May-2018 12:06:59 Run started.
08-May-2018 12:06:59 Started : testFoo {p0=0}
08-May-2018 12:06:59 Finished: testFoo {p0=0}
08-May-2018 12:06:59 Started : testFoo {p0=1}
08-May-2018 12:06:59 Finished: testFoo {p0=1}
08-May-2018 12:06:59 Started : testFoo {p0=2}
08-May-2018 12:06:59 Finished: testFoo {p0=2}
08-May-2018 12:06:59 Started : testFoo {p0=3}
08-May-2018 12:06:59 Finished: testFoo {p0=3}
08-May-2018 12:06:59 Started : testFoo {p0=4}
08-May-2018 12:06:59 Finished: testFoo {p0=4}
08-May-2018 12:06:59 Started : testFoo {p0=5}
08-May-2018 12:06:59 Finished: testFoo {p0=5}
08-May-2018 12:06:59 Started : testFoo {p0=6}
08-May-2018 12:06:59 Finished: testFoo {p0=6}
08-May-2018 12:06:59 Started : testFoo {p0=7}
08-May-2018 12:06:59 Finished: testFoo {p0=7}
08-May-2018 12:06:59 Started : testFoo {p0=8}
08-May-2018 12:06:59 Finished: testFoo {p0=8}
08-May-2018 12:06:59 Started : testFoo {p0=9}
08-May-2018 12:06:59 Finished: testFoo {p0=9}
08-May-2018 12:06:59 Run finished: run=10, ignored=0, failures=0, assumptions=0
08-May-2018 12:06:59
08-May-2018 12:06:59 Run started.
08-May-2018 12:06:59 Started : testFoo {p0=0}
08-May-2018 12:06:59 Finished: testFoo {p0=0}
08-May-2018 12:06:59 Started : testFoo {p0=1}
08-May-2018 12:06:59 Finished: testFoo {p0=1}
08-May-2018 12:06:59 Started : testFoo {p0=2}
08-May-2018 12:06:59 Finished: testFoo {p0=2}
08-May-2018 12:06:59 Started : testFoo {p0=3}
08-May-2018 12:06:59 Finished: testFoo {p0=3}
08-May-2018 12:06:59 Started : testFoo {p0=4}
08-May-2018 12:06:59 Finished: testFoo {p0=4}
08-May-2018 12:06:59 Started : testFoo {p0=5}
08-May-2018 12:06:59 Finished: testFoo {p0=5}
08-May-2018 12:06:59 Started : testFoo {p0=6}
08-May-2018 12:06:59 Finished: testFoo {p0=6}
08-May-2018 12:06:59 Started : testFoo {p0=7}
08-May-2018 12:06:59 Finished: testFoo {p0=7}
08-May-2018 12:06:59 Started : testFoo {p0=8}
08-May-2018 12:06:59 Finished: testFoo {p0=8}
08-May-2018 12:06:59 Started : testFoo {p0=9}
08-May-2018 12:06:59 Finished: testFoo {p0=9}
08-May-2018 12:06:59 Run finished: run=10, ignored=0, failures=0, assumptions=0
08-May-2018 12:06:59
08-May-2018 12:06:59 Run started.
08-May-2018 12:06:59 Started : testFoo {p0=0}
08-May-2018 12:06:59 Finished: testFoo {p0=0}
08-May-2018 12:06:59 Started : testFoo {p0=1}
08-May-2018 12:06:59 Finished: testFoo {p0=1}
08-May-2018 12:06:59 Started : testFoo {p0=2}
08-May-2018 12:06:59 Finished: testFoo {p0=2}
08-May-2018 12:06:59 Started : testFoo {p0=3}
08-May-2018 12:06:59 Finished: testFoo {p0=3}
08-May-2018 12:06:59 Started : testFoo {p0=4}
08-May-2018 12:06:59 Finished: testFoo {p0=4}
08-May-2018 12:06:59 Started : testFoo {p0=5}
08-May-2018 12:06:59 Finished: testFoo {p0=5}
08-May-2018 12:06:59 Started : testFoo {p0=6}
08-May-2018 12:06:59 Finished: testFoo {p0=6}
08-May-2018 12:06:59 Started : testFoo {p0=7}
08-May-2018 12:06:59 Finished: testFoo {p0=7}
08-May-2018 12:06:59 Started : testFoo {p0=8}
08-May-2018 12:06:59 Finished: testFoo {p0=8}
08-May-2018 12:06:59 Started : testFoo {p0=9}
08-May-2018 12:06:59 Finished: testFoo {p0=9}
08-May-2018 12:06:59 Run finished: run=10, ignored=0, failures=0, assumptions=0
08-May-2018 12:06:59
08-May-2018 12:06:59 Run started.
08-May-2018 12:06:59 Started : testFoo {p0=0}
08-May-2018 12:06:59 Finished: testFoo {p0=0}
08-May-2018 12:06:59 Started : testFoo {p0=1}
08-May-2018 12:06:59 Finished: testFoo {p0=1}
08-May-2018 12:06:59 Started : testFoo {p0=2}
08-May-2018 12:06:59 Finished: testFoo {p0=2}
08-May-2018 12:06:59 Started : testFoo {p0=3}
08-May-2018 12:06:59 Finished: testFoo {p0=3}
08-May-2018 12:06:59 Started : testFoo {p0=4}
08-May-2018 12:06:59 Finished: testFoo {p0=4}
08-May-2018 12:06:59 Started : testFoo {p0=5}
08-May-2018 12:06:59 Finished: testFoo {p0=5}
08-May-2018 12:06:59 Started : testFoo {p0=6}
08-May-2018 12:06:59 Finished: testFoo {p0=6}
08-May-2018 12:06:59 Started : testFoo {p0=7}
08-May-2018 12:06:59 Finished: testFoo {p0=7}
08-May-2018 12:06:59 Started : testFoo {p0=8}
08-May-2018 12:06:59 Finished: testFoo {p0=8}
08-May-2018 12:06:59 Started : testFoo {p0=9}
08-May-2018 12:06:59 Finished: testFoo {p0=9}
08-May-2018 12:06:59 Run finished: run=10, ignored=0, failures=0, assumptions=0
08-May-2018 12:06:59
08-May-2018 12:06:59 Run started.
08-May-2018 12:06:59 Started : testFoo {p0=0}
08-May-2018 12:06:59 Finished: testFoo {p0=0}
08-May-2018 12:06:59 Started : testFoo {p0=1}
08-May-2018 12:06:59 Finished: testFoo {p0=1}
08-May-2018 12:06:59 Started : testFoo {p0=2}
08-May-2018 12:06:59 Finished: testFoo {p0=2}
08-May-2018 12:06:59 Started : testFoo {p0=3}
08-May-2018 12:06:59 Finished: testFoo {p0=3}
08-May-2018 12:06:59 Started : testFoo {p0=4}
08-May-2018 12:06:59 Finished: testFoo {p0=4}
08-May-2018 12:06:59 Started : testFoo {p0=5}
08-May-2018 12:06:59 Finished: testFoo {p0=5}
08-May-2018 12:06:59 Started : testFoo {p0=6}
08-May-2018 12:06:59 Finished: testFoo {p0=6}
08-May-2018 12:06:59 Started : testFoo {p0=7}
08-May-2018 12:06:59 Finished: testFoo {p0=7}
08-May-2018 12:06:59 Started : testFoo {p0=8}
08-May-2018 12:06:59 Finished: testFoo {p0=8}
08-May-2018 12:06:59 Started : testFoo {p0=9}
08-May-2018 12:06:59 Finished: testFoo {p0=9}
08-May-2018 12:06:59 Run finished: run=10, ignored=0, failures=0, assumptions=0
08-May-2018 12:06:59
08-May-2018 12:06:59 Run started.
08-May-2018 12:06:59 Started : testFoo {p0=0}
08-May-2018 12:06:59 Finished: testFoo {p0=0}
08-May-2018 12:06:59 Started : testFoo {p0=1}
08-May-2018 12:06:59 Finished: testFoo {p0=1}
08-May-2018 12:06:59 Started : testFoo {p0=2}
08-May-2018 12:06:59 Finished: testFoo {p0=2}
08-May-2018 12:06:59 Started : testFoo {p0=3}
08-May-2018 12:06:59 Finished: testFoo {p0=3}
08-May-2018 12:06:59 Started : testFoo {p0=4}
08-May-2018 12:06:59 Finished: testFoo {p0=4}
08-May-2018 12:06:59 Started : testFoo {p0=5}
08-May-2018 12:06:59 Finished: testFoo {p0=5}
08-May-2018 12:06:59 Started : testFoo {p0=6}
08-May-2018 12:06:59 Finished: testFoo {p0=6}
08-May-2018 12:06:59 Started : testFoo {p0=7}
08-May-2018 12:06:59 Finished: testFoo {p0=7}
08-May-2018 12:06:59 Started : testFoo {p0=8}
08-May-2018 12:06:59 Finished: testFoo {p0=8}
08-May-2018 12:06:59 Started : testFoo {p0=9}
08-May-2018 12:06:59 Finished: testFoo {p0=9}
08-May-2018 12:06:59 Run finished: run=10, ignored=0, failures=0, assumptions=0
08-May-2018 12:06:59
08-May-2018 12:06:59 Run started.
08-May-2018 12:06:59 Started : testFoo {p0=0}
08-May-2018 12:06:59 Finished: testFoo {p0=0}
08-May-2018 12:06:59 Started : testFoo {p0=1}
08-May-2018 12:06:59 Finished: testFoo {p0=1}
08-May-2018 12:06:59 Started : testFoo {p0=2}
08-May-2018 12:06:59 Finished: testFoo {p0=2}
08-May-2018 12:06:59 Started : testFoo {p0=3}
08-May-2018 12:06:59 Finished: testFoo {p0=3}
08-May-2018 12:06:59 Started : testFoo {p0=4}
08-May-2018 12:06:59 Finished: testFoo {p0=4}
08-May-2018 12:06:59 Started : testFoo {p0=5}
08-May-2018 12:06:59 Finished: testFoo {p0=5}
08-May-2018 12:06:59 Started : testFoo {p0=6}
08-May-2018 12:06:59 Finished: testFoo {p0=6}
08-May-2018 12:06:59 Started : testFoo {p0=7}
08-May-2018 12:06:59 Finished: testFoo {p0=7}
08-May-2018 12:06:59 Started : testFoo {p0=8}
08-May-2018 12:06:59 Finished: testFoo {p0=8}
08-May-2018 12:06:59 Started : testFoo {p0=9}
08-May-2018 12:06:59 Finished: testFoo {p0=9}
08-May-2018 12:06:59 Run finished: run=10, ignored=0, failures=0, assumptions=0
08-May-2018 12:06:59
08-May-2018 12:06:59 Tests run: 2, Failures: 0, Errors: 0, Skipped: 0, Time elapsed: 0.184 sec - in com.carrotsearch.randomizedtesting.TestParameterizedShufflesOrder
08-May-2018 12:06:59 Running com.carrotsearch.randomizedtesting.TestTestFiltering
08-May-2018 12:06:59 Run started.
08-May-2018 12:06:59 Started : test1
08-May-2018 12:06:59 Assumpt.: test1(com.carrotsearch.randomizedtesting.TestTestFiltering$Nested1): 'foo' test group is disabled (@Foo())
08-May-2018 12:06:59 Finished: test1
08-May-2018 12:06:59 Run finished: run=1, ignored=0, failures=0, assumptions=1
08-May-2018 12:06:59
08-May-2018 12:06:59 Run started.
08-May-2018 12:06:59 Started : test1
08-May-2018 12:06:59 Finished: test1
08-May-2018 12:06:59 Run finished: run=1, ignored=0, failures=0, assumptions=0
08-May-2018 12:06:59
08-May-2018 12:06:59 Run started.
08-May-2018 12:06:59 Run finished: run=0, ignored=0, failures=0, assumptions=0
08-May-2018 12:06:59
08-May-2018 12:06:59 Tests run: 1, Failures: 0, Errors: 0, Skipped: 0, Time elapsed: 0.013 sec - in com.carrotsearch.randomizedtesting.TestTestFiltering
08-May-2018 12:06:59 Running com.carrotsearch.randomizedtesting.TestManyThreadsOOM
08-May-2018 12:07:03 Tests run: 10, Failures: 0, Errors: 0, Skipped: 0, Time elapsed: 4.574 sec - in com.carrotsearch.randomizedtesting.TestManyThreadsOOM
08-May-2018 12:07:03 Running com.carrotsearch.randomizedtesting.TestParameterized
08-May-2018 12:07:03 Run started.
08-May-2018 12:07:03 Started : failing {paramName=xyz}
08-May-2018 12:07:03 Failure : failing {paramName=xyz}(com.carrotsearch.randomizedtesting.TestParameterized$Nested2): Constructor arguments do not match provider parameters?
08-May-2018 12:07:03 Finished: failing {paramName=xyz}
08-May-2018 12:07:03 Run finished: run=1, ignored=0, failures=1, assumptions=0
08-May-2018 12:07:03
08-May-2018 12:07:03 Run started.
08-May-2018 12:07:03 Run finished: run=0, ignored=0, failures=0, assumptions=0
08-May-2018 12:07:03
08-May-2018 12:07:03 Run started.
08-May-2018 12:07:03 Run finished: run=0, ignored=0, failures=0, assumptions=0
08-May-2018 12:07:03
08-May-2018 12:07:03 Run started.
08-May-2018 12:07:03 Started : testMe
08-May-2018 12:07:03 Finished: testMe
08-May-2018 12:07:03 Started : testMe {#2}
08-May-2018 12:07:03 Finished: testMe {#2}
08-May-2018 12:07:03 Run finished: run=2, ignored=0, failures=0, assumptions=0
08-May-2018 12:07:03
08-May-2018 12:07:03 Run started.
08-May-2018 12:07:03 Started : testTwo {value=1 string=abc}
08-May-2018 12:07:03 Finished: testTwo {value=1 string=abc}
08-May-2018 12:07:03 Started : testOne {value=1 string=abc seed=[66C50830D7E0A861:B2C720F30E997AF1]}
08-May-2018 12:07:03 Finished: testOne {value=1 string=abc seed=[66C50830D7E0A861:B2C720F30E997AF1]}
08-May-2018 12:07:03 Started : testOne {value=1 string=abc seed=[66C50830D7E0A861:6919C0F3A5BB1DD]}
08-May-2018 12:07:03 Finished: testOne {value=1 string=abc seed=[66C50830D7E0A861:6919C0F3A5BB1DD]}
08-May-2018 12:07:03 Started : testOne {value=1 string=abc seed=[66C50830D7E0A861:88780AD36B9FF916]}
08-May-2018 12:07:03 Finished: testOne {value=1 string=abc seed=[66C50830D7E0A861:88780AD36B9FF916]}
08-May-2018 12:07:03 Started : testThree {value=1 string=abc seed=[66C50830D7E0A861:DEADBEEF]}
08-May-2018 12:07:03 Finished: testThree {value=1 string=abc seed=[66C50830D7E0A861:DEADBEEF]}
08-May-2018 12:07:03 Started : testThree {value=1 string=abc seed=[66C50830D7E0A861:DEADBEEF] #2}
08-May-2018 12:07:03 Finished: testThree {value=1 string=abc seed=[66C50830D7E0A861:DEADBEEF] #2}
08-May-2018 12:07:03 Started : testThree {value=1 string=abc seed=[66C50830D7E0A861:CAFEBABE]}
08-May-2018 12:07:03 Finished: testThree {value=1 string=abc seed=[66C50830D7E0A861:CAFEBABE]}
08-May-2018 12:07:03 Started : testThree {value=1 string=abc seed=[66C50830D7E0A861:CAFEBABE] #2}
08-May-2018 12:07:03 Finished: testThree {value=1 string=abc seed=[66C50830D7E0A861:CAFEBABE] #2}
08-May-2018 12:07:03 Started : testTwo {value=2 string=def}
08-May-2018 12:07:03 Finished: testTwo {value=2 string=def}
08-May-2018 12:07:03 Started : testOne {value=2 string=def seed=[66C50830D7E0A861:B2C720F30E997AF1]}
08-May-2018 12:07:03 Finished: testOne {value=2 string=def seed=[66C50830D7E0A861:B2C720F30E997AF1]}
08-May-2018 12:07:03 Started : testOne {value=2 string=def seed=[66C50830D7E0A861:6919C0F3A5BB1DD]}
08-May-2018 12:07:03 Finished: testOne {value=2 string=def seed=[66C50830D7E0A861:6919C0F3A5BB1DD]}
08-May-2018 12:07:03 Started : testOne {value=2 string=def seed=[66C50830D7E0A861:88780AD36B9FF916]}
08-May-2018 12:07:03 Finished: testOne {value=2 string=def seed=[66C50830D7E0A861:88780AD36B9FF916]}
08-May-2018 12:07:03 Started : testThree {value=2 string=def seed=[66C50830D7E0A861:DEADBEEF]}
08-May-2018 12:07:03 Finished: testThree {value=2 string=def seed=[66C50830D7E0A861:DEADBEEF]}
08-May-2018 12:07:03 Started : testThree {value=2 string=def seed=[66C50830D7E0A861:DEADBEEF] #2}
08-May-2018 12:07:03 Finished: testThree {value=2 string=def seed=[66C50830D7E0A861:DEADBEEF] #2}
08-May-2018 12:07:03 Started : testThree {value=2 string=def seed=[66C50830D7E0A861:CAFEBABE]}
08-May-2018 12:07:03 Finished: testThree {value=2 string=def seed=[66C50830D7E0A861:CAFEBABE]}
08-May-2018 12:07:03 Started : testThree {value=2 string=def seed=[66C50830D7E0A861:CAFEBABE] #2}
08-May-2018 12:07:03 Finished: testThree {value=2 string=def seed=[66C50830D7E0A861:CAFEBABE] #2}
08-May-2018 12:07:03 Run finished: run=16, ignored=0, failures=0, assumptions=0
08-May-2018 12:07:03
08-May-2018 12:07:03 Tests run: 4, Failures: 0, Errors: 0, Skipped: 0, Time elapsed: 0.038 sec - in com.carrotsearch.randomizedtesting.TestParameterized
08-May-2018 12:07:03 Running com.carrotsearch.randomizedtesting.TestFailurePropagationCompatibility
08-May-2018 12:07:04 Tests run: 1, Failures: 0, Errors: 0, Skipped: 0, Time elapsed: 0.292 sec - in com.carrotsearch.randomizedtesting.TestFailurePropagationCompatibility
08-May-2018 12:07:04 Running com.carrotsearch.randomizedtesting.TestFilterExpressionParser
08-May-2018 12:07:04 --
08-May-2018 12:07:04    default
08-May-2018 12:07:04 -- default
08-May-2018 12:07:04    default
08-May-2018 12:07:04 -- @nightly
08-May-2018 12:07:04    @nightly
08-May-2018 12:07:04 -- @nightly or @slow
08-May-2018 12:07:04    (@nightly OR @slow)
08-May-2018 12:07:04 -- @nightly and @slow
08-May-2018 12:07:04    (@nightly AND @slow)
08-May-2018 12:07:04 -- @nightly and not @slow
08-May-2018 12:07:04    (@nightly AND (NOT @slow))
08-May-2018 12:07:04 -- @nightly and (not @slow)
08-May-2018 12:07:04    (@nightly AND (NOT @slow))
08-May-2018 12:07:04 -- not @slow
08-May-2018 12:07:04    (NOT @slow)
08-May-2018 12:07:04 -- not not @slow
08-May-2018 12:07:04    (NOT (NOT @slow))
08-May-2018 12:07:04 -- not @nightly or @slow
08-May-2018 12:07:04    ((NOT @nightly) OR @slow)
08-May-2018 12:07:04 -- not(@nightly or @slow)
08-May-2018 12:07:04    (NOT (@nightly OR @slow))
08-May-2018 12:07:04 -- (@nightly and (not @slow))
08-May-2018 12:07:04    (@nightly AND (NOT @slow))
08-May-2018 12:07:04 -- nightly
08-May-2018 12:07:04    Unrecognized token 'nightly'. At: ">nightly<"
08-May-2018 12:07:04 -- @nightly and
08-May-2018 12:07:04    Missing argument for AND. At: "@nightly >and< "
08-May-2018 12:07:04 -- @nightly or
08-May-2018 12:07:04    Missing argument for OR. At: "@nightly >or< "
08-May-2018 12:07:04 -- @nightly and or @slow
08-May-2018 12:07:04    Syntax error. At: "@nightly and >or< @slow"
08-May-2018 12:07:04 -- and not @slow
08-May-2018 12:07:04    Syntax error. At: ">and< not @slow"
08-May-2018 12:07:04 -- (@nightly))
08-May-2018 12:07:04    Unbalanced parenthesis. At: "(@nightly)>)<"
08-May-2018 12:07:04 -- ((@nightly or @slow)
08-May-2018 12:07:04    Expected closing bracket. At: "((@nightly or @slow)><"
08-May-2018 12:07:04 Tests run: 5, Failures: 0, Errors: 0, Skipped: 0, Time elapsed: 0.004 sec - in com.carrotsearch.randomizedtesting.TestFilterExpressionParser
08-May-2018 12:07:04 Running com.carrotsearch.randomizedtesting.TestFormattingRandomSeeds
08-May-2018 12:07:04 Tests run: 1003, Failures: 0, Errors: 0, Skipped: 0, Time elapsed: 0.81 sec - in com.carrotsearch.randomizedtesting.TestFormattingRandomSeeds
08-May-2018 12:07:04 Running com.carrotsearch.randomizedtesting.TestRandomNumbers
08-May-2018 12:07:06 Tests run: 200, Failures: 0, Errors: 0, Skipped: 0, Time elapsed: 1.821 sec - in com.carrotsearch.randomizedtesting.TestRandomNumbers
08-May-2018 12:07:06 Running com.carrotsearch.randomizedtesting.TestContextRandom
08-May-2018 12:07:06 Run started.
08-May-2018 12:07:06 Started : testMethod
08-May-2018 12:07:06 Finished: testMethod
08-May-2018 12:07:06 Run finished: run=1, ignored=0, failures=0, assumptions=0
08-May-2018 12:07:06
08-May-2018 12:07:06 Run started.
08-May-2018 12:07:06 Started : testMethod
08-May-2018 12:07:06 Finished: testMethod
08-May-2018 12:07:06 Run finished: run=1, ignored=0, failures=0, assumptions=0
08-May-2018 12:07:06
08-May-2018 12:07:06 Run started.
08-May-2018 12:07:06 Started : testMethod
08-May-2018 12:07:06 Finished: testMethod
08-May-2018 12:07:06 Run finished: run=1, ignored=0, failures=0, assumptions=0
08-May-2018 12:07:06
08-May-2018 12:07:06 Run started.
08-May-2018 12:07:06 Started : testMethod
08-May-2018 12:07:06 Finished: testMethod
08-May-2018 12:07:06 Run finished: run=1, ignored=0, failures=0, assumptions=0
08-May-2018 12:07:06
08-May-2018 12:07:06 Tests run: 3, Failures: 0, Errors: 0, Skipped: 1, Time elapsed: 0.019 sec - in com.carrotsearch.randomizedtesting.TestContextRandom
08-May-2018 12:07:06 Running com.carrotsearch.randomizedtesting.TestRandomInStaticInitializer
08-May-2018 12:07:06 Tests run: 1, Failures: 0, Errors: 0, Skipped: 0, Time elapsed: 0.002 sec - in com.carrotsearch.randomizedtesting.TestRandomInStaticInitializer
08-May-2018 12:07:06 Running com.carrotsearch.randomizedtesting.TestStackAugmentation
08-May-2018 12:07:06 Run started.
08-May-2018 12:07:06 Started : testMethod1
08-May-2018 12:07:06 Finished: testMethod1
08-May-2018 12:07:06 Failure : com.carrotsearch.randomizedtesting.TestStackAugmentation$Nested3: afterclass.
08-May-2018 12:07:06 Run finished: run=1, ignored=0, failures=1, assumptions=0
08-May-2018 12:07:06
08-May-2018 12:07:06 Run started.
08-May-2018 12:07:06 Failure : com.carrotsearch.randomizedtesting.TestStackAugmentation$Nested2: beforeclass.
08-May-2018 12:07:06 Run finished: run=0, ignored=0, failures=1, assumptions=0
08-May-2018 12:07:06
08-May-2018 12:07:06 Run started.
08-May-2018 12:07:06 Started : testMethod1
08-May-2018 12:07:06 Failure : testMethod1(com.carrotsearch.randomizedtesting.TestStackAugmentation$Nested): Outer.
08-May-2018 12:07:06 Finished: testMethod1
08-May-2018 12:07:06 Run finished: run=1, ignored=0, failures=1, assumptions=0
08-May-2018 12:07:06
08-May-2018 12:07:06 Tests run: 3, Failures: 0, Errors: 0, Skipped: 0, Time elapsed: 0.007 sec - in com.carrotsearch.randomizedtesting.TestStackAugmentation
08-May-2018 12:07:06 Running com.carrotsearch.randomizedtesting.TestExpected
08-May-2018 12:07:06 Run started.
08-May-2018 12:07:06 Started : testMethod1
08-May-2018 12:07:06 Finished: testMethod1
08-May-2018 12:07:06 Started : testMethod2
08-May-2018 12:07:06 Failure : testMethod2(com.carrotsearch.randomizedtesting.TestExpected$Nested1): null
08-May-2018 12:07:06 Finished: testMethod2
08-May-2018 12:07:06 Run finished: run=2, ignored=0, failures=1, assumptions=0
08-May-2018 12:07:06
08-May-2018 12:07:06 Run started.
08-May-2018 12:07:06 Started : testMethod1
08-May-2018 12:07:06 Failure : testMethod1(com.carrotsearch.randomizedtesting.TestExpected$Nested2): Expected an exception but the test passed: java.lang.RuntimeException
08-May-2018 12:07:06 Finished: testMethod1
08-May-2018 12:07:06 Run finished: run=1, ignored=0, failures=1, assumptions=0
08-May-2018 12:07:06
08-May-2018 12:07:06 Tests run: 2, Failures: 0, Errors: 0, Skipped: 0, Time elapsed: 0.01 sec - in com.carrotsearch.randomizedtesting.TestExpected
08-May-2018 12:07:06 Running com.carrotsearch.randomizedtesting.contracts.TestClassRules
08-May-2018 12:07:06 Run started.
08-May-2018 12:07:06 Started : passing
08-May-2018 12:07:06 Finished: passing
08-May-2018 12:07:06 Run finished: run=1, ignored=0, failures=0, assumptions=0
08-May-2018 12:07:06
08-May-2018 12:07:06 Tests run: 1, Failures: 0, Errors: 0, Skipped: 0, Time elapsed: 0.009 sec - in com.carrotsearch.randomizedtesting.contracts.TestClassRules
08-May-2018 12:07:06 Running com.carrotsearch.randomizedtesting.contracts.TestBeforeAfterMethodOrder
08-May-2018 12:07:06 Run started.
08-May-2018 12:07:06 Started : testMethod
08-May-2018 12:07:06 Finished: testMethod
08-May-2018 12:07:06 Run finished: run=1, ignored=0, failures=0, assumptions=0
08-May-2018 12:07:06
08-May-2018 12:07:06 Tests run: 2, Failures: 0, Errors: 0, Skipped: 0, Time elapsed: 0.047 sec - in com.carrotsearch.randomizedtesting.contracts.TestBeforeAfterMethodOrder
08-May-2018 12:07:06 Running com.carrotsearch.randomizedtesting.contracts.TestClassLevelIgnore
08-May-2018 12:07:06 Run started.
08-May-2018 12:07:06 Ignored : null
08-May-2018 12:07:06 Run finished: run=0, ignored=1, failures=0, assumptions=0
08-May-2018 12:07:06
08-May-2018 12:07:06 Tests run: 1, Failures: 0, Errors: 0, Skipped: 0, Time elapsed: 0 sec - in com.carrotsearch.randomizedtesting.contracts.TestClassLevelIgnore
08-May-2018 12:07:06 Running com.carrotsearch.randomizedtesting.contracts.TestAssumptionsAtClassLevel
08-May-2018 12:07:06 Run started.
08-May-2018 12:07:06 Assumpt.: com.carrotsearch.randomizedtesting.contracts.TestAssumptionsAtClassLevel$SubSub: got: <false>, expected: is <true>
08-May-2018 12:07:06 Ignored : testMethod
08-May-2018 12:07:06 Run finished: run=0, ignored=1, failures=0, assumptions=1
08-May-2018 12:07:06
08-May-2018 12:07:06 Tests run: 1, Failures: 0, Errors: 0, Skipped: 0, Time elapsed: 0.003 sec - in com.carrotsearch.randomizedtesting.contracts.TestAssumptionsAtClassLevel
08-May-2018 12:07:06 Running com.carrotsearch.randomizedtesting.contracts.TestAnnotationInheritance
08-May-2018 12:07:06 Run started.
08-May-2018 12:07:06 Started : testMethod1
08-May-2018 12:07:06 Finished: testMethod1
08-May-2018 12:07:06 Run finished: run=1, ignored=0, failures=0, assumptions=0
08-May-2018 12:07:06
08-May-2018 12:07:06 Tests run: 1, Failures: 0, Errors: 0, Skipped: 0, Time elapsed: 0.003 sec - in com.carrotsearch.randomizedtesting.contracts.TestAnnotationInheritance
08-May-2018 12:07:06 Running com.carrotsearch.randomizedtesting.contracts.TestMethodFilteringInIDEs
08-May-2018 12:07:06 Tests run: 8, Failures: 0, Errors: 0, Skipped: 4, Time elapsed: 0.007 sec - in com.carrotsearch.randomizedtesting.contracts.TestMethodFilteringInIDEs
08-May-2018 12:07:06 Running com.carrotsearch.randomizedtesting.TestSetSeedLocked
08-May-2018 12:07:06 Tests run: 1, Failures: 0, Errors: 0, Skipped: 0, Time elapsed: 0.002 sec - in com.carrotsearch.randomizedtesting.TestSetSeedLocked
08-May-2018 12:07:06 Running com.carrotsearch.randomizedtesting.rules.TestSystemPropertiesInvariantRule
08-May-2018 12:07:06 Run started.
08-May-2018 12:07:06 Started : testEmpty
08-May-2018 12:07:06 Finished: testEmpty
08-May-2018 12:07:06 Failure : com.carrotsearch.randomizedtesting.rules.TestSystemPropertiesInvariantRule$InBeforeClass: System properties invariant violated.
08-May-2018 12:07:06 New keys:
08-May-2018 12:07:06   new-property-1=new-value-1
08-May-2018 12:07:06
08-May-2018 12:07:06 Run finished: run=1, ignored=0, failures=1, assumptions=0
08-May-2018 12:07:06
08-May-2018 12:07:06 Run started.
08-May-2018 12:07:06 Started : testEmpty
08-May-2018 12:07:06 Finished: testEmpty
08-May-2018 12:07:06 Failure : com.carrotsearch.randomizedtesting.rules.TestSystemPropertiesInvariantRule$InAfterClass: System properties invariant violated.
08-May-2018 12:07:06 New keys:
08-May-2018 12:07:06   new-property-1=new-value-1
08-May-2018 12:07:06
08-May-2018 12:07:06 Run finished: run=1, ignored=0, failures=1, assumptions=0
08-May-2018 12:07:06
08-May-2018 12:07:06 Run started.
08-May-2018 12:07:06 Started : testMethod2
08-May-2018 12:07:06 Failure : testMethod2(com.carrotsearch.randomizedtesting.rules.TestSystemPropertiesInvariantRule$InTestMethod): System properties invariant violated.
08-May-2018 12:07:06 New keys:
08-May-2018 12:07:06   new-property-1=new-value-1
08-May-2018 12:07:06
08-May-2018 12:07:06 Finished: testMethod2
08-May-2018 12:07:06 Started : testMethod1
08-May-2018 12:07:06 Failure : testMethod1(com.carrotsearch.randomizedtesting.rules.TestSystemPropertiesInvariantRule$InTestMethod): System properties invariant violated.
08-May-2018 12:07:06 New keys:
08-May-2018 12:07:06   new-property-1=new-value-1
08-May-2018 12:07:06
08-May-2018 12:07:06 Finished: testMethod1
08-May-2018 12:07:06 Started : testEmpty
08-May-2018 12:07:06 Finished: testEmpty
08-May-2018 12:07:06 Run finished: run=3, ignored=0, failures=2, assumptions=0
08-May-2018 12:07:06
08-May-2018 12:07:06 Run started.
08-May-2018 12:07:06 Started : testMethod2
08-May-2018 12:07:06 Finished: testMethod2
08-May-2018 12:07:06 Started : testMethod1
08-May-2018 12:07:06 Failure : testMethod1(com.carrotsearch.randomizedtesting.rules.TestSystemPropertiesInvariantRule$NonStringProperties): Will pass.
08-May-2018 12:07:06 Finished: testMethod1
08-May-2018 12:07:06 Started : testEmpty
08-May-2018 12:07:06 Finished: testEmpty
08-May-2018 12:07:06 Run finished: run=3, ignored=0, failures=1, assumptions=0
08-May-2018 12:07:06
08-May-2018 12:07:06 Tests run: 4, Failures: 0, Errors: 0, Skipped: 0, Time elapsed: 0.007 sec - in com.carrotsearch.randomizedtesting.rules.TestSystemPropertiesInvariantRule
08-May-2018 12:07:06 Running com.carrotsearch.randomizedtesting.rules.TestNoInstanceHooksOverridesRule
08-May-2018 12:07:06 Run started.
08-May-2018 12:07:06 Failure : com.carrotsearch.randomizedtesting.rules.TestNoInstanceHooksOverridesRule$Sub1: There are overridden methods annotated with org.junit.Before. These methods would not be executed by JUnit and need to manually chain themselves which can lead to maintenance problems. Consider using different method names or make hook methods private.
08-May-2018 12:07:06 Methods annotated with @org.junit.Before shadow or override each other:
08-May-2018 12:07:06   - @Before public void com.carrotsearch.randomizedtesting.rules.TestNoInstanceHooksOverridesRule$Super.before()
08-May-2018 12:07:06   - public void com.carrotsearch.randomizedtesting.rules.TestNoInstanceHooksOverridesRule$Sub1.before()
08-May-2018 12:07:06 Run finished: run=0, ignored=0, failures=1, assumptions=0
08-May-2018 12:07:06
08-May-2018 12:07:06 Run started.
08-May-2018 12:07:06 Failure : com.carrotsearch.randomizedtesting.rules.TestNoInstanceHooksOverridesRule$Sub2: There are overridden methods annotated with org.junit.Before. These methods would not be executed by JUnit and need to manually chain themselves which can lead to maintenance problems. Consider using different method names or make hook methods private.
08-May-2018 12:07:06 Methods annotated with @org.junit.Before shadow or override each other:
08-May-2018 12:07:06   - @Before public void com.carrotsearch.randomizedtesting.rules.TestNoInstanceHooksOverridesRule$Super.before()
08-May-2018 12:07:06   - @Before public void com.carrotsearch.randomizedtesting.rules.TestNoInstanceHooksOverridesRule$Sub2.before()
08-May-2018 12:07:06 Run finished: run=0, ignored=0, failures=1, assumptions=0
08-May-2018 12:07:06
08-May-2018 12:07:06 Run started.
08-May-2018 12:07:06 Started : testEmpty
08-May-2018 12:07:06 Finished: testEmpty
08-May-2018 12:07:06 Run finished: run=1, ignored=0, failures=0, assumptions=0
08-May-2018 12:07:06
08-May-2018 12:07:06 Run started.
08-May-2018 12:07:06 Started : testEmpty
08-May-2018 12:07:06 Finished: testEmpty
08-May-2018 12:07:06 Run finished: run=1, ignored=0, failures=0, assumptions=0
08-May-2018 12:07:06
08-May-2018 12:07:06 Tests run: 4, Failures: 0, Errors: 0, Skipped: 0, Time elapsed: 0.022 sec - in com.carrotsearch.randomizedtesting.rules.TestNoInstanceHooksOverridesRule
08-May-2018 12:07:06 Running com.carrotsearch.randomizedtesting.rules.TestNoClassHooksShadowingRule
08-May-2018 12:07:06 Run started.
08-May-2018 12:07:06 Failure : com.carrotsearch.randomizedtesting.rules.TestNoClassHooksShadowingRule$Sub1: There are overridden methods annotated with org.junit.BeforeClass. These methods would not be executed by JUnit and need to manually chain themselves which can lead to maintenance problems. Consider using different method names or make hook methods private.
08-May-2018 12:07:06 Methods annotated with @org.junit.BeforeClass shadow or override each other:
08-May-2018 12:07:06   - @BeforeClass public static void com.carrotsearch.randomizedtesting.rules.TestNoClassHooksShadowingRule$Super.before()
08-May-2018 12:07:06   - public static void com.carrotsearch.randomizedtesting.rules.TestNoClassHooksShadowingRule$Sub1.before()
08-May-2018 12:07:06 Run finished: run=0, ignored=0, failures=1, assumptions=0
08-May-2018 12:07:06
08-May-2018 12:07:06 Run started.
08-May-2018 12:07:06 Started : testEmpty
08-May-2018 12:07:06 Finished: testEmpty
08-May-2018 12:07:06 Run finished: run=1, ignored=0, failures=0, assumptions=0
08-May-2018 12:07:06
08-May-2018 12:07:06 Run started.
08-May-2018 12:07:06 Failure : com.carrotsearch.randomizedtesting.rules.TestNoClassHooksShadowingRule$Sub2: There are overridden methods annotated with org.junit.BeforeClass. These methods would not be executed by JUnit and need to manually chain themselves which can lead to maintenance problems. Consider using different method names or make hook methods private.
08-May-2018 12:07:06 Methods annotated with @org.junit.BeforeClass shadow or override each other:
08-May-2018 12:07:06   - @BeforeClass public static void com.carrotsearch.randomizedtesting.rules.TestNoClassHooksShadowingRule$Super.before()
08-May-2018 12:07:06   - @BeforeClass public static void com.carrotsearch.randomizedtesting.rules.TestNoClassHooksShadowingRule$Sub2.before()
08-May-2018 12:07:06 Run finished: run=0, ignored=0, failures=1, assumptions=0
08-May-2018 12:07:06
08-May-2018 12:07:06 Tests run: 3, Failures: 0, Errors: 0, Skipped: 0, Time elapsed: 0.023 sec - in com.carrotsearch.randomizedtesting.rules.TestNoClassHooksShadowingRule
08-May-2018 12:07:06 Running com.carrotsearch.randomizedtesting.rules.TestStaticFieldsInvariantRule
08-May-2018 12:07:06 Run started.
08-May-2018 12:07:06 Started : testEmpty
08-May-2018 12:07:06 Finished: testEmpty
08-May-2018 12:07:06 Run finished: run=1, ignored=0, failures=0, assumptions=0
08-May-2018 12:07:06
08-May-2018 12:07:06 Run started.
08-May-2018 12:07:06 Started : testEmpty
08-May-2018 12:07:06 Finished: testEmpty
08-May-2018 12:07:06 Run finished: run=1, ignored=0, failures=0, assumptions=0
08-May-2018 12:07:06
08-May-2018 12:07:06 Run started.
08-May-2018 12:07:06 Started : testEmpty
08-May-2018 12:07:06 Finished: testEmpty
08-May-2018 12:07:06 Failure : com.carrotsearch.randomizedtesting.rules.TestStaticFieldsInvariantRule$Exceeding: Clean up static fields (in @AfterClass?), your test seems to hang on to approximately 5,243,600 bytes (threshold is 5,242,880). Field reference sizes (counted individually):
08-May-2018 12:07:06   - 2,621,456 bytes, static byte[] com.carrotsearch.randomizedtesting.rules.TestStaticFieldsInvariantRule$Exceeding.field1
08-May-2018 12:07:06   - 2,621,456 bytes, static byte[] com.carrotsearch.randomizedtesting.rules.TestStaticFieldsInvariantRule$Smaller.field0
08-May-2018 12:07:06   - 416 bytes, static int[] com.carrotsearch.randomizedtesting.rules.TestStaticFieldsInvariantRule$Exceeding.field3
08-May-2018 12:07:06   - 136 bytes, public static org.junit.rules.TestRule com.carrotsearch.randomizedtesting.rules.TestStaticFieldsInvariantRule$Base.classRules
08-May-2018 12:07:06   - 120 bytes, static byte[] com.carrotsearch.randomizedtesting.rules.TestStaticFieldsInvariantRule$Exceeding.field2
08-May-2018 12:07:06   - 16 bytes, private static java.util.concurrent.atomic.AtomicInteger com.carrotsearch.randomizedtesting.RandomizedTest.tempSubFileNameCount
08-May-2018 12:07:06   - 16 bytes, private static org.junit.rules.TestRule com.carrotsearch.randomizedtesting.rules.TestStaticFieldsInvariantRule$Base.assumeNotNestedRule
08-May-2018 12:07:06 Run finished: run=1, ignored=0, failures=1, assumptions=0
08-May-2018 12:07:06
08-May-2018 12:07:06 Tests run: 4, Failures: 0, Errors: 0, Skipped: 1, Time elapsed: 0.025 sec - in com.carrotsearch.randomizedtesting.rules.TestStaticFieldsInvariantRule
08-May-2018 12:07:06 Running com.carrotsearch.randomizedtesting.TestInstantiationTime
08-May-2018 12:07:06 Tests run: 1, Failures: 0, Errors: 0, Skipped: 0, Time elapsed: 0.001 sec - in com.carrotsearch.randomizedtesting.TestInstantiationTime
08-May-2018 12:07:06 Running com.carrotsearch.randomizedtesting.TestRandomizedContext
08-May-2018 12:07:06 Tests run: 1, Failures: 0, Errors: 0, Skipped: 0, Time elapsed: 0.007 sec - in com.carrotsearch.randomizedtesting.TestRandomizedContext
08-May-2018 12:07:06 Running com.carrotsearch.randomizedtesting.TestTestGroups
08-May-2018 12:07:06 Run started.
08-May-2018 12:07:06 Started : test1
08-May-2018 12:07:06 Assumpt.: test1(com.carrotsearch.randomizedtesting.TestTestGroups$Nested1): 'abc' test group is disabled (@Group2())
08-May-2018 12:07:06 Finished: test1
08-May-2018 12:07:06 Run finished: run=1, ignored=0, failures=0, assumptions=1
08-May-2018 12:07:06
08-May-2018 12:07:06 Run started.
08-May-2018 12:07:06 Started : test1
08-May-2018 12:07:06 Assumpt.: test1(com.carrotsearch.randomizedtesting.TestTestGroups$Nested1): 'abc' test group is disabled (@Group2())
08-May-2018 12:07:06 Finished: test1
08-May-2018 12:07:06 Run finished: run=1, ignored=0, failures=0, assumptions=1
08-May-2018 12:07:06
08-May-2018 12:07:06 Run started.
08-May-2018 12:07:06 Started : test1
08-May-2018 12:07:06 Finished: test1
08-May-2018 12:07:06 Run finished: run=1, ignored=0, failures=0, assumptions=0
08-May-2018 12:07:06
08-May-2018 12:07:06 Run started.
08-May-2018 12:07:06 Started : test1
08-May-2018 12:07:06 Assumpt.: test1(com.carrotsearch.randomizedtesting.TestTestGroups$Nested1): 'group1' test group is disabled (@Group1())
08-May-2018 12:07:06 Finished: test1
08-May-2018 12:07:06 Run finished: run=1, ignored=0, failures=0, assumptions=1
08-May-2018 12:07:06
08-May-2018 12:07:06 Run started.
08-May-2018 12:07:06 Started : test1
08-May-2018 12:07:06 Assumpt.: test1(com.carrotsearch.randomizedtesting.TestTestGroups$Nested3): 'abc' test group is disabled (@Group2())
08-May-2018 12:07:06 Finished: test1
08-May-2018 12:07:06 Started : testUnconditional
08-May-2018 12:07:06 Finished: testUnconditional
08-May-2018 12:07:06 Run finished: run=2, ignored=0, failures=0, assumptions=1
08-May-2018 12:07:06
08-May-2018 12:07:06 Run started.
08-May-2018 12:07:06 Started : testUnconditional
08-May-2018 12:07:06 Finished: testUnconditional
08-May-2018 12:07:06 Started : test1
08-May-2018 12:07:06 Assumpt.: test1(com.carrotsearch.randomizedtesting.TestTestGroups$Nested3): 'abc' test group is disabled (@Group2())
08-May-2018 12:07:06 Finished: test1
08-May-2018 12:07:06 Run finished: run=2, ignored=0, failures=0, assumptions=1
08-May-2018 12:07:06
08-May-2018 12:07:06 Run started.
08-May-2018 12:07:06 Started : testUnconditional
08-May-2018 12:07:06 Finished: testUnconditional
08-May-2018 12:07:06 Started : test1
08-May-2018 12:07:06 Finished: test1
08-May-2018 12:07:06 Run finished: run=2, ignored=0, failures=0, assumptions=0
08-May-2018 12:07:06
08-May-2018 12:07:06 Run started.
08-May-2018 12:07:06 Started : test1
08-May-2018 12:07:06 Assumpt.: test1(com.carrotsearch.randomizedtesting.TestTestGroups$Nested3): 'group1' test group is disabled (@Group1())
08-May-2018 12:07:06 Finished: test1
08-May-2018 12:07:06 Started : testUnconditional
08-May-2018 12:07:06 Finished: testUnconditional
08-May-2018 12:07:06 Run finished: run=2, ignored=0, failures=0, assumptions=1
08-May-2018 12:07:06
08-May-2018 12:07:06 Run started.
08-May-2018 12:07:06 Started : test1
08-May-2018 12:07:06 Assumpt.: test1(com.carrotsearch.randomizedtesting.TestTestGroups$Nested2): 'abc' test group is disabled (@Group2())
08-May-2018 12:07:06 Finished: test1
08-May-2018 12:07:06 Run finished: run=1, ignored=0, failures=0, assumptions=1
08-May-2018 12:07:06
08-May-2018 12:07:06 Run started.
08-May-2018 12:07:06 Started : test1
08-May-2018 12:07:06 Assumpt.: test1(com.carrotsearch.randomizedtesting.TestTestGroups$Nested2): 'abc' test group is disabled (@Group2())
08-May-2018 12:07:06 Finished: test1
08-May-2018 12:07:06 Run finished: run=1, ignored=0, failures=0, assumptions=1
08-May-2018 12:07:06
08-May-2018 12:07:06 Run started.
08-May-2018 12:07:06 Started : test1
08-May-2018 12:07:06 Finished: test1
08-May-2018 12:07:06 Run finished: run=1, ignored=0, failures=0, assumptions=0
08-May-2018 12:07:06
08-May-2018 12:07:06 Run started.
08-May-2018 12:07:06 Started : test1
08-May-2018 12:07:06 Assumpt.: test1(com.carrotsearch.randomizedtesting.TestTestGroups$Nested2): 'group1' test group is disabled (@Group1())
08-May-2018 12:07:06 Finished: test1
08-May-2018 12:07:06 Run finished: run=1, ignored=0, failures=0, assumptions=1
08-May-2018 12:07:06
08-May-2018 12:07:06 Tests run: 4, Failures: 0, Errors: 0, Skipped: 0, Time elapsed: 0.044 sec - in com.carrotsearch.randomizedtesting.TestTestGroups
08-May-2018 12:07:06 Running com.carrotsearch.randomizedtesting.generators.TestUnicodeGenerator
08-May-2018 12:07:07 Tests run: 41, Failures: 0, Errors: 0, Skipped: 0, Time elapsed: 0.028 sec - in com.carrotsearch.randomizedtesting.generators.TestUnicodeGenerator
08-May-2018 12:07:07 Running com.carrotsearch.randomizedtesting.generators.TestRealisticUnicodeGenerator
08-May-2018 12:07:07 Tests run: 41, Failures: 0, Errors: 0, Skipped: 0, Time elapsed: 0.034 sec - in com.carrotsearch.randomizedtesting.generators.TestRealisticUnicodeGenerator
08-May-2018 12:07:07 Running com.carrotsearch.randomizedtesting.generators.TestCodepointSetGenerator
08-May-2018 12:07:07 Tests run: 127, Failures: 0, Errors: 0, Skipped: 0, Time elapsed: 0.106 sec - in com.carrotsearch.randomizedtesting.generators.TestCodepointSetGenerator
08-May-2018 12:07:07 Running com.carrotsearch.randomizedtesting.generators.TestRandomBytes
08-May-2018 12:07:07 Tests run: 200, Failures: 0, Errors: 0, Skipped: 0, Time elapsed: 0.124 sec - in com.carrotsearch.randomizedtesting.generators.TestRandomBytes
08-May-2018 12:07:07 Running com.carrotsearch.randomizedtesting.generators.TestRandomPicks
08-May-2018 12:07:07 Tests run: 4, Failures: 0, Errors: 0, Skipped: 0, Time elapsed: 0.001 sec - in com.carrotsearch.randomizedtesting.generators.TestRandomPicks
08-May-2018 12:07:07 Running com.carrotsearch.randomizedtesting.TestRandomizedTest
08-May-2018 12:07:07 Wtf.
08-May-2018 12:07:07 java.lang.NullPointerException
08-May-2018 12:07:07         at sun.util.calendar.ZoneInfoFile.getZoneIDs(ZoneInfoFile.java:790)
08-May-2018 12:07:07         at sun.util.calendar.ZoneInfo.getAvailableIDs(ZoneInfo.java:576)
08-May-2018 12:07:07         at java.util.TimeZone.getAvailableIDs(TimeZone.java:594)
08-May-2018 12:07:07         at com.carrotsearch.randomizedtesting.TestRandomizedTest.testRandomTimeZone(TestRandomizedTest.java:151)
08-May-2018 12:07:07         at sun.reflect.NativeMethodAccessorImpl.invoke0(Native Method)
08-May-2018 12:07:07         at sun.reflect.NativeMethodAccessorImpl.invoke(NativeMethodAccessorImpl.java:57)
08-May-2018 12:07:07         at sun.reflect.DelegatingMethodAccessorImpl.invoke(DelegatingMethodAccessorImpl.java:43)
08-May-2018 12:07:07         at java.lang.reflect.Method.invoke(Method.java:606)
08-May-2018 12:07:07         at com.carrotsearch.randomizedtesting.RandomizedRunner.invoke(RandomizedRunner.java:1737)
08-May-2018 12:07:07         at com.carrotsearch.randomizedtesting.RandomizedRunner$8.evaluate(RandomizedRunner.java:934)
08-May-2018 12:07:07         at com.carrotsearch.randomizedtesting.rules.StatementAdapter.evaluate(StatementAdapter.java:36)
08-May-2018 12:07:07         at com.carrotsearch.randomizedtesting.ThreadLeakControl$StatementRunner.run(ThreadLeakControl.java:368)
08-May-2018 12:07:07         at com.carrotsearch.randomizedtesting.ThreadLeakControl.forkTimeoutingTask(ThreadLeakControl.java:817)
08-May-2018 12:07:07         at com.carrotsearch.randomizedtesting.ThreadLeakControl$3.evaluate(ThreadLeakControl.java:468)
08-May-2018 12:07:07         at com.carrotsearch.randomizedtesting.RandomizedRunner.runSingleTest(RandomizedRunner.java:943)
08-May-2018 12:07:07         at com.carrotsearch.randomizedtesting.RandomizedRunner$5.evaluate(RandomizedRunner.java:829)
08-May-2018 12:07:07         at com.carrotsearch.randomizedtesting.RandomizedRunner$6.evaluate(RandomizedRunner.java:879)
08-May-2018 12:07:07         at com.carrotsearch.randomizedtesting.RandomizedRunner$7.evaluate(RandomizedRunner.java:890)
08-May-2018 12:07:07         at com.carrotsearch.randomizedtesting.rules.StatementAdapter.evaluate(StatementAdapter.java:36)
08-May-2018 12:07:07         at com.carrotsearch.randomizedtesting.ThreadLeakControl$StatementRunner.run(ThreadLeakControl.java:368)
08-May-2018 12:07:07         at com.carrotsearch.randomizedtesting.ThreadLeakControl.forkTimeoutingTask(ThreadLeakControl.java:817)
08-May-2018 12:07:07         at com.carrotsearch.randomizedtesting.ThreadLeakControl$2.evaluate(ThreadLeakControl.java:404)
08-May-2018 12:07:07         at com.carrotsearch.randomizedtesting.RandomizedRunner.runSuite(RandomizedRunner.java:705)
08-May-2018 12:07:07         at com.carrotsearch.randomizedtesting.RandomizedRunner.access$200(RandomizedRunner.java:139)
08-May-2018 12:07:07         at com.carrotsearch.randomizedtesting.RandomizedRunner$2.run(RandomizedRunner.java:626)
08-May-2018 12:07:07 Tests run: 20, Failures: 0, Errors: 1, Skipped: 0, Time elapsed: 0.108 sec <<< FAILURE! - in com.carrotsearch.randomizedtesting.TestRandomizedTest
08-May-2018 12:07:07 testRandomTimeZone(com.carrotsearch.randomizedtesting.TestRandomizedTest)  Time elapsed: 0.003 sec  <<< ERROR!
08-May-2018 12:07:07 java.lang.NullPointerException
08-May-2018 12:07:07         at com.carrotsearch.randomizedtesting.TestRandomizedTest.testRandomTimeZone(TestRandomizedTest.java:151)
08-May-2018 12:07:07
08-May-2018 12:07:07 Running com.carrotsearch.randomizedtesting.TestSeedDecorator
08-May-2018 12:07:07 Run started.
08-May-2018 12:07:07 Started : method1
08-May-2018 12:07:07 Finished: method1
08-May-2018 12:07:07 Started : method1
08-May-2018 12:07:07 Finished: method1
08-May-2018 12:07:07 Started : method1
08-May-2018 12:07:07 Finished: method1
08-May-2018 12:07:07 Started : method1
08-May-2018 12:07:07 Finished: method1
08-May-2018 12:07:07 Run finished: run=4, ignored=0, failures=0, assumptions=0
08-May-2018 12:07:07
08-May-2018 12:07:07 Tests run: 1, Failures: 0, Errors: 0, Skipped: 0, Time elapsed: 0.001 sec - in com.carrotsearch.randomizedtesting.TestSeedDecorator
08-May-2018 12:07:07 Running com.carrotsearch.randomizedtesting.TestOverlappingMethodProviders
08-May-2018 12:07:07 Tests run: 1, Failures: 0, Errors: 0, Skipped: 0, Time elapsed: 0 sec - in com.carrotsearch.randomizedtesting.TestOverlappingMethodProviders
08-May-2018 12:07:07 Running com.carrotsearch.randomizedtesting.TestJ9SysThreads
08-May-2018 12:07:07 Run started.
08-May-2018 12:07:07 Started : testMethod1
08-May-2018 12:07:07 sun.management.MemoryPoolImpl
08-May-2018 12:07:07 sun.management.MemoryPoolImpl
08-May-2018 12:07:07 sun.management.MemoryPoolImpl
08-May-2018 12:07:07 sun.management.MemoryPoolImpl
08-May-2018 12:07:07 sun.management.MemoryPoolImpl
08-May-2018 12:07:07 Finished: testMethod1
08-May-2018 12:07:07 Run finished: run=1, ignored=0, failures=0, assumptions=0
08-May-2018 12:07:07
08-May-2018 12:07:07 Tests run: 1, Failures: 0, Errors: 0, Skipped: 0, Time elapsed: 0.002 sec - in com.carrotsearch.randomizedtesting.TestJ9SysThreads
08-May-2018 12:07:07 Running com.carrotsearch.randomizedtesting.TestHookMethodOrderWithExceptions
08-May-2018 12:07:07 Run started.
08-May-2018 12:07:07 Started : testMethod
08-May-2018 12:07:07 Failure : testMethod(com.carrotsearch.randomizedtesting.TestHookMethodOrderWithExceptions$WithRegularRunner): null
08-May-2018 12:07:07 Finished: testMethod
08-May-2018 12:07:07 Run finished: run=1, ignored=0, failures=1, assumptions=0
08-May-2018 12:07:07
08-May-2018 12:07:07 Run started.
08-May-2018 12:07:07 Started : testMethod
08-May-2018 12:07:07 Failure : testMethod(com.carrotsearch.randomizedtesting.TestHookMethodOrderWithExceptions$WithRandomizedRunner): null
08-May-2018 12:07:07 Finished: testMethod
08-May-2018 12:07:07 Run finished: run=1, ignored=0, failures=1, assumptions=0
08-May-2018 12:07:07
08-May-2018 12:07:07 Run started.
08-May-2018 12:07:07 Failure : com.carrotsearch.randomizedtesting.TestHookMethodOrderWithExceptions$WithRegularRunner: null
08-May-2018 12:07:07 Run finished: run=0, ignored=0, failures=1, assumptions=0
08-May-2018 12:07:07
08-May-2018 12:07:07 Run started.
08-May-2018 12:07:07 Failure : com.carrotsearch.randomizedtesting.TestHookMethodOrderWithExceptions$WithRandomizedRunner: null
08-May-2018 12:07:07 Run finished: run=0, ignored=0, failures=1, assumptions=0
08-May-2018 12:07:07
08-May-2018 12:07:07 Run started.
08-May-2018 12:07:07 Started : testMethod
08-May-2018 12:07:07 Failure : testMethod(com.carrotsearch.randomizedtesting.TestHookMethodOrderWithExceptions$WithRegularRunner): null
08-May-2018 12:07:07 Finished: testMethod
08-May-2018 12:07:07 Run finished: run=1, ignored=0, failures=1, assumptions=0
08-May-2018 12:07:07
08-May-2018 12:07:07 Run started.
08-May-2018 12:07:07 Started : testMethod
08-May-2018 12:07:07 Failure : testMethod(com.carrotsearch.randomizedtesting.TestHookMethodOrderWithExceptions$WithRandomizedRunner): null
08-May-2018 12:07:07 Finished: testMethod
08-May-2018 12:07:07 Run finished: run=1, ignored=0, failures=1, assumptions=0
08-May-2018 12:07:07
08-May-2018 12:07:07 Run started.
08-May-2018 12:07:07 Started : testMethod
08-May-2018 12:07:07 Finished: testMethod
08-May-2018 12:07:07 Run finished: run=1, ignored=0, failures=0, assumptions=0
08-May-2018 12:07:07
08-May-2018 12:07:07 Run started.
08-May-2018 12:07:07 Started : testMethod
08-May-2018 12:07:07 Finished: testMethod
08-May-2018 12:07:07 Run finished: run=1, ignored=0, failures=0, assumptions=0
08-May-2018 12:07:07
08-May-2018 12:07:07 Run started.
08-May-2018 12:07:07 Started : testMethod
08-May-2018 12:07:07 Finished: testMethod
08-May-2018 12:07:07 Run finished: run=1, ignored=0, failures=0, assumptions=0
08-May-2018 12:07:07
08-May-2018 12:07:07 Run started.
08-May-2018 12:07:07 Started : testMethod
08-May-2018 12:07:07 Finished: testMethod
08-May-2018 12:07:07 Run finished: run=1, ignored=0, failures=0, assumptions=0
08-May-2018 12:07:07
08-May-2018 12:07:07 Run started.
08-May-2018 12:07:07 Started : testMethod
08-May-2018 12:07:07 Finished: testMethod
08-May-2018 12:07:07 Run finished: run=1, ignored=0, failures=0, assumptions=0
08-May-2018 12:07:07
08-May-2018 12:07:07 Run started.
08-May-2018 12:07:07 Started : testMethod
08-May-2018 12:07:07 Finished: testMethod
08-May-2018 12:07:07 Run finished: run=1, ignored=0, failures=0, assumptions=0
08-May-2018 12:07:07
08-May-2018 12:07:07 Run started.
08-May-2018 12:07:07 Started : testMethod
08-May-2018 12:07:07 Finished: testMethod
08-May-2018 12:07:07 Run finished: run=1, ignored=0, failures=0, assumptions=0
08-May-2018 12:07:07
08-May-2018 12:07:07 Run started.
08-May-2018 12:07:07 Started : testMethod
08-May-2018 12:07:07 Finished: testMethod
08-May-2018 12:07:07 Run finished: run=1, ignored=0, failures=0, assumptions=0
08-May-2018 12:07:07
08-May-2018 12:07:07 Run started.
08-May-2018 12:07:07 Started : testMethod
08-May-2018 12:07:07 Finished: testMethod
08-May-2018 12:07:07 Failure : com.carrotsearch.randomizedtesting.TestHookMethodOrderWithExceptions$WithRegularRunner: null
08-May-2018 12:07:07 Run finished: run=1, ignored=0, failures=1, assumptions=0
08-May-2018 12:07:07
08-May-2018 12:07:07 Run started.
08-May-2018 12:07:07 Started : testMethod
08-May-2018 12:07:07 Finished: testMethod
08-May-2018 12:07:07 Failure : com.carrotsearch.randomizedtesting.TestHookMethodOrderWithExceptions$WithRandomizedRunner: null
08-May-2018 12:07:07 Run finished: run=1, ignored=0, failures=1, assumptions=0
08-May-2018 12:07:07
08-May-2018 12:07:07 Run started.
08-May-2018 12:07:07 Started : testMethod
08-May-2018 12:07:07 Finished: testMethod
08-May-2018 12:07:07 Run finished: run=1, ignored=0, failures=0, assumptions=0
08-May-2018 12:07:07
08-May-2018 12:07:07 Run started.
08-May-2018 12:07:07 Started : testMethod
08-May-2018 12:07:07 Finished: testMethod
08-May-2018 12:07:07 Run finished: run=1, ignored=0, failures=0, assumptions=0
08-May-2018 12:07:07
08-May-2018 12:07:07 Run started.
08-May-2018 12:07:07 Started : testMethod
08-May-2018 12:07:07 Failure : testMethod(com.carrotsearch.randomizedtesting.TestHookMethodOrderWithExceptions$WithRegularRunner): null
08-May-2018 12:07:07 Finished: testMethod
08-May-2018 12:07:07 Run finished: run=1, ignored=0, failures=1, assumptions=0
08-May-2018 12:07:07
08-May-2018 12:07:07 Run started.
08-May-2018 12:07:07 Started : testMethod
08-May-2018 12:07:07 Failure : testMethod(com.carrotsearch.randomizedtesting.TestHookMethodOrderWithExceptions$WithRandomizedRunner): null
08-May-2018 12:07:07 Finished: testMethod
08-May-2018 12:07:07 Run finished: run=1, ignored=0, failures=1, assumptions=0
08-May-2018 12:07:07
08-May-2018 12:07:07 Run started.
08-May-2018 12:07:07 Started : testMethod
08-May-2018 12:07:07 Finished: testMethod
08-May-2018 12:07:07 Run finished: run=1, ignored=0, failures=0, assumptions=0
08-May-2018 12:07:07
08-May-2018 12:07:07 Run started.
08-May-2018 12:07:07 Started : testMethod
08-May-2018 12:07:07 Finished: testMethod
08-May-2018 12:07:07 Run finished: run=1, ignored=0, failures=0, assumptions=0
08-May-2018 12:07:07
08-May-2018 12:07:07 Run started.
08-May-2018 12:07:07 Failure : com.carrotsearch.randomizedtesting.TestHookMethodOrderWithExceptions$WithRegularRunner: null
08-May-2018 12:07:07 Run finished: run=0, ignored=0, failures=1, assumptions=0
08-May-2018 12:07:07
08-May-2018 12:07:07 Run started.
08-May-2018 12:07:07 Failure : com.carrotsearch.randomizedtesting.TestHookMethodOrderWithExceptions$WithRandomizedRunner: null
08-May-2018 12:07:07 Run finished: run=0, ignored=0, failures=1, assumptions=0
08-May-2018 12:07:07
08-May-2018 12:07:07 Run started.
08-May-2018 12:07:07 Started : testMethod
08-May-2018 12:07:07 Finished: testMethod
08-May-2018 12:07:07 Failure : com.carrotsearch.randomizedtesting.TestHookMethodOrderWithExceptions$WithRegularRunner: null
08-May-2018 12:07:07 Run finished: run=1, ignored=0, failures=1, assumptions=0
08-May-2018 12:07:07
08-May-2018 12:07:07 Run started.
08-May-2018 12:07:07 Started : testMethod
08-May-2018 12:07:07 Finished: testMethod
08-May-2018 12:07:07 Failure : com.carrotsearch.randomizedtesting.TestHookMethodOrderWithExceptions$WithRandomizedRunner: null
08-May-2018 12:07:07 Run finished: run=1, ignored=0, failures=1, assumptions=0
08-May-2018 12:07:07
08-May-2018 12:07:07 Run started.
08-May-2018 12:07:07 Failure : com.carrotsearch.randomizedtesting.TestHookMethodOrderWithExceptions$WithRegularRunner: null
08-May-2018 12:07:07 Run finished: run=0, ignored=0, failures=1, assumptions=0
08-May-2018 12:07:07
08-May-2018 12:07:07 Run started.
08-May-2018 12:07:07 Failure : com.carrotsearch.randomizedtesting.TestHookMethodOrderWithExceptions$WithRandomizedRunner: null
08-May-2018 12:07:07 Run finished: run=0, ignored=0, failures=1, assumptions=0
08-May-2018 12:07:07
08-May-2018 12:07:07 Run started.
08-May-2018 12:07:07 Started : testMethod
08-May-2018 12:07:07 Finished: testMethod
08-May-2018 12:07:07 Failure : com.carrotsearch.randomizedtesting.TestHookMethodOrderWithExceptions$WithRegularRunner: null
08-May-2018 12:07:07 Run finished: run=1, ignored=0, failures=1, assumptions=0
08-May-2018 12:07:07
08-May-2018 12:07:07 Run started.
08-May-2018 12:07:07 Started : testMethod
08-May-2018 12:07:07 Finished: testMethod
08-May-2018 12:07:07 Failure : com.carrotsearch.randomizedtesting.TestHookMethodOrderWithExceptions$WithRandomizedRunner: null
08-May-2018 12:07:07 Run finished: run=1, ignored=0, failures=1, assumptions=0
08-May-2018 12:07:07
08-May-2018 12:07:07 Run started.
08-May-2018 12:07:07 Started : testMethod
08-May-2018 12:07:07 Finished: testMethod
08-May-2018 12:07:07 Run finished: run=1, ignored=0, failures=0, assumptions=0
08-May-2018 12:07:07
08-May-2018 12:07:07 Run started.
08-May-2018 12:07:07 Started : testMethod
08-May-2018 12:07:07 Finished: testMethod
08-May-2018 12:07:07 Run finished: run=1, ignored=0, failures=0, assumptions=0
08-May-2018 12:07:07
08-May-2018 12:07:07 Run started.
08-May-2018 12:07:07 Started : testMethod
08-May-2018 12:07:07 Finished: testMethod
08-May-2018 12:07:07 Run finished: run=1, ignored=0, failures=0, assumptions=0
08-May-2018 12:07:07
08-May-2018 12:07:07 Run started.
08-May-2018 12:07:07 Started : testMethod
08-May-2018 12:07:07 Finished: testMethod
08-May-2018 12:07:07 Run finished: run=1, ignored=0, failures=0, assumptions=0
08-May-2018 12:07:07
08-May-2018 12:07:07 Run started.
08-May-2018 12:07:07 Started : testMethod
08-May-2018 12:07:07 Failure : testMethod(com.carrotsearch.randomizedtesting.TestHookMethodOrderWithExceptions$WithRegularRunner): null
08-May-2018 12:07:07 Finished: testMethod
08-May-2018 12:07:07 Run finished: run=1, ignored=0, failures=1, assumptions=0
08-May-2018 12:07:07
08-May-2018 12:07:07 Run started.
08-May-2018 12:07:07 Started : testMethod
08-May-2018 12:07:07 Failure : testMethod(com.carrotsearch.randomizedtesting.TestHookMethodOrderWithExceptions$WithRandomizedRunner): null
08-May-2018 12:07:07 Finished: testMethod
08-May-2018 12:07:07 Run finished: run=1, ignored=0, failures=1, assumptions=0
08-May-2018 12:07:07
08-May-2018 12:07:07 Run started.
08-May-2018 12:07:07 Started : testMethod
08-May-2018 12:07:07 Finished: testMethod
08-May-2018 12:07:07 Run finished: run=1, ignored=0, failures=0, assumptions=0
08-May-2018 12:07:07
08-May-2018 12:07:07 Run started.
08-May-2018 12:07:07 Started : testMethod
08-May-2018 12:07:07 Finished: testMethod
08-May-2018 12:07:07 Run finished: run=1, ignored=0, failures=0, assumptions=0
08-May-2018 12:07:07
08-May-2018 12:07:07 Run started.
08-May-2018 12:07:07 Started : testMethod
08-May-2018 12:07:07 Failure : testMethod(com.carrotsearch.randomizedtesting.TestHookMethodOrderWithExceptions$WithRegularRunner): null
08-May-2018 12:07:07 Finished: testMethod
08-May-2018 12:07:07 Failure : com.carrotsearch.randomizedtesting.TestHookMethodOrderWithExceptions$WithRegularRunner: null
08-May-2018 12:07:07 Run finished: run=1, ignored=0, failures=2, assumptions=0
08-May-2018 12:07:07
08-May-2018 12:07:07 Run started.
08-May-2018 12:07:07 Started : testMethod
08-May-2018 12:07:07 Failure : testMethod(com.carrotsearch.randomizedtesting.TestHookMethodOrderWithExceptions$WithRandomizedRunner): null
08-May-2018 12:07:07 Finished: testMethod
08-May-2018 12:07:07 Failure : com.carrotsearch.randomizedtesting.TestHookMethodOrderWithExceptions$WithRandomizedRunner: null
08-May-2018 12:07:07 Run finished: run=1, ignored=0, failures=2, assumptions=0
08-May-2018 12:07:07
08-May-2018 12:07:07 Tests run: 20, Failures: 0, Errors: 0, Skipped: 0, Time elapsed: 0.088 sec - in com.carrotsearch.randomizedtesting.TestHookMethodOrderWithExceptions
08-May-2018 12:07:07 Running com.carrotsearch.randomizedtesting.TestChildTestGroupThreads
08-May-2018 12:07:07 Tests run: 1, Failures: 0, Errors: 0, Skipped: 0, Time elapsed: 0.002 sec - in com.carrotsearch.randomizedtesting.TestChildTestGroupThreads
08-May-2018 12:07:07 Running com.carrotsearch.randomizedtesting.TestBiasedNumbers
08-May-2018 12:07:07       6003        505        508        536        545       8412        564        519        552        575       5987
08-May-2018 12:07:07        508         38         54         40         43        759         46         46         42         50        550
08-May-2018 12:07:07        543         51         48         40         55        746         56         57         41         47        526
08-May-2018 12:07:07        548         46         39         46         40        739         37         46         48         44        522
08-May-2018 12:07:07        600         39         51         38         41        770         59         39         53         59        571
08-May-2018 12:07:07       8072        719        700        722        750      11259        696        718        712        701       8247
08-May-2018 12:07:07        521         47         41         57         58        710         46         39         38         50        518
08-May-2018 12:07:07        564         45         42         49         44        724         46         55         49         46        534
08-May-2018 12:07:07        508         46         32         51         53        715         47         48         39         45        525
08-May-2018 12:07:07        545         38         39         48         51        716         36         45         45         46        509
08-May-2018 12:07:07       6041        577        558        527        592       8285        527        517        512        527       5924
08-May-2018 12:07:07 Tests run: 201, Failures: 0, Errors: 0, Skipped: 0, Time elapsed: 0.257 sec - in com.carrotsearch.randomizedtesting.TestBiasedNumbers
08-May-2018 12:07:07 Running com.carrotsearch.randomizedtesting.TestMacSysThreads
08-May-2018 12:07:07 Run started.
08-May-2018 12:07:07 Started : testMethod1
08-May-2018 12:07:10 Finished: testMethod1
08-May-2018 12:07:10 Run finished: run=1, ignored=0, failures=0, assumptions=0
08-May-2018 12:07:10
08-May-2018 12:07:10 Tests run: 1, Failures: 0, Errors: 0, Skipped: 0, Time elapsed: 2.53 sec - in com.carrotsearch.randomizedtesting.TestMacSysThreads
08-May-2018 12:07:10 Running com.carrotsearch.randomizedtesting.TestRules
08-May-2018 12:07:10 Run started.
08-May-2018 12:07:10 Started : passing
08-May-2018 12:07:10 Finished: passing
08-May-2018 12:07:10 Run finished: run=1, ignored=0, failures=0, assumptions=0
08-May-2018 12:07:10
08-May-2018 12:07:10 Run started.
08-May-2018 12:07:10 Started : passing
08-May-2018 12:07:10 Finished: passing
08-May-2018 12:07:10 Run finished: run=1, ignored=0, failures=0, assumptions=0
08-May-2018 12:07:10
08-May-2018 12:07:10 Run started.
08-May-2018 12:07:10 Started : failing
08-May-2018 12:07:10 Failure : failing(com.carrotsearch.randomizedtesting.TestRules$NewRuleSupportFailing): null
08-May-2018 12:07:10 Finished: failing
08-May-2018 12:07:10 Run finished: run=1, ignored=0, failures=1, assumptions=0
08-May-2018 12:07:10
08-May-2018 12:07:10 Run started.
08-May-2018 12:07:10 Ignored : ignored
08-May-2018 12:07:10 Run finished: run=0, ignored=1, failures=0, assumptions=0
08-May-2018 12:07:10
08-May-2018 12:07:10 Tests run: 2, Failures: 0, Errors: 0, Skipped: 0, Time elapsed: 0.039 sec - in com.carrotsearch.randomizedtesting.TestRules
08-May-2018 12:07:10 Running com.carrotsearch.randomizedtesting.TestJUnit3MethodProvider
08-May-2018 12:07:10 Tests run: 3, Failures: 0, Errors: 0, Skipped: 0, Time elapsed: 0.034 sec - in com.carrotsearch.randomizedtesting.TestJUnit3MethodProvider
08-May-2018 12:07:10
08-May-2018 12:07:10 Results :
08-May-2018 12:07:10
08-May-2018 12:07:10 Tests in error:
08-May-2018 12:07:10   TestRandomizedTest.testRandomTimeZone:151 » NullPointer
08-May-2018 12:07:10
08-May-2018 12:07:10 Tests run: 2257, Failures: 0, Errors: 1, Skipped: 6
08-May-2018 12:07:10
08-May-2018 12:07:10 [INFO] ------------------------------------------------------------------------
08-May-2018 12:07:10 [INFO] Reactor Summary:
08-May-2018 12:07:10 [INFO]
08-May-2018 12:07:10 [INFO] RandomizedTesting Parent POM ....................... SUCCESS [  0.994 s]
08-May-2018 12:07:10 [INFO] RandomizedTesting Randomized Runner ................ FAILURE [ 35.205 s]
08-May-2018 12:07:10 [INFO] RandomizedTesting JUnit4 ANT Task .................. SKIPPED
08-May-2018 12:07:10 [INFO] RandomizedTesting JUnit4 Maven Plugin .............. SKIPPED
08-May-2018 12:07:10 [INFO] RandomizedTesting JUnit4 Maven Plugin Tests ........ SKIPPED
08-May-2018 12:07:10 [INFO] RandomizedTesting Examples ......................... SKIPPED
08-May-2018 12:07:10 [INFO] RandomizedTesting ANT Examples ..................... SKIPPED
08-May-2018 12:07:10 [INFO] RandomizedTesting Security Manager Example ......... SKIPPED
08-May-2018 12:07:10 [INFO] ------------------------------------------------------------------------
08-May-2018 12:07:10 [INFO] BUILD FAILURE
08-May-2018 12:07:10 [INFO] ------------------------------------------------------------------------
08-May-2018 12:07:10 [INFO] Total time: 36.406 s
08-May-2018 12:07:10 [INFO] Finished at: 2018-05-08T11:07:10+01:00
08-May-2018 12:07:10 [INFO] Final Memory: 21M/962M
08-May-2018 12:07:10 [INFO] ------------------------------------------------------------------------
08-May-2018 12:07:10 [ERROR] Failed to execute goal org.apache.maven.plugins:maven-surefire-plugin:2.19.1:test (default-test) on project randomizedtesting-runner: There are test failures.
08-May-2018 12:07:10 [ERROR]
08-May-2018 12:07:10 [ERROR] Please refer to /var/atlassian/application-data/bamboo/xml-data/build-dir/RNDTEST-SOFTWARE-JDK17/randomized-runner/target/surefire-reports for the individual test results.
08-May-2018 12:07:10 [ERROR] -> [Help 1]
08-May-2018 12:07:10 [ERROR]
08-May-2018 12:07:10 [ERROR] To see the full stack trace of the errors, re-run Maven with the -e switch.
08-May-2018 12:07:10 [ERROR] Re-run Maven using the -X switch to enable full debug logging.
08-May-2018 12:07:10 [ERROR]
08-May-2018 12:07:10 [ERROR] For more information about the errors and possible solutions, please read the following articles:
08-May-2018 12:07:10 [ERROR] [Help 1] http://cwiki.apache.org/confluence/display/MAVEN/MojoFailureException
08-May-2018 12:07:10 [ERROR]
08-May-2018 12:07:10 [ERROR] After correcting the problems, you can resume the build with the command
08-May-2018 12:07:10 [ERROR]   mvn <goals> -rf :randomizedtesting-runner
08-May-2018 12:07:10 Failing task since return code of [/home/bamboo/tools/apache-maven-3.5.2/bin/mvn --batch-mode -Djava.io.tmpdir=/opt/atlassian/bamboo/current/temp/RNDTEST-SOFTWARE-JDK17 -Dmaven.repo.local=/var/atlassian/application-data/bamboo/.m2/AGENT-131073/repository clean verify] was 1 while expected 0
08-May-2018 12:07:10 Parsing test results under /var/atlassian/application-data/bamboo/xml-data/build-dir/RNDTEST-SOFTWARE-JDK17...
08-May-2018 12:07:10 Finished task 'Maven 3.x' with result: Failed
08-May-2018 12:07:10 Running post build plugin 'NCover Results Collector'
08-May-2018 12:07:10 Running post build plugin 'Artifact Copier'
08-May-2018 12:07:10 Running post build plugin 'npm Cache Cleanup'
08-May-2018 12:07:10 Running post build plugin 'Clover Results Collector'
08-May-2018 12:07:10 Running post build plugin 'Docker Container Cleanup'
08-May-2018 12:07:10 Finalising the build...
08-May-2018 12:07:10 Stopping timer.
08-May-2018 12:07:10 Build RNDTEST-SOFTWARE-JDK17-187 completed.
08-May-2018 12:07:10 Running on server: post build plugin 'NCover Results Collector'
08-May-2018 12:07:10 Running on server: post build plugin 'Build Hanging Detection Configuration'
08-May-2018 12:07:10 Running on server: post build plugin 'Clover Delta Calculator'
08-May-2018 12:07:10 Running on server: post build plugin 'Maven Dependencies Postprocessor'
08-May-2018 12:07:10 All post build plugins have finished
08-May-2018 12:07:10 Generating build results summary...
08-May-2018 12:07:16 Saving build results to disk...
08-May-2018 12:07:16 Logging substituted variables...
08-May-2018 12:07:16 Indexing build results...
08-May-2018 12:07:16 Finished building RNDTEST-SOFTWARE-JDK17-187.