Build #228

Build: #228 failed

Job: JDK 11 failed

Stages & jobs

  1. Compile and test

  2. Package

Jvmverbose: Test case result

The below summarizes the result of the test "Jvmverbose" in build 228 of RandomizedTesting - Software - JDK 11. View test case history
Description
Jvmverbose
Test class
com.carrotsearch.ant.tasks.junit4.it.TestJvmLogging
Method
jvmverbose
Duration
< 1 sec
Status
Failed (New Failure)

Error Log

org.apache.tools.ant.BuildException: java.io.FileNotFoundException: C:\Users\bamboo\AppData\Local\Temp\RNDTEST-SOFTWARE-JDK11\surefire7650670692521780251\..%5C..%5C..%5C..%5C..%5C..%5C..%5Cbamboo%5Cxml-data%5Cbuild-dir%5CRNDTEST-SOFTWARE-JDK11%5Cjunit4-ant%5Ctarget%5Ctest-classes\junit4.xml (The system cannot find the path specified)
Caused by: java.io.FileNotFoundException: C:\Users\bamboo\AppData\Local\Temp\RNDTEST-SOFTWARE-JDK11\surefire7650670692521780251\..%5C..%5C..%5C..%5C..%5C..%5C..%5Cbamboo%5Cxml-data%5Cbuild-dir%5CRNDTEST-SOFTWARE-JDK11%5Cjunit4-ant%5Ctarget%5Ctest-classes\junit4.xml (The system cannot find the path specified)