Build #203

Build: #203 failed

Job: JDK 11 failed

Stages & jobs

  1. Compile and test

  2. Package

Job result summary

Completed
Duration
2 minutes
Agent
Linux Agent 4
Revision
5b4c3e283cb03a8112610698b4b39d40df02695b 5b4c3e283cb03a8112610698b4b39d40df02695b
Total tests
2662
Fixed in
#204 (Manual run by Dawid Weiss)

No failed tests found, a possible compilation error occurred.

Tests

  • 2,662 tests in total
  • 11 tests were quarantined / skipped
  • 2 minutes taken in total.

Error summary

The build generated some errors. See the full build log for more details.

   >         at org.junit.runners.ParentRunner.run(ParentRunner.java:300)
   >         at com.carrotsearch.ant.tasks.junit4.slave.SlaveMain.execute(SlaveMain.java:265)
   >         at com.carrotsearch.ant.tasks.junit4.slave.SlaveMain.main(SlaveMain.java:390)
   >         at com.carrotsearch.ant.tasks.junit4.slave.SlaveMainSafe.main(SlaveMainSafe.java:13)
Completed [1/1 (1!)] in 0.01s, 2 tests, 1 error, 1 skipped <<< FAILURES!

[junit4:junit4] Packet received, slave#0>SUITE_COMPLETED
Finding class com.carrotsearch.ant.tasks.junit4.JUnit4$4$1
Loaded from /home/bamboo/xml-data/build-dir/RNDTEST-SOFTWARE-JDK11/junit4-ant/target/junit4-ant-2.6.4-SNAPSHOT.jar com/carrotsearch/ant/tasks/junit4/JUnit4$4$1.class
Class com.carrotsearch.ant.tasks.junit4.JUnit4$4$1 loaded from ant loader (parentFirst)
[junit4:junit4] Packet received, slave#0>QUIT
[junit4:junit4] Forked JVM J0 finished with exit code: 0
Finding class com.carrotsearch.ant.tasks.junit4.dependencies.com.google.common.io.Files
Loaded from /home/bamboo/xml-data/build-dir/RNDTEST-SOFTWARE-JDK11/junit4-ant/target/junit4-ant-2.6.4-SNAPSHOT.jar com/carrotsearch/ant/tasks/junit4/dependencies/com/google/common/io/Files.class
Class com.carrotsearch.ant.tasks.junit4.dependencies.com.google.common.io.Files loaded from ant loader (parentFirst)
Finding class com.carrotsearch.ant.tasks.junit4.dependencies.com.google.common.io.ByteSink
Loaded from /home/bamboo/xml-data/build-dir/RNDTEST-SOFTWARE-JDK11/junit4-ant/target/junit4-ant-2.6.4-SNAPSHOT.jar com/carrotsearch/ant/tasks/junit4/dependencies/com/google/common/io/ByteSink.class
Class com.carrotsearch.ant.tasks.junit4.dependencies.com.google.common.io.ByteSink loaded from ant loader (parentFirst)
Finding class com.carrotsearch.ant.tasks.junit4.dependencies.com.google.common.io.Files$FileByteSink
Loaded from /home/bamboo/xml-data/build-dir/RNDTEST-SOFTWARE-JDK11/junit4-ant/target/junit4-ant-2.6.4-SNAPSHOT.jar com/carrotsearch/ant/tasks/junit4/dependencies/com/google/common/io/Files$FileByteSink.class
Class com.carrotsearch.ant.tasks.junit4.dependencies.com.google.common.io.Files$FileByteSink loaded from ant loader (parentFirst)
Finding class com.carrotsearch.ant.tasks.junit4.dependencies.com.google.common.io.ByteSource
Loaded from /home/bamboo/xml-data/build-dir/RNDTEST-SOFTWARE-JDK11/junit4-ant/target/junit4-ant-2.6.4-SNAPSHOT.jar com/carrotsearch/ant/tasks/junit4/dependencies/com/google/common/io/ByteSource.class
Class com.carrotsearch.ant.tasks.junit4.dependencies.com.google.common.io.ByteSource loaded from ant loader (parentFirst)
Finding class com.carrotsearch.ant.tasks.junit4.dependencies.com.google.common.io.Files$FileByteSource
Loaded from /home/bamboo/xml-data/build-dir/RNDTEST-SOFTWARE-JDK11/junit4-ant/target/junit4-ant-2.6.4-SNAPSHOT.jar com/carrotsearch/ant/tasks/junit4/dependencies/com/google/common/io/Files$FileByteSource.class
Class com.carrotsearch.ant.tasks.junit4.dependencies.com.google.common.io.Files$FileByteSource loaded from ant loader (parentFirst)
Finding class com.carrotsearch.ant.tasks.junit4.dependencies.com.google.common.collect.TreeTraverser
Loaded from /home/bamboo/xml-data/build-dir/RNDTEST-SOFTWARE-JDK11/junit4-ant/target/junit4-ant-2.6.4-SNAPSHOT.jar com/carrotsearch/ant/tasks/junit4/dependencies/com/google/common/collect/TreeTraverser.class
Class com.carrotsearch.ant.tasks.junit4.dependencies.com.google.common.collect.TreeTraverser loaded from ant loader (parentFirst)
Finding class com.carrotsearch.ant.tasks.junit4.dependencies.com.google.common.io.Files$2
Loaded from /home/bamboo/xml-data/build-dir/RNDTEST-SOFTWARE-JDK11/junit4-ant/target/junit4-ant-2.6.4-SNAPSHOT.jar com/carrotsearch/ant/tasks/junit4/dependencies/com/google/common/io/Files$2.class
Class com.carrotsearch.ant.tasks.junit4.dependencies.com.google.common.io.Files$2 loaded from ant loader (parentFirst)
Finding class com.carrotsearch.ant.tasks.junit4.dependencies.com.google.common.graph.SuccessorsFunction
Loaded from /home/bamboo/xml-data/build-dir/RNDTEST-SOFTWARE-JDK11/junit4-ant/target/junit4-ant-2.6.4-SNAPSHOT.jar com/carrotsearch/ant/tasks/junit4/dependencies/com/google/common/graph/SuccessorsFunction.class
Class com.carrotsearch.ant.tasks.junit4.dependencies.com.google.common.graph.SuccessorsFunction loaded from ant loader (parentFirst)
Finding class com.carrotsearch.ant.tasks.junit4.dependencies.com.google.common.io.Files$3
Loaded from /home/bamboo/xml-data/build-dir/RNDTEST-SOFTWARE-JDK11/junit4-ant/target/junit4-ant-2.6.4-SNAPSHOT.jar com/carrotsearch/ant/tasks/junit4/dependencies/com/google/common/io/Files$3.class
Class com.carrotsearch.ant.tasks.junit4.dependencies.com.google.common.io.Files$3 loaded from ant loader (parentFirst)
Finding class com.carrotsearch.ant.tasks.junit4.dependencies.com.google.common.io.CharSource
Loaded from /home/bamboo/xml-data/build-dir/RNDTEST-SOFTWARE-JDK11/junit4-ant/target/junit4-ant-2.6.4-SNAPSHOT.jar com/carrotsearch/ant/tasks/junit4/dependencies/com/google/common/io/CharSource.class
Class com.carrotsearch.ant.tasks.junit4.dependencies.com.google.common.io.CharSource loaded from ant loader (parentFirst)
Finding class com.carrotsearch.ant.tasks.junit4.dependencies.com.google.common.io.ByteSource$AsCharSource
Loaded from /home/bamboo/xml-data/build-dir/RNDTEST-SOFTWARE-JDK11/junit4-ant/target/junit4-ant-2.6.4-SNAPSHOT.jar com/carrotsearch/ant/tasks/junit4/dependencies/com/google/common/io/ByteSource$AsCharSource.class
Class com.carrotsearch.ant.tasks.junit4.dependencies.com.google.common.io.ByteSource$AsCharSource loaded from ant loader (parentFirst)
Finding class com.carrotsearch.ant.tasks.junit4.dependencies.com.google.common.io.FileWriteMode
Loaded from /home/bamboo/xml-data/build-dir/RNDTEST-SOFTWARE-JDK11/junit4-ant/target/junit4-ant-2.6.4-SNAPSHOT.jar com/carrotsearch/ant/tasks/junit4/dependencies/com/google/common/io/FileWriteMode.class
Class com.carrotsearch.ant.tasks.junit4.dependencies.com.google.common.io.FileWriteMode loaded from ant loader (parentFirst)
Finding class com.carrotsearch.ant.tasks.junit4.dependencies.com.google.common.io.CharSink
Loaded from /home/bamboo/xml-data/build-dir/RNDTEST-SOFTWARE-JDK11/junit4-ant/target/junit4-ant-2.6.4-SNAPSHOT.jar com/carrotsearch/ant/tasks/junit4/dependencies/com/google/common/io/CharSink.class
Class com.carrotsearch.ant.tasks.junit4.dependencies.com.google.common.io.CharSink loaded from ant loader (parentFirst)
Finding class com.carrotsearch.ant.tasks.junit4.dependencies.com.google.common.io.ByteSink$AsCharSink
Loaded from /home/bamboo/xml-data/build-dir/RNDTEST-SOFTWARE-JDK11/junit4-ant/target/junit4-ant-2.6.4-SNAPSHOT.jar com/carrotsearch/ant/tasks/junit4/dependencies/com/google/common/io/ByteSink$AsCharSink.class
Class com.carrotsearch.ant.tasks.junit4.dependencies.com.google.common.io.ByteSink$AsCharSink loaded from ant loader (parentFirst)
Finding class com.carrotsearch.ant.tasks.junit4.dependencies.com.google.common.io.ByteStreams
Loaded from /home/bamboo/xml-data/build-dir/RNDTEST-SOFTWARE-JDK11/junit4-ant/target/junit4-ant-2.6.4-SNAPSHOT.jar com/carrotsearch/ant/tasks/junit4/dependencies/com/google/common/io/ByteStreams.class
Class com.carrotsearch.ant.tasks.junit4.dependencies.com.google.common.io.ByteStreams loaded from ant loader (parentFirst)
Class java.lang.OutOfMemoryError loaded from parent loader (parentFirst)
Finding class com.carrotsearch.ant.tasks.junit4.dependencies.com.google.common.io.ByteStreams$1
Loaded from /home/bamboo/xml-data/build-dir/RNDTEST-SOFTWARE-JDK11/junit4-ant/target/junit4-ant-2.6.4-SNAPSHOT.jar com/carrotsearch/ant/tasks/junit4/dependencies/com/google/common/io/ByteStreams$1.class
Class com.carrotsearch.ant.tasks.junit4.dependencies.com.google.common.io.ByteStreams$1 loaded from ant loader (parentFirst)

Tests with failures [seed: CF22A659DA080CA]:
  - com.carrotsearch.ant.tasks.junit4.tests.SysoutsOnSuiteFailure (suite)


Finding class com.carrotsearch.ant.tasks.junit4.dependencies.com.google.common.io.Closeables
Loaded from /home/bamboo/xml-data/build-dir/RNDTEST-SOFTWARE-JDK11/junit4-ant/target/junit4-ant-2.6.4-SNAPSHOT.jar com/carrotsearch/ant/tasks/junit4/dependencies/com/google/common/io/Closeables.class
Class com.carrotsearch.ant.tasks.junit4.dependencies.com.google.common.io.Closeables loaded from ant loader (parentFirst)
Class java.lang.Float loaded from parent loader (parentFirst)
[junit4:junit4] JVM J0:     0.26 ..     0.52 =     0.26s
Finding class com.carrotsearch.ant.tasks.junit4.Duration
Loaded from /home/bamboo/xml-data/build-dir/RNDTEST-SOFTWARE-JDK11/junit4-ant/target/junit4-ant-2.6.4-SNAPSHOT.jar com/carrotsearch/ant/tasks/junit4/Duration.class
Class com.carrotsearch.ant.tasks.junit4.Duration loaded from ant loader (parentFirst)
[junit4:junit4] Execution time total: 0.53 sec.
[junit4:junit4] Tests summary: 1 suite, 2 tests, 1 suite-level error, 1 ignored (1 assumption)

[junit4:junit4] ERROR: JVM J0 ended with an exception: Forked JVM's classpath must include a junit4 JAR.
[junit4:junit4]         at com.carrotsearch.ant.tasks.junit4.JUnit4.executeSlave(JUnit4.java:1511)
[junit4:junit4]         at com.carrotsearch.ant.tasks.junit4.JUnit4.access$000(JUnit4.java:128)
[junit4:junit4]         at com.carrotsearch.ant.tasks.junit4.JUnit4$2.call(JUnit4.java:996)
[junit4:junit4]         at com.carrotsearch.ant.tasks.junit4.JUnit4$2.call(JUnit4.java:993)
[junit4:junit4]         at java.base/java.util.concurrent.FutureTask.run(FutureTask.java:264)
[junit4:junit4]         at java.base/java.util.concurrent.ThreadPoolExecutor.runWorker(ThreadPoolExecutor.java:1128)
[junit4:junit4]         at java.base/java.util.concurrent.ThreadPoolExecutor$Worker.run(ThreadPoolExecutor.java:628)
[junit4:junit4]         at java.base/java.lang.Thread.run(Thread.java:834)
   [forked] Java Result: 1
   [forked] Java Result: 1
   [forked] Java Result: 1
    [junit] Test com.carrotsearch.ant.tasks.junit4.tests.bad.TestAbstract FAILED
    [junit] Test com.carrotsearch.ant.tasks.junit4.tests.bad.TestPackagePrivate FAILED
[junit4:junit4] ERROR: JVM J0 ended with an exception: Quit event not received from the forked process? This may indicate JVM crash or runner bugs.
[junit4:junit4]         at com.carrotsearch.ant.tasks.junit4.JUnit4.executeSlave(JUnit4.java:1562)
[junit4:junit4]         at com.carrotsearch.ant.tasks.junit4.JUnit4.access$000(JUnit4.java:128)
[junit4:junit4]         at com.carrotsearch.ant.tasks.junit4.JUnit4$2.call(JUnit4.java:996)
[junit4:junit4]         at com.carrotsearch.ant.tasks.junit4.JUnit4$2.call(JUnit4.java:993)
[junit4:junit4]         at java.base/java.util.concurrent.FutureTask.run(FutureTask.java:264)
[junit4:junit4]         at java.base/java.util.concurrent.ThreadPoolExecutor.runWorker(ThreadPoolExecutor.java:1128)
[junit4:junit4]         at java.base/java.util.concurrent.ThreadPoolExecutor$Worker.run(ThreadPoolExecutor.java:628)
[junit4:junit4]         at java.base/java.lang.Thread.run(Thread.java:834)