Build #98

Build: #98 failed

Job: JDK 11 J9 failed

Stages & jobs

  1. Compile and test

  2. Package

Job result summary

Completed
Duration
13 seconds
Revision
31cc2d277c5cdc01830e3027c768accda9cccf34 31cc2d277c5cdc01830e3027c768accda9cccf34
Total tests
152
Fixed in
#99 (Code changes detected)

Tests

  • 152 tests in total
  • 104 tests failed
  • 104 failures are new
  • 1 second taken in total.
New test failures 104
Status Test Duration
Collapse Failed TestClassMethodFiltering testClassFilter History
< 1 sec
java.lang.AssertionError: null
	at org.junit.Assert.fail(Assert.java:92)
	at org.junit.Assert.assertTrue(Assert.java:43)
	at org.junit.Assert.assertTrue(Assert.java:54)
	at com.carrotsearch.randomizedtesting.TestClassMethodFiltering.testClassFilter(TestClassMethodFiltering.java:64)
Collapse Failed TestClassMethodFiltering testClassMethodFilter History
< 1 sec
java.lang.AssertionError: expected:<[beforeClass1, method2]> but was:<[]>
	at org.junit.Assert.fail(Assert.java:93)
	at org.junit.Assert.failNotEquals(Assert.java:647)
	at org.junit.Assert.assertEquals(Assert.java:128)
	at org.junit.Assert.assertEquals(Assert.java:147)
	at com.carrotsearch.randomizedtesting.TestClassMethodFiltering.testClassMethodFilter(TestClassMethodFiltering.java:77)
Collapse Failed TestClassMethodFiltering testGlobClassName History
< 1 sec
java.lang.AssertionError: null
	at org.junit.Assert.fail(Assert.java:92)
	at org.junit.Assert.assertTrue(Assert.java:43)
	at org.junit.Assert.assertTrue(Assert.java:54)
	at com.carrotsearch.randomizedtesting.TestClassMethodFiltering.testGlobClassName(TestClassMethodFiltering.java:97)
Collapse Failed TestClassMethodFiltering testGlobMethodName History
< 1 sec
java.lang.AssertionError: expected:<[beforeClass1, method1, beforeClass2, method1]> but was:<[]>
	at org.junit.Assert.fail(Assert.java:93)
	at org.junit.Assert.failNotEquals(Assert.java:647)
	at org.junit.Assert.assertEquals(Assert.java:128)
	at org.junit.Assert.assertEquals(Assert.java:147)
	at com.carrotsearch.randomizedtesting.TestClassMethodFiltering.testGlobMethodName(TestClassMethodFiltering.java:109)
Collapse Failed TestClassMethodFiltering testMethodFilter History
< 1 sec
java.lang.AssertionError: expected:<[beforeClass1, method1, beforeClass2, method1]> but was:<[]>
	at org.junit.Assert.fail(Assert.java:93)
	at org.junit.Assert.failNotEquals(Assert.java:647)
	at org.junit.Assert.assertEquals(Assert.java:128)
	at org.junit.Assert.assertEquals(Assert.java:147)
	at com.carrotsearch.randomizedtesting.TestClassMethodFiltering.testMethodFilter(TestClassMethodFiltering.java:87)
Collapse Failed TestContextRandom testRandomSeed History
< 1 sec
java.lang.AssertionError: null
	at org.junit.Assert.fail(Assert.java:92)
	at org.junit.Assert.assertTrue(Assert.java:43)
	at org.junit.Assert.assertFalse(Assert.java:68)
	at org.junit.Assert.assertFalse(Assert.java:79)
	at com.carrotsearch.randomizedtesting.TestContextRandom.testRandomSeed(TestContextRandom.java:87)
Collapse Failed TestCustomMethodProvider testJUnit4Valid History
< 1 sec
java.lang.AssertionError: expected:<1> but was:<0>
	at org.junit.Assert.fail(Assert.java:93)
	at org.junit.Assert.failNotEquals(Assert.java:647)
	at org.junit.Assert.assertEquals(Assert.java:128)
	at org.junit.Assert.assertEquals(Assert.java:472)
	at org.junit.Assert.assertEquals(Assert.java:456)
	at com.carrotsearch.randomizedtesting.TestCustomMethodProvider.testJUnit4Valid(TestCustomMethodProvider.java:55)
Collapse Failed TestExpected testSameMethodRandomnessWithFixedRunner History
< 1 sec
junit.framework.AssertionFailedError: expected:<2> but was:<0>
	at junit.framework.Assert.fail(Assert.java:50)
	at junit.framework.Assert.failNotEquals(Assert.java:287)
	at junit.framework.Assert.assertEquals(Assert.java:67)
	at junit.framework.Assert.assertEquals(Assert.java:199)
	at junit.framework.Assert.assertEquals(Assert.java:205)
	at com.carrotsearch.randomizedtesting.TestExpected.testSameMethodRandomnessWithFixedRunner(TestExpected.java:39)
Collapse Failed TestExpected testSuccessfulExceptedFailure History
< 1 sec
junit.framework.AssertionFailedError: expected:<1> but was:<0>
	at junit.framework.Assert.fail(Assert.java:50)
	at junit.framework.Assert.failNotEquals(Assert.java:287)
	at junit.framework.Assert.assertEquals(Assert.java:67)
	at junit.framework.Assert.assertEquals(Assert.java:199)
	at junit.framework.Assert.assertEquals(Assert.java:205)
	at com.carrotsearch.randomizedtesting.TestExpected.testSuccessfulExceptedFailure(TestExpected.java:49)
Collapse Failed TestFailurePropagationCompatibility testRunEquals History
< 1 sec
java.lang.AssertionError: null
	at org.junit.Assert.fail(Assert.java:92)
	at org.junit.Assert.fail(Assert.java:100)
	at com.carrotsearch.randomizedtesting.TestFailurePropagationCompatibility.testRunEquals(TestFailurePropagationCompatibility.java:125)
Collapse Failed TestFilteringWarnings testItersWithFixedMethodName History
< 1 sec
java.lang.AssertionError: null
	at org.junit.Assert.fail(Assert.java:92)
	at org.junit.Assert.assertTrue(Assert.java:43)
	at org.junit.Assert.assertTrue(Assert.java:54)
	at com.carrotsearch.randomizedtesting.TestFilteringWarnings.testItersWithFixedMethodName(TestFilteringWarnings.java:106)
Collapse Failed TestFilteringWarnings testItersWithFixedSeed History
< 1 sec
java.lang.AssertionError: null
	at org.junit.Assert.fail(Assert.java:92)
	at org.junit.Assert.assertTrue(Assert.java:43)
	at org.junit.Assert.assertTrue(Assert.java:54)
	at com.carrotsearch.randomizedtesting.TestFilteringWarnings.testItersWithFixedSeed(TestFilteringWarnings.java:92)
Collapse Failed TestFilteringWarnings testItersWithRandomSeed History
< 1 sec
java.lang.AssertionError: null
	at org.junit.Assert.fail(Assert.java:92)
	at org.junit.Assert.assertTrue(Assert.java:43)
	at org.junit.Assert.assertTrue(Assert.java:54)
	at com.carrotsearch.randomizedtesting.TestFilteringWarnings.testItersWithRandomSeed(TestFilteringWarnings.java:77)
Collapse Failed TestIgnoredRunCount checkIgnoredCount History
< 1 sec
java.lang.AssertionError: expected:<1> but was:<0>
	at org.junit.Assert.fail(Assert.java:93)
	at org.junit.Assert.failNotEquals(Assert.java:647)
	at org.junit.Assert.assertEquals(Assert.java:128)
	at org.junit.Assert.assertEquals(Assert.java:472)
	at org.junit.Assert.assertEquals(Assert.java:456)
	at com.carrotsearch.randomizedtesting.TestIgnoredRunCount.assertSameExecution(TestIgnoredRunCount.java:27)
	at com.carrotsearch.randomizedtesting.TestIgnoredRunCount.checkIgnoredCount(TestIgnoredRunCount.java:18)
Collapse Failed TestJUnit3MethodProvider testJUnit3Overrides History
< 1 sec
java.lang.AssertionError: expected:<1> but was:<0>
	at org.junit.Assert.fail(Assert.java:93)
	at org.junit.Assert.failNotEquals(Assert.java:647)
	at org.junit.Assert.assertEquals(Assert.java:128)
	at org.junit.Assert.assertEquals(Assert.java:472)
	at org.junit.Assert.assertEquals(Assert.java:456)
	at com.carrotsearch.randomizedtesting.TestJUnit3MethodProvider.testJUnit3Overrides(TestJUnit3MethodProvider.java:69)
Collapse Failed TestJUnit3MethodProvider testJUnit3Valid History
< 1 sec
java.lang.AssertionError: expected:<1> but was:<0>
	at org.junit.Assert.fail(Assert.java:93)
	at org.junit.Assert.failNotEquals(Assert.java:647)
	at org.junit.Assert.assertEquals(Assert.java:128)
	at org.junit.Assert.assertEquals(Assert.java:472)
	at org.junit.Assert.assertEquals(Assert.java:456)
	at com.carrotsearch.randomizedtesting.TestJUnit3MethodProvider.testJUnit3Valid(TestJUnit3MethodProvider.java:39)
Collapse Failed TestNightlyMode dailyDefault History
< 1 sec
java.lang.AssertionError: expected:<2> but was:<0>
	at org.junit.Assert.fail(Assert.java:93)
	at org.junit.Assert.failNotEquals(Assert.java:647)
	at org.junit.Assert.assertEquals(Assert.java:128)
	at org.junit.Assert.assertEquals(Assert.java:472)
	at org.junit.Assert.assertEquals(Assert.java:456)
	at com.carrotsearch.randomizedtesting.TestNightlyMode.dailyDefault(TestNightlyMode.java:51)
Collapse Failed TestNightlyMode invalidValueNightly History
< 1 sec
java.lang.AssertionError: expected:<2> but was:<0>
	at org.junit.Assert.fail(Assert.java:93)
	at org.junit.Assert.failNotEquals(Assert.java:647)
	at org.junit.Assert.assertEquals(Assert.java:128)
	at org.junit.Assert.assertEquals(Assert.java:472)
	at org.junit.Assert.assertEquals(Assert.java:456)
	at com.carrotsearch.randomizedtesting.TestNightlyMode.invalidValueNightly(TestNightlyMode.java:35)
Collapse Failed TestNightlyMode nightly History
< 1 sec
java.lang.AssertionError: expected:<2> but was:<0>
	at org.junit.Assert.fail(Assert.java:93)
	at org.junit.Assert.failNotEquals(Assert.java:647)
	at org.junit.Assert.assertEquals(Assert.java:128)
	at org.junit.Assert.assertEquals(Assert.java:472)
	at org.junit.Assert.assertEquals(Assert.java:456)
	at com.carrotsearch.randomizedtesting.TestNightlyMode.nightly(TestNightlyMode.java:44)
Collapse Failed TestOutOfScopeRandomUse testCrossTestSuiteIsolation History
< 1 sec
java.lang.NullPointerException: null
	at com.carrotsearch.randomizedtesting.TestOutOfScopeRandomUse.testCrossTestSuiteIsolation(TestOutOfScopeRandomUse.java:123)
Collapse Failed TestOverridingDefaultExceptionHandler testHandlerPropagation History
< 1 sec
java.lang.AssertionError: 
Expecting:
 <[]>
to contain:
 <["exceptionFromChildThread"]>
but could not find:
 <["exceptionFromChildThread"]>

(1 more lines...)
Collapse Failed TestResourceDisposal testFailedDisposalBreaksTestCase History
< 1 sec
junit.framework.AssertionFailedError: expected:<1> but was:<0>
	at junit.framework.Assert.fail(Assert.java:50)
	at junit.framework.Assert.failNotEquals(Assert.java:287)
	at junit.framework.Assert.assertEquals(Assert.java:67)
	at junit.framework.Assert.assertEquals(Assert.java:199)
	at junit.framework.Assert.assertEquals(Assert.java:205)
	at com.carrotsearch.randomizedtesting.TestResourceDisposal.testFailedDisposalBreaksTestCase(TestResourceDisposal.java:107)
Collapse Failed TestResourceDisposal testResourceDisposalSuiteScope History
< 1 sec
junit.framework.AssertionFailedError: null
	at junit.framework.Assert.fail(Assert.java:48)
	at junit.framework.Assert.assertTrue(Assert.java:20)
	at junit.framework.Assert.assertTrue(Assert.java:27)
	at com.carrotsearch.randomizedtesting.TestResourceDisposal.testResourceDisposalSuiteScope(TestResourceDisposal.java:93)
Collapse Failed TestResourceDisposal testResourceDisposalTestScope History
< 1 sec
junit.framework.AssertionFailedError: expected:<1> but was:<0>
	at junit.framework.Assert.fail(Assert.java:50)
	at junit.framework.Assert.failNotEquals(Assert.java:287)
	at junit.framework.Assert.assertEquals(Assert.java:67)
	at junit.framework.Assert.assertEquals(Assert.java:199)
	at junit.framework.Assert.assertEquals(Assert.java:205)
	at com.carrotsearch.randomizedtesting.TestResourceDisposal.testResourceDisposalTestScope(TestResourceDisposal.java:83)
Collapse Failed TestRules checkNewTestRules History
< 1 sec
java.lang.AssertionError: expected:<[outer-before, inner-before, passing, inner-after, outer-after]> but was:<[]>
	at org.junit.Assert.fail(Assert.java:93)
	at org.junit.Assert.failNotEquals(Assert.java:647)
	at org.junit.Assert.assertEquals(Assert.java:128)
	at org.junit.Assert.assertEquals(Assert.java:147)
	at com.carrotsearch.randomizedtesting.TestRules.assertSameExecution(TestRules.java:131)
	at com.carrotsearch.randomizedtesting.TestRules.checkNewTestRules(TestRules.java:116)
Collapse Failed TestRules checkOldMethodRules History
< 1 sec
java.lang.AssertionError: expected:<[rule1-before, passing, rule1-after]> but was:<[]>
	at org.junit.Assert.fail(Assert.java:93)
	at org.junit.Assert.failNotEquals(Assert.java:647)
	at org.junit.Assert.assertEquals(Assert.java:128)
	at org.junit.Assert.assertEquals(Assert.java:147)
	at com.carrotsearch.randomizedtesting.TestRules.assertSameExecution(TestRules.java:131)
	at com.carrotsearch.randomizedtesting.TestRules.checkOldMethodRules(TestRules.java:111)
Collapse Failed TestSeedDecorator testDecoratedMaster History
< 1 sec
java.lang.AssertionError: expected:<4> but was:<0>
	at org.junit.Assert.fail(Assert.java:93)
	at org.junit.Assert.failNotEquals(Assert.java:647)
	at org.junit.Assert.assertEquals(Assert.java:128)
	at org.junit.Assert.assertEquals(Assert.java:472)
	at org.junit.Assert.assertEquals(Assert.java:456)
	at com.carrotsearch.randomizedtesting.TestSeedDecorator.testDecoratedMaster(TestSeedDecorator.java:63)
Collapse Failed TestSeedFixingWithProperties testFixedRunnerPropertyOnly History
< 1 sec
java.lang.AssertionError: expected:<3> but was:<0>
	at org.junit.Assert.fail(Assert.java:93)
	at org.junit.Assert.failNotEquals(Assert.java:647)
	at org.junit.Assert.assertEquals(Assert.java:128)
	at org.junit.Assert.assertEquals(Assert.java:472)
	at org.junit.Assert.assertEquals(Assert.java:456)
	at com.carrotsearch.randomizedtesting.TestSeedFixingWithProperties.testFixedRunnerPropertyOnly(TestSeedFixingWithProperties.java:60)
Collapse Failed TestSeedFixingWithProperties testRunnerAndMethodProperty History
< 1 sec
java.lang.AssertionError: expected:<[3735928559, 3405691582, 3405691582, 3405691582]> but was:<[]>
	at org.junit.Assert.fail(Assert.java:93)
	at org.junit.Assert.failNotEquals(Assert.java:647)
	at org.junit.Assert.assertEquals(Assert.java:128)
	at org.junit.Assert.assertEquals(Assert.java:147)
	at com.carrotsearch.randomizedtesting.TestSeedFixingWithProperties.testRunnerAndMethodProperty(TestSeedFixingWithProperties.java:48)
Collapse Failed TestSeedParameterOptional checkNames History
< 1 sec
junit.framework.AssertionFailedError: null
	at junit.framework.Assert.fail(Assert.java:48)
	at junit.framework.Assert.assertTrue(Assert.java:20)
	at junit.framework.Assert.assertTrue(Assert.java:27)
	at com.carrotsearch.randomizedtesting.TestSeedParameterOptional.checkNames(TestSeedParameterOptional.java:52)
Collapse Failed TestStackAugmentation testAfterClass History
< 1 sec
java.lang.AssertionError: expected:<1> but was:<0>
	at org.junit.Assert.fail(Assert.java:93)
	at org.junit.Assert.failNotEquals(Assert.java:647)
	at org.junit.Assert.assertEquals(Assert.java:128)
	at org.junit.Assert.assertEquals(Assert.java:472)
	at org.junit.Assert.assertEquals(Assert.java:456)
	at com.carrotsearch.randomizedtesting.TestStackAugmentation.testAfterClass(TestStackAugmentation.java:87)
Collapse Failed TestStackAugmentation testBeforeClass History
< 1 sec
java.lang.AssertionError: expected:<1> but was:<0>
	at org.junit.Assert.fail(Assert.java:93)
	at org.junit.Assert.failNotEquals(Assert.java:647)
	at org.junit.Assert.assertEquals(Assert.java:128)
	at org.junit.Assert.assertEquals(Assert.java:472)
	at org.junit.Assert.assertEquals(Assert.java:456)
	at com.carrotsearch.randomizedtesting.TestStackAugmentation.testBeforeClass(TestStackAugmentation.java:62)
Collapse Failed TestStackAugmentation testMethodLevel History
< 1 sec
java.lang.AssertionError: expected:<1> but was:<0>
	at org.junit.Assert.fail(Assert.java:93)
	at org.junit.Assert.failNotEquals(Assert.java:647)
	at org.junit.Assert.assertEquals(Assert.java:128)
	at org.junit.Assert.assertEquals(Assert.java:472)
	at org.junit.Assert.assertEquals(Assert.java:456)
	at com.carrotsearch.randomizedtesting.TestStackAugmentation.testMethodLevel(TestStackAugmentation.java:37)
Collapse Failed TestTestFiltering filterVsRulePriority History
< 1 sec
org.junit.ComparisonFailure: [run count] expected:<[1]> but was:<[0]>
	at sun.reflect.NativeConstructorAccessorImpl.newInstance0(Native Method)
	at sun.reflect.NativeConstructorAccessorImpl.newInstance(NativeConstructorAccessorImpl.java:88)
	at sun.reflect.DelegatingConstructorAccessorImpl.newInstance(DelegatingConstructorAccessorImpl.java:57)
	at com.carrotsearch.randomizedtesting.TestTestFiltering.checkResult(TestTestFiltering.java:58)
	at com.carrotsearch.randomizedtesting.TestTestFiltering.filterVsRulePriority(TestTestFiltering.java:46)
Collapse Failed TestTestGroups groupsOnASubsetOfMethods History
< 1 sec
org.junit.ComparisonFailure: [run count] expected:<[2]> but was:<[0]>
	at sun.reflect.NativeConstructorAccessorImpl.newInstance0(Native Method)
	at sun.reflect.NativeConstructorAccessorImpl.newInstance(NativeConstructorAccessorImpl.java:88)
	at sun.reflect.DelegatingConstructorAccessorImpl.newInstance(DelegatingConstructorAccessorImpl.java:57)
	at com.carrotsearch.randomizedtesting.TestTestGroups.checkResult(TestTestGroups.java:192)
	at com.carrotsearch.randomizedtesting.TestTestGroups.groupsOnASubsetOfMethods(TestTestGroups.java:131)
Collapse Failed TestTestGroups groupsOnClass History
< 1 sec
org.junit.ComparisonFailure: [run count] expected:<[1]> but was:<[0]>
	at sun.reflect.NativeConstructorAccessorImpl.newInstance0(Native Method)
	at sun.reflect.NativeConstructorAccessorImpl.newInstance(NativeConstructorAccessorImpl.java:88)
	at sun.reflect.DelegatingConstructorAccessorImpl.newInstance(DelegatingConstructorAccessorImpl.java:57)
	at com.carrotsearch.randomizedtesting.TestTestGroups.checkResult(TestTestGroups.java:192)
	at com.carrotsearch.randomizedtesting.TestTestGroups.groupsOnClass(TestTestGroups.java:164)
Collapse Failed TestTestGroups groupsOnMethods History
< 1 sec
org.junit.ComparisonFailure: [run count] expected:<[1]> but was:<[0]>
	at sun.reflect.NativeConstructorAccessorImpl.newInstance0(Native Method)
	at sun.reflect.NativeConstructorAccessorImpl.newInstance(NativeConstructorAccessorImpl.java:88)
	at sun.reflect.DelegatingConstructorAccessorImpl.newInstance(DelegatingConstructorAccessorImpl.java:57)
	at com.carrotsearch.randomizedtesting.TestTestGroups.checkResult(TestTestGroups.java:192)
	at com.carrotsearch.randomizedtesting.TestTestGroups.groupsOnMethods(TestTestGroups.java:98)
Collapse Failed TestUncaughtExceptionsDuplicated testExceptionInBeforeClassFailsTheTest History
< 1 sec
junit.framework.AssertionFailedError: expected:<1> but was:<0>
	at junit.framework.Assert.fail(Assert.java:50)
	at junit.framework.Assert.failNotEquals(Assert.java:287)
	at junit.framework.Assert.assertEquals(Assert.java:67)
	at junit.framework.Assert.assertEquals(Assert.java:199)
	at junit.framework.Assert.assertEquals(Assert.java:205)
	at com.carrotsearch.randomizedtesting.TestUncaughtExceptionsDuplicated.testExceptionInBeforeClassFailsTheTest(TestUncaughtExceptionsDuplicated.java:93)
Collapse Failed TestUncaughtExceptionsDuplicated testExceptionWithinBeforeFailsTheTest History
< 1 sec
junit.framework.AssertionFailedError: expected:<1> but was:<0>
	at junit.framework.Assert.fail(Assert.java:50)
	at junit.framework.Assert.failNotEquals(Assert.java:287)
	at junit.framework.Assert.assertEquals(Assert.java:67)
	at junit.framework.Assert.assertEquals(Assert.java:199)
	at junit.framework.Assert.assertEquals(Assert.java:205)
	at com.carrotsearch.randomizedtesting.TestUncaughtExceptionsDuplicated.testExceptionWithinBeforeFailsTheTest(TestUncaughtExceptionsDuplicated.java:120)
Collapse Failed TestUncaughtExceptionsDuplicated testExceptionWithinTestFailsTheTest History
< 1 sec
junit.framework.AssertionFailedError: expected:<3> but was:<0>
	at junit.framework.Assert.fail(Assert.java:50)
	at junit.framework.Assert.failNotEquals(Assert.java:287)
	at junit.framework.Assert.assertEquals(Assert.java:67)
	at junit.framework.Assert.assertEquals(Assert.java:199)
	at junit.framework.Assert.assertEquals(Assert.java:205)
	at com.carrotsearch.randomizedtesting.TestUncaughtExceptionsDuplicated.testExceptionWithinTestFailsTheTest(TestUncaughtExceptionsDuplicated.java:101)
Collapse Failed TestAnnotationInheritance checkOldMethodRules History
< 1 sec
org.junit.ComparisonFailure: [# JUnit order:
[before-class, rule-before, inherited before-test, inherited testMethod, inherited after-test, rule-after, after-class]
# RR order:
[]] expected:<[["before-class",
    "rule-before",
    "inherited before-test",
    "inherited testMethod",
    "inherited after-test",
(3 more lines...)
Collapse Failed TestAssumptionsAtClassLevel checkOrder History
< 1 sec
java.lang.AssertionError: expected:<1> but was:<0>
	at org.junit.Assert.fail(Assert.java:93)
	at org.junit.Assert.failNotEquals(Assert.java:647)
	at org.junit.Assert.assertEquals(Assert.java:128)
	at org.junit.Assert.assertEquals(Assert.java:472)
	at org.junit.Assert.assertEquals(Assert.java:456)
	at com.carrotsearch.randomizedtesting.contracts.TestAssumptionsAtClassLevel.checkOrder(TestAssumptionsAtClassLevel.java:84)
Collapse Failed TestBeforeAfterMethodOrder checkOrder History
< 1 sec
java.lang.AssertionError: JUnit4 and RandomizedRunner differed.
	at org.junit.Assert.fail(Assert.java:93)
	at com.carrotsearch.randomizedtesting.contracts.TestBeforeAfterMethodOrder.checkOrder(TestBeforeAfterMethodOrder.java:224)
Collapse Failed TestClassRules checkOldMethodRules History
< 1 sec
java.lang.AssertionError: expected:<[rule-before, before-class, passing, after-class, rule-after]> but was:<[]>
	at org.junit.Assert.fail(Assert.java:93)
	at org.junit.Assert.failNotEquals(Assert.java:647)
	at org.junit.Assert.assertEquals(Assert.java:128)
	at org.junit.Assert.assertEquals(Assert.java:147)
	at com.carrotsearch.randomizedtesting.contracts.TestClassRules.assertSameExecution(TestClassRules.java:73)
	at com.carrotsearch.randomizedtesting.contracts.TestClassRules.checkOldMethodRules(TestClassRules.java:60)
Collapse Failed TestNoClassHooksShadowingRule testShadowingNoAnnotation History
< 1 sec
java.lang.AssertionError: 
Expecting actual not to be empty
	at com.carrotsearch.randomizedtesting.rules.TestNoClassHooksShadowingRule.testShadowingNoAnnotation(TestNoClassHooksShadowingRule.java:63)
Collapse Failed TestNoClassHooksShadowingRule testShadowingWithAnnotation History
< 1 sec
java.lang.AssertionError: 
Expecting actual not to be empty
	at com.carrotsearch.randomizedtesting.rules.TestNoClassHooksShadowingRule.testShadowingWithAnnotation(TestNoClassHooksShadowingRule.java:71)
Collapse Failed TestNoInstanceHooksOverridesRule testOverrideNoAnnotation History
< 1 sec
java.lang.AssertionError: 
Expecting actual not to be empty
	at com.carrotsearch.randomizedtesting.rules.TestNoInstanceHooksOverridesRule.testOverrideNoAnnotation(TestNoInstanceHooksOverridesRule.java:79)
Collapse Failed TestNoInstanceHooksOverridesRule testOverrideWithAnnotation History
< 1 sec
java.lang.AssertionError: 
Expecting actual not to be empty
	at com.carrotsearch.randomizedtesting.rules.TestNoInstanceHooksOverridesRule.testOverrideWithAnnotation(TestNoInstanceHooksOverridesRule.java:87)
Collapse Failed TestStaticFieldsInvariantRule testFailingAboveThreshold History
< 1 sec
java.lang.AssertionError: 
Expected size:<1> but was:<0> in:
<[]>
	at com.carrotsearch.randomizedtesting.rules.TestStaticFieldsInvariantRule.testFailingAboveThreshold(TestStaticFieldsInvariantRule.java:100)
Collapse Failed Test001TimeoutSuite testAfter History
< 1 sec
java.lang.AssertionError: No failure with message: 'Suite timeout exceeded' (0 failures):
	at org.junit.Assert.fail(Assert.java:93)
	at com.carrotsearch.randomizedtesting.Utils.assertFailureWithMessage(Utils.java:28)
	at com.carrotsearch.randomizedtesting.timeouts.Test001TimeoutSuite.check(Test001TimeoutSuite.java:44)
	at com.carrotsearch.randomizedtesting.timeouts.Test001TimeoutSuite.testAfter(Test001TimeoutSuite.java:28)