Build #84

Build: #84 failed

Job: JDK 11 J9 failed

Stages & jobs

  1. Compile and test

  2. Package

Build log

The build generated 588 lines of output. Download or view full build log

27-Oct-2015 13:43:45 Build RandomizedTesting - Software - JDK 1.8 IBM #84 (RNDTEST-SOFTWARE-IBM17-84) started building on agent Local Agent 3
27-Oct-2015 13:43:45
27-Oct-2015 13:43:45 Build working directory is /mnt/work/bamboo-home/xml-data/build-dir/RNDTEST-SOFTWARE-IBM17
27-Oct-2015 13:43:45 Executing build RandomizedTesting - Software - JDK 1.8 IBM #84 (RNDTEST-SOFTWARE-IBM17-84)
27-Oct-2015 13:43:45 Starting task 'Checkout Default Repository' of type 'com.atlassian.bamboo.plugins.vcs:task.vcs.checkout'
27-Oct-2015 13:43:45 Updating source code to revision: 11d0b31d2a5e3350b8fd008884e916163c77f1a9
27-Oct-2015 13:43:49 Fetching 'refs/heads/master' from 'https://github.com/carrotsearch/randomizedtesting.git'.
27-Oct-2015 13:43:50 Checking out revision 11d0b31d2a5e3350b8fd008884e916163c77f1a9.
27-Oct-2015 13:43:51 error: refs/remotes/origin/build-tweaks does not point to a valid object!
27-Oct-2015 13:43:51 Warning: you are leaving 126 commits behind, not connected to
27-Oct-2015 13:43:51 any of your branches:
27-Oct-2015 13:43:51
27-Oct-2015 13:43:51   781e024 PR #178: update Eclipse profile.
27-Oct-2015 13:43:51   5979003 Moved to wiki.
27-Oct-2015 13:43:51   24b8ba5 GH-209: Remove dependency on commons-io.
27-Oct-2015 13:43:51   00a58ce Removed leftover nocommit.
27-Oct-2015 13:43:51 ... and 122 more.
27-Oct-2015 13:43:51
27-Oct-2015 13:43:51 If you want to keep them by creating a new branch, this may be a good time
27-Oct-2015 13:43:51 to do so with:
27-Oct-2015 13:43:51
27-Oct-2015 13:43:51 git branch new_branch_name 781e024f651d6c1aa729272421be5c7e37d7fdac
27-Oct-2015 13:43:51
27-Oct-2015 13:43:51 HEAD is now at 11d0b31... GH-210: Make RR compilable under 1.9 by providing manual rt.jar location for obfuscation.
27-Oct-2015 13:43:51 Updated source code to revision: 11d0b31d2a5e3350b8fd008884e916163c77f1a9
27-Oct-2015 13:43:51 Finished task 'Checkout Default Repository' with result: Success
27-Oct-2015 13:43:51 Running pre-build action: VCS Version Collector
27-Oct-2015 13:43:51 Starting task 'Maven 3.x' of type 'com.atlassian.bamboo.plugins.maven:task.builder.mvn3'
27-Oct-2015 13:43:51
Beginning to execute external process for build 'RandomizedTesting - Software - JDK 1.8 IBM #84 (RNDTEST-SOFTWARE-IBM17-84)'
... running command line:
/home/bamboo/tools/apache-maven-3.2.5/bin/mvn --batch-mode -Djava.io.tmpdir=/home/bamboo/bamboo-software/temp/RNDTEST-SOFTWARE-IBM17 -Dmaven.repo.local=/mnt/work/bamboo-home/.m2/AGENT-1146882/repository clean verify
... in: /mnt/work/bamboo-home/xml-data/build-dir/RNDTEST-SOFTWARE-IBM17
... using extra environment variables:
bamboo_repository_2555915_git_repositoryUrl=https://github.com/carrotsearch/randomizedtesting.git
bamboo_repository_2555915_name=GitHub
bamboo_capability_system_jdk_JDK_1_8=/usr/lib/jvm/jdk8
bamboo_capability_system_jdk_JDK_1_9=/usr/lib/jvm/jdk9
bamboo_capability_system_jdk_JDK_1_6=/usr/lib/jvm/jdk6
bamboo_capability_system_jdk_JDK_1_7=/usr/lib/jvm/jdk7
bamboo_carrot2_download_host=gamma.carrotsearch.com
bamboo_carrotsearch_download_official_path=~/sites/download.carrotsearch.com
JAVA_HOME=/usr/lib/jvm/jdk8-ibm
bamboo_carrotsearch_labs_ssh=carrotse@site5.carrot2.org:~/sites/labs.carrotsearch.com
bamboo_planRepository_type=gh
bamboo_capability_corpora_dir=/home/bamboo/corpora
bamboo_carrot2_download_path=/srv/vhosts/get.carrot2.org
bamboo_shortPlanName=Software
bamboo_carrotsearch_download_official_host=download.carrotsearch.com
bamboo_planKey=RNDTEST-SOFTWARE
bamboo_repository_2555915_git_branch=master
bamboo_repository_git_repositoryUrl=https://github.com/carrotsearch/randomizedtesting.git
bamboo_repository_2555915_previous_revision_number=781e024f651d6c1aa729272421be5c7e37d7fdac
bamboo_planRepository_1_branchName=master
bamboo_capability_system_builder_command_rsync=rsync
bamboo_carrotsearch_website_ssh=carrotse@site5.carrot2.org:~/sites/www.carrotsearch.com
bamboo_shortPlanKey=SOFTWARE
bamboo_shortJobKey=IBM17
bamboo_l4g_mvn_opts=-Xmx1g
bamboo_carrotsearch_download_official_user=carrotse
bamboo_build_working_directory=/mnt/work/bamboo-home/xml-data/build-dir/RNDTEST-SOFTWARE-IBM17
bamboo_capability_persistent_dir=/home/bamboo/persistent
bamboo_capability_system_builder_command_zip=zip
bamboo_planRepository_1_branch=master
bamboo_repository_revision_number=11d0b31d2a5e3350b8fd008884e916163c77f1a9
bamboo_carrotsearch_download_staging_path=/srv/vhosts/staging-get.carrotsearch.com
bamboo_capability_system_builder_mvn3_Maven_3=/home/bamboo/tools/apache-maven-3.2.5
bamboo_carrotsearch_secure_ssh=seccarro@site5.carrot2.org:~/www
bamboo_carrot2_website_ssh=carrot2o@site5.carrot2.org:~/sites/project.carrot2.org
M2_HOME=/home/bamboo/tools/apache-maven-3.2.5
bamboo_planName=RandomizedTesting - Software
bamboo_buildResultsUrl=http://builds.carrot2.org/browse/RNDTEST-SOFTWARE-IBM17-84
bamboo_buildResultKey=RNDTEST-SOFTWARE-IBM17-84
bamboo_carrotsearch_download_staging_host=gamma.carrotsearch.com
bamboo_planRepository_revision=11d0b31d2a5e3350b8fd008884e916163c77f1a9
bamboo_csssprites_download_path=/srv/vhosts/get.csssprites.org
bamboo_repository_git_username=stanislawosinski
bamboo_repository_previous_revision_number=781e024f651d6c1aa729272421be5c7e37d7fdac
bamboo_capability_system_git_executable=/usr/bin/git
bamboo_buildKey=RNDTEST-SOFTWARE-IBM17
bamboo_working_directory=/mnt/work/bamboo-home/xml-data/build-dir/RNDTEST-SOFTWARE-IBM17
bamboo_capability_system_builder_command_git=git
bamboo_repository_2555915_branch_name=master
bamboo_agentWorkingDirectory=/mnt/work/bamboo-home/xml-data/build-dir
bamboo_buildPlanName=RandomizedTesting - Software - JDK 1.8 IBM
bamboo_repository_name=GitHub
useMavenReturnCode=false
bamboo_resultsUrl=http://builds.carrot2.org/browse/RNDTEST-SOFTWARE-IBM17-84
bamboo_capability_Linux=
bamboo_capability_tools_dir=/home/bamboo/tools
bamboo_repository_git_branch=master
bamboo_planRepository_1_revision=11d0b31d2a5e3350b8fd008884e916163c77f1a9
bamboo_planRepository_1_type=gh
bamboo_planRepository_1_previousRevision=781e024f651d6c1aa729272421be5c7e37d7fdac
bamboo_capability_system_jdk_JDK_1_8_IBM=/usr/lib/jvm/jdk8-ibm
MAVEN2_HOME=/home/bamboo/tools/apache-maven-3.2.5
bamboo_planRepository_1_name=GitHub
bamboo_planRepository_branch=master
bamboo_planRepository_username=stanislawosinski
bamboo_planRepository_branchName=master
bamboo_csssprites_download_host=gamma.carrotsearch.com
bamboo_repository_2555915_git_username=stanislawosinski
bamboo_shortJobName=JDK 1.8 IBM
bamboo_repository_branch_name=master
bamboo_agentId=1146882
bamboo_planRepository_previousRevision=781e024f651d6c1aa729272421be5c7e37d7fdac
bamboo_planRepository_repositoryUrl=https://github.com/carrotsearch/randomizedtesting.git
bamboo_carrotsearch_download_staging_user=bamboo
bamboo_planRepository_1_repositoryUrl=https://github.com/carrotsearch/randomizedtesting.git
bamboo_repository_2555915_revision_number=11d0b31d2a5e3350b8fd008884e916163c77f1a9
bamboo_csssprites_download_user=bamboo
bamboo_carrot2_download_user=bamboo
bamboo_planRepository_1_username=stanislawosinski
bamboo_buildNumber=84
bamboo_planRepository_name=GitHub
bamboo_capability_system_builder_ant_Ant=/home/bamboo/tools/apache-ant-1.8.2
bamboo_buildTimeStamp=2015-10-27T13:43:45.239+01:00
PATH=/usr/lib/jvm/jdk8-ibm/bin:/usr/local/bin:/usr/bin:/bin:/usr/local/games:/usr/games
27-Oct-2015 13:43:54 [INFO] Scanning for projects...
27-Oct-2015 13:43:54 [INFO] ------------------------------------------------------------------------
27-Oct-2015 13:43:54 [INFO] Reactor Build Order:
27-Oct-2015 13:43:54 [INFO]
27-Oct-2015 13:43:54 [INFO] RandomizedTesting Parent POM
27-Oct-2015 13:43:54 [INFO] RandomizedTesting Randomized Runner
27-Oct-2015 13:43:54 [INFO] RandomizedTesting JUnit4 ANT Task
27-Oct-2015 13:43:54 [INFO] RandomizedTesting JUnit4 Maven Plugin
27-Oct-2015 13:43:54 [INFO] RandomizedTesting JUnit4 Maven Plugin Tests
27-Oct-2015 13:43:54 [INFO] RandomizedTesting Examples
27-Oct-2015 13:43:54 [INFO] RandomizedTesting ANT Examples
27-Oct-2015 13:43:54 [INFO] RandomizedTesting Security Manager Example
27-Oct-2015 13:43:54 [INFO]                                                                         
27-Oct-2015 13:43:54 [INFO] ------------------------------------------------------------------------
27-Oct-2015 13:43:54 [INFO] Building RandomizedTesting Parent POM 2.2.0-SNAPSHOT
27-Oct-2015 13:43:54 [INFO] ------------------------------------------------------------------------
27-Oct-2015 13:43:54 [INFO]
27-Oct-2015 13:43:54 [INFO] --- maven-clean-plugin:2.6.1:clean (default-clean) @ randomizedtesting-parent ---
27-Oct-2015 13:43:54 [INFO]                                                                         
27-Oct-2015 13:43:54 [INFO] ------------------------------------------------------------------------
27-Oct-2015 13:43:54 [INFO] Building RandomizedTesting Randomized Runner 2.2.0-SNAPSHOT
27-Oct-2015 13:43:54 [INFO] ------------------------------------------------------------------------
27-Oct-2015 13:43:54 [INFO]
27-Oct-2015 13:43:54 [INFO] --- maven-clean-plugin:2.6.1:clean (default-clean) @ randomizedtesting-runner ---
27-Oct-2015 13:43:54 [INFO] Deleting /mnt/work/bamboo-home/xml-data/build-dir/RNDTEST-SOFTWARE-IBM17/randomized-runner/target (includes = [], excludes = [eclipse/**, idea/**])
27-Oct-2015 13:43:54 [INFO]
27-Oct-2015 13:43:54 [INFO] --- maven-resources-plugin:2.7:resources (default-resources) @ randomizedtesting-runner ---
27-Oct-2015 13:43:55 [INFO] Using 'UTF-8' encoding to copy filtered resources.
27-Oct-2015 13:43:55 [INFO] skip non existing resourceDirectory /mnt/work/bamboo-home/xml-data/build-dir/RNDTEST-SOFTWARE-IBM17/randomized-runner/src/main/resources
27-Oct-2015 13:43:55 [INFO]
27-Oct-2015 13:43:55 [INFO] --- maven-compiler-plugin:3.3:compile (default-compile) @ randomizedtesting-runner ---
27-Oct-2015 13:43:55 [INFO] Changes detected - recompiling the module!
27-Oct-2015 13:43:55 [INFO] Compiling 80 source files to /mnt/work/bamboo-home/xml-data/build-dir/RNDTEST-SOFTWARE-IBM17/randomized-runner/target/classes
27-Oct-2015 13:43:59 [INFO] /mnt/work/bamboo-home/xml-data/build-dir/RNDTEST-SOFTWARE-IBM17/randomized-runner/src/main/java/com/carrotsearch/randomizedtesting/Rethrow.java: Some input files use unchecked or unsafe operations.
27-Oct-2015 13:43:59 [INFO] /mnt/work/bamboo-home/xml-data/build-dir/RNDTEST-SOFTWARE-IBM17/randomized-runner/src/main/java/com/carrotsearch/randomizedtesting/Rethrow.java: Recompile with -Xlint:unchecked for details.
27-Oct-2015 13:43:59 [INFO]
27-Oct-2015 13:43:59 [INFO] --- maven-bundle-plugin:2.3.4:manifest (bundle-manifest) @ randomizedtesting-runner ---
27-Oct-2015 13:44:02 [INFO]
27-Oct-2015 13:44:02 [INFO] --- maven-resources-plugin:2.7:testResources (default-testResources) @ randomizedtesting-runner ---
27-Oct-2015 13:44:02 [INFO] Using 'UTF-8' encoding to copy filtered resources.
27-Oct-2015 13:44:02 [INFO] skip non existing resourceDirectory /mnt/work/bamboo-home/xml-data/build-dir/RNDTEST-SOFTWARE-IBM17/randomized-runner/src/test/resources
27-Oct-2015 13:44:02 [INFO]
27-Oct-2015 13:44:02 [INFO] --- maven-compiler-plugin:3.3:testCompile (default-testCompile) @ randomizedtesting-runner ---
27-Oct-2015 13:44:02 [INFO] Changes detected - recompiling the module!
27-Oct-2015 13:44:02 [INFO] Compiling 82 source files to /mnt/work/bamboo-home/xml-data/build-dir/RNDTEST-SOFTWARE-IBM17/randomized-runner/target/test-classes
27-Oct-2015 13:44:04 [INFO] /mnt/work/bamboo-home/xml-data/build-dir/RNDTEST-SOFTWARE-IBM17/randomized-runner/src/test/java/com/carrotsearch/randomizedtesting/TestRules.java: Some input files use or override a deprecated API.
27-Oct-2015 13:44:04 [INFO] /mnt/work/bamboo-home/xml-data/build-dir/RNDTEST-SOFTWARE-IBM17/randomized-runner/src/test/java/com/carrotsearch/randomizedtesting/TestRules.java: Recompile with -Xlint:deprecation for details.
27-Oct-2015 13:44:04 [INFO]
27-Oct-2015 13:44:04 [INFO] --- maven-surefire-plugin:2.18.1:test (default-test) @ randomizedtesting-runner ---
27-Oct-2015 13:44:05 [INFO] Surefire report directory: /mnt/work/bamboo-home/xml-data/build-dir/RNDTEST-SOFTWARE-IBM17/randomized-runner/target/surefire-reports
27-Oct-2015 13:44:05
27-Oct-2015 13:44:05 -------------------------------------------------------
27-Oct-2015 13:44:05 T E S T S
27-Oct-2015 13:44:05 -------------------------------------------------------
27-Oct-2015 13:44:06 Running com.carrotsearch.randomizedtesting.TestFilterExpressionParser
27-Oct-2015 13:44:06 --
27-Oct-2015 13:44:06    default
27-Oct-2015 13:44:06 -- default
27-Oct-2015 13:44:06    default
27-Oct-2015 13:44:06 -- @nightly
27-Oct-2015 13:44:06    @nightly
27-Oct-2015 13:44:06 -- @nightly or @slow
27-Oct-2015 13:44:06    (@nightly OR @slow)
27-Oct-2015 13:44:06 -- @nightly and @slow
27-Oct-2015 13:44:06    (@nightly AND @slow)
27-Oct-2015 13:44:06 -- @nightly and not @slow
27-Oct-2015 13:44:06    (@nightly AND (NOT @slow))
27-Oct-2015 13:44:06 -- @nightly and (not @slow)
27-Oct-2015 13:44:06    (@nightly AND (NOT @slow))
27-Oct-2015 13:44:06 -- not @slow
27-Oct-2015 13:44:06    (NOT @slow)
27-Oct-2015 13:44:06 -- not not @slow
27-Oct-2015 13:44:06    (NOT (NOT @slow))
27-Oct-2015 13:44:06 -- not @nightly or @slow
27-Oct-2015 13:44:06    ((NOT @nightly) OR @slow)
27-Oct-2015 13:44:06 -- not(@nightly or @slow)
27-Oct-2015 13:44:06    (NOT (@nightly OR @slow))
27-Oct-2015 13:44:06 -- (@nightly and (not @slow))
27-Oct-2015 13:44:06    (@nightly AND (NOT @slow))
27-Oct-2015 13:44:06 -- nightly
27-Oct-2015 13:44:06    Unrecognized token 'nightly'. At: ">nightly<"
27-Oct-2015 13:44:06 -- @nightly and
27-Oct-2015 13:44:06    Missing argument for AND. At: "@nightly >and< "
27-Oct-2015 13:44:06 -- @nightly or
27-Oct-2015 13:44:06    Missing argument for OR. At: "@nightly >or< "
27-Oct-2015 13:44:06 -- @nightly and or @slow
27-Oct-2015 13:44:06    Syntax error. At: "@nightly and >or< @slow"
27-Oct-2015 13:44:06 -- and not @slow
27-Oct-2015 13:44:06    Syntax error. At: ">and< not @slow"
27-Oct-2015 13:44:06 -- (@nightly))
27-Oct-2015 13:44:06    Unbalanced parenthesis. At: "(@nightly)>)<"
27-Oct-2015 13:44:06 -- ((@nightly or @slow)
27-Oct-2015 13:44:06    Expected closing bracket. At: "((@nightly or @slow)><"
27-Oct-2015 13:44:06 Tests run: 5, Failures: 0, Errors: 0, Skipped: 0, Time elapsed: 0.059 sec - in com.carrotsearch.randomizedtesting.TestFilterExpressionParser
27-Oct-2015 13:44:06 Running com.carrotsearch.randomizedtesting.TestRandomInStaticInitializer
27-Oct-2015 13:44:06 Tests run: 1, Failures: 0, Errors: 0, Skipped: 0, Time elapsed: 0.035 sec - in com.carrotsearch.randomizedtesting.TestRandomInStaticInitializer
27-Oct-2015 13:44:06 Running com.carrotsearch.randomizedtesting.TestTestFiltering
27-Oct-2015 13:44:06 Tests run: 1, Failures: 0, Errors: 0, Skipped: 0, Time elapsed: 0.049 sec - in com.carrotsearch.randomizedtesting.TestTestFiltering
27-Oct-2015 13:44:06 Running com.carrotsearch.randomizedtesting.TestOverridingDefaultExceptionHandler
27-Oct-2015 13:44:06 Tests run: 1, Failures: 0, Errors: 0, Skipped: 0, Time elapsed: 0.029 sec - in com.carrotsearch.randomizedtesting.TestOverridingDefaultExceptionHandler
27-Oct-2015 13:44:06 Running com.carrotsearch.randomizedtesting.TestExpected
27-Oct-2015 13:44:06 Tests run: 2, Failures: 0, Errors: 0, Skipped: 0, Time elapsed: 0.036 sec - in com.carrotsearch.randomizedtesting.TestExpected
27-Oct-2015 13:44:06 Running com.carrotsearch.randomizedtesting.TestOverlappingMethodProviders
27-Oct-2015 13:44:06 Tests run: 1, Failures: 0, Errors: 0, Skipped: 0, Time elapsed: 0.001 sec - in com.carrotsearch.randomizedtesting.TestOverlappingMethodProviders
27-Oct-2015 13:44:06 Running com.carrotsearch.randomizedtesting.TestSetSeedLocked
27-Oct-2015 13:44:06 Tests run: 1, Failures: 0, Errors: 0, Skipped: 0, Time elapsed: 0.006 sec - in com.carrotsearch.randomizedtesting.TestSetSeedLocked
27-Oct-2015 13:44:06 Running com.carrotsearch.randomizedtesting.TestRules
27-Oct-2015 13:44:06 Tests run: 2, Failures: 0, Errors: 0, Skipped: 0, Time elapsed: 0.027 sec - in com.carrotsearch.randomizedtesting.TestRules
27-Oct-2015 13:44:06 Running com.carrotsearch.randomizedtesting.TestJ9SysThreads
27-Oct-2015 13:44:06 com.ibm.lang.management.MemoryPoolMXBeanImpl
27-Oct-2015 13:44:06 com.ibm.lang.management.MemoryPoolMXBeanImpl
27-Oct-2015 13:44:06 com.ibm.lang.management.MemoryPoolMXBeanImpl
27-Oct-2015 13:44:06 com.ibm.lang.management.MemoryPoolMXBeanImpl
27-Oct-2015 13:44:06 com.ibm.lang.management.MemoryPoolMXBeanImpl
27-Oct-2015 13:44:06 Tests run: 1, Failures: 0, Errors: 0, Skipped: 0, Time elapsed: 0.031 sec - in com.carrotsearch.randomizedtesting.TestJ9SysThreads
27-Oct-2015 13:44:06 Running com.carrotsearch.randomizedtesting.TestManyThreadsOOM
27-Oct-2015 13:44:19 Tests run: 10, Failures: 0, Errors: 0, Skipped: 0, Time elapsed: 12.913 sec - in com.carrotsearch.randomizedtesting.TestManyThreadsOOM
27-Oct-2015 13:44:19 Running com.carrotsearch.randomizedtesting.TestParameterized
27-Oct-2015 13:44:19 Tests run: 3, Failures: 0, Errors: 0, Skipped: 0, Time elapsed: 0.04 sec - in com.carrotsearch.randomizedtesting.TestParameterized
27-Oct-2015 13:44:19 Running com.carrotsearch.randomizedtesting.TestFailurePropagationCompatibility
27-Oct-2015 13:44:20 Tests run: 1, Failures: 0, Errors: 0, Skipped: 0, Time elapsed: 0.223 sec - in com.carrotsearch.randomizedtesting.TestFailurePropagationCompatibility
27-Oct-2015 13:44:20 Running com.carrotsearch.randomizedtesting.TestHooksWithEmptyTestSet
27-Oct-2015 13:44:20 Tests run: 1, Failures: 0, Errors: 0, Skipped: 0, Time elapsed: 0 sec - in com.carrotsearch.randomizedtesting.TestHooksWithEmptyTestSet
27-Oct-2015 13:44:20 Running com.carrotsearch.randomizedtesting.TestResourceDisposal
27-Oct-2015 13:44:20 Tests run: 3, Failures: 0, Errors: 0, Skipped: 0, Time elapsed: 0.023 sec - in com.carrotsearch.randomizedtesting.TestResourceDisposal
27-Oct-2015 13:44:20 Running com.carrotsearch.randomizedtesting.TestThreadNameContainsTestName
27-Oct-2015 13:44:20 Tests run: 3, Failures: 0, Errors: 0, Skipped: 0, Time elapsed: 0.003 sec - in com.carrotsearch.randomizedtesting.TestThreadNameContainsTestName
27-Oct-2015 13:44:20 Running com.carrotsearch.randomizedtesting.TestChildTestGroupThreads
27-Oct-2015 13:44:20 Tests run: 1, Failures: 0, Errors: 0, Skipped: 0, Time elapsed: 0.001 sec - in com.carrotsearch.randomizedtesting.TestChildTestGroupThreads
27-Oct-2015 13:44:20 Running com.carrotsearch.randomizedtesting.TestSeedRepeatable
27-Oct-2015 13:44:20 Tests run: 1, Failures: 0, Errors: 0, Skipped: 0, Time elapsed: 0.003 sec - in com.carrotsearch.randomizedtesting.TestSeedRepeatable
27-Oct-2015 13:44:20 Running com.carrotsearch.randomizedtesting.TestSeedParameterOptional
27-Oct-2015 13:44:20 Tests run: 1, Failures: 0, Errors: 0, Skipped: 0, Time elapsed: 0.011 sec - in com.carrotsearch.randomizedtesting.TestSeedParameterOptional
27-Oct-2015 13:44:20 Running com.carrotsearch.randomizedtesting.TestCustomMethodProvider
27-Oct-2015 13:44:20 Tests run: 2, Failures: 0, Errors: 0, Skipped: 0, Time elapsed: 0.008 sec - in com.carrotsearch.randomizedtesting.TestCustomMethodProvider
27-Oct-2015 13:44:20 Running com.carrotsearch.randomizedtesting.TestParameterizedShufflesOrder
27-Oct-2015 13:44:20 Tests run: 2, Failures: 0, Errors: 0, Skipped: 0, Time elapsed: 0.161 sec - in com.carrotsearch.randomizedtesting.TestParameterizedShufflesOrder
27-Oct-2015 13:44:20 Running com.carrotsearch.randomizedtesting.TestMacSysThreads
27-Oct-2015 13:44:25 Tests run: 1, Failures: 0, Errors: 0, Skipped: 0, Time elapsed: 5.039 sec - in com.carrotsearch.randomizedtesting.TestMacSysThreads
27-Oct-2015 13:44:25 Running com.carrotsearch.randomizedtesting.TestContextRandom
27-Oct-2015 13:44:25 Tests run: 3, Failures: 0, Errors: 0, Skipped: 1, Time elapsed: 0.013 sec - in com.carrotsearch.randomizedtesting.TestContextRandom
27-Oct-2015 13:44:25 Running com.carrotsearch.randomizedtesting.TestNightlyMode
27-Oct-2015 13:44:25 Tests run: 3, Failures: 0, Errors: 0, Skipped: 0, Time elapsed: 0.015 sec - in com.carrotsearch.randomizedtesting.TestNightlyMode
27-Oct-2015 13:44:25 Running com.carrotsearch.randomizedtesting.TestSeedFixing
27-Oct-2015 13:44:25 Tests run: 1, Failures: 0, Errors: 0, Skipped: 0, Time elapsed: 0.002 sec - in com.carrotsearch.randomizedtesting.TestSeedFixing
27-Oct-2015 13:44:25 Running com.carrotsearch.randomizedtesting.contracts.TestAnnotationInheritance
27-Oct-2015 13:44:25 Tests run: 1, Failures: 0, Errors: 0, Skipped: 0, Time elapsed: 0.006 sec - in com.carrotsearch.randomizedtesting.contracts.TestAnnotationInheritance
27-Oct-2015 13:44:25 Running com.carrotsearch.randomizedtesting.contracts.TestAssumptionsAtClassLevel
27-Oct-2015 13:44:25 Tests run: 1, Failures: 0, Errors: 0, Skipped: 0, Time elapsed: 0.004 sec - in com.carrotsearch.randomizedtesting.contracts.TestAssumptionsAtClassLevel
27-Oct-2015 13:44:25 Running com.carrotsearch.randomizedtesting.contracts.TestClassLevelIgnore
27-Oct-2015 13:44:25 Tests run: 1, Failures: 0, Errors: 0, Skipped: 0, Time elapsed: 0 sec - in com.carrotsearch.randomizedtesting.contracts.TestClassLevelIgnore
27-Oct-2015 13:44:25 Running com.carrotsearch.randomizedtesting.contracts.TestBeforeAfterMethodOrder
27-Oct-2015 13:44:25 Tests run: 2, Failures: 0, Errors: 0, Skipped: 0, Time elapsed: 0.041 sec - in com.carrotsearch.randomizedtesting.contracts.TestBeforeAfterMethodOrder
27-Oct-2015 13:44:25 Running com.carrotsearch.randomizedtesting.contracts.TestClassRules
27-Oct-2015 13:44:25 Tests run: 1, Failures: 0, Errors: 0, Skipped: 0, Time elapsed: 0.003 sec - in com.carrotsearch.randomizedtesting.contracts.TestClassRules
27-Oct-2015 13:44:25 Running com.carrotsearch.randomizedtesting.timeouts.Test008SeedsAnnotation
27-Oct-2015 13:44:25 Tests run: 1, Failures: 0, Errors: 0, Skipped: 0, Time elapsed: 0.03 sec - in com.carrotsearch.randomizedtesting.timeouts.Test008SeedsAnnotation
27-Oct-2015 13:44:25 Running com.carrotsearch.randomizedtesting.timeouts.Test011RunawayThreads
27-Oct-2015 13:44:26 Tests run: 5, Failures: 0, Errors: 0, Skipped: 0, Time elapsed: 0.544 sec - in com.carrotsearch.randomizedtesting.timeouts.Test011RunawayThreads
27-Oct-2015 13:44:26 Running com.carrotsearch.randomizedtesting.timeouts.Test014Timeout
27-Oct-2015 13:44:26 Tests run: 1, Failures: 0, Errors: 0, Skipped: 0, Time elapsed: 0.213 sec - in com.carrotsearch.randomizedtesting.timeouts.Test014Timeout
27-Oct-2015 13:44:26 Running com.carrotsearch.randomizedtesting.timeouts.Test001TimeoutSuite
27-Oct-2015 13:44:30 Tests run: 8, Failures: 0, Errors: 0, Skipped: 0, Time elapsed: 4.1 sec - in com.carrotsearch.randomizedtesting.timeouts.Test001TimeoutSuite
27-Oct-2015 13:44:30 Running com.carrotsearch.randomizedtesting.timeouts.Test016ThreadLeaksCustomFilters
27-Oct-2015 13:44:30 Tests run: 1, Failures: 0, Errors: 0, Skipped: 0, Time elapsed: 0.008 sec - in com.carrotsearch.randomizedtesting.timeouts.Test016ThreadLeaksCustomFilters
27-Oct-2015 13:44:30 Running com.carrotsearch.randomizedtesting.timeouts.Test020SuiteTimeoutStopsTests
27-Oct-2015 13:44:30 before timeout(4)
27-Oct-2015 13:44:30 suite timeout(4)
27-Oct-2015 13:44:30 Oct 27, 2015 1:44:30 PM com.carrotsearch.randomizedtesting.ThreadLeakControl$2 evaluate
27-Oct-2015 13:44:30 WARNING: Suite execution timed out: com.carrotsearch.randomizedtesting.timeouts.Test020SuiteTimeoutStopsTests$Nested1
27-Oct-2015 13:44:30 ==== jstack at approximately timeout time ====
27-Oct-2015 13:44:30 "main" ID=1 WAITING on com.carrotsearch.randomizedtesting.RandomizedRunner$2@5ce94bfe (in native code)
27-Oct-2015 13:44:30         at java.lang.Object.wait(Native Method)
27-Oct-2015 13:44:30         - waiting on com.carrotsearch.randomizedtesting.RandomizedRunner$2@5ce94bfe
27-Oct-2015 13:44:30         at java.lang.Object.wait(Object.java:201)
27-Oct-2015 13:44:30         at java.lang.Thread.join(Thread.java:665)
27-Oct-2015 13:44:30         - locked com.carrotsearch.randomizedtesting.RandomizedRunner$2@5ce94bfe
27-Oct-2015 13:44:30         at com.carrotsearch.randomizedtesting.RandomizedRunner.runSuite(RandomizedRunner.java:597)
27-Oct-2015 13:44:30         at com.carrotsearch.randomizedtesting.RandomizedRunner.run(RandomizedRunner.java:446)
27-Oct-2015 13:44:30         at org.junit.runner.JUnitCore.run(JUnitCore.java:157)
27-Oct-2015 13:44:30         at com.carrotsearch.randomizedtesting.timeouts.Test020SuiteTimeoutStopsTests.testExceptionInFilter(Test020SuiteTimeoutStopsTests.java:63)
27-Oct-2015 13:44:30         at sun.reflect.NativeMethodAccessorImpl.invoke0(Native Method)
27-Oct-2015 13:44:30         at sun.reflect.NativeMethodAccessorImpl.invoke(NativeMethodAccessorImpl.java:95)
27-Oct-2015 13:44:30         at sun.reflect.DelegatingMethodAccessorImpl.invoke(DelegatingMethodAccessorImpl.java:55)
27-Oct-2015 13:44:30         at java.lang.reflect.Method.invoke(Method.java:507)
27-Oct-2015 13:44:30         at org.junit.runners.model.FrameworkMethod$1.runReflectiveCall(FrameworkMethod.java:45)
27-Oct-2015 13:44:30         at org.junit.internal.runners.model.ReflectiveCallable.run(ReflectiveCallable.java:15)
27-Oct-2015 13:44:30         at org.junit.runners.model.FrameworkMethod.invokeExplosively(FrameworkMethod.java:42)
27-Oct-2015 13:44:30         at org.junit.internal.runners.statements.InvokeMethod.evaluate(InvokeMethod.java:20)
27-Oct-2015 13:44:30         at org.junit.internal.runners.statements.RunBefores.evaluate(RunBefores.java:28)
27-Oct-2015 13:44:30         at org.junit.internal.runners.statements.RunAfters.evaluate(RunAfters.java:30)
27-Oct-2015 13:44:30         at com.carrotsearch.randomizedtesting.rules.StatementAdapter.evaluate(StatementAdapter.java:36)
27-Oct-2015 13:44:30         at com.carrotsearch.randomizedtesting.rules.SystemPropertiesInvariantRule$1.evaluate(SystemPropertiesInvariantRule.java:59)
27-Oct-2015 13:44:30         at org.junit.rules.RunRules.evaluate(RunRules.java:18)
27-Oct-2015 13:44:30         at org.junit.runners.ParentRunner.runLeaf(ParentRunner.java:263)
27-Oct-2015 13:44:30         at org.junit.runners.BlockJUnit4ClassRunner.runChild(BlockJUnit4ClassRunner.java:68)
27-Oct-2015 13:44:30         at org.junit.runners.BlockJUnit4ClassRunner.runChild(BlockJUnit4ClassRunner.java:47)
27-Oct-2015 13:44:30         at org.junit.runners.ParentRunner$3.run(ParentRunner.java:231)
27-Oct-2015 13:44:30         at org.junit.runners.ParentRunner$1.schedule(ParentRunner.java:60)
27-Oct-2015 13:44:30         at org.junit.runners.ParentRunner.runChildren(ParentRunner.java:229)
27-Oct-2015 13:44:30         at org.junit.runners.ParentRunner.access$000(ParentRunner.java:50)
27-Oct-2015 13:44:30         at org.junit.runners.ParentRunner$2.evaluate(ParentRunner.java:222)
27-Oct-2015 13:44:30         at org.junit.internal.runners.statements.RunBefores.evaluate(RunBefores.java:28)
27-Oct-2015 13:44:30         at org.junit.internal.runners.statements.RunAfters.evaluate(RunAfters.java:30)
27-Oct-2015 13:44:30         at org.junit.runners.ParentRunner.run(ParentRunner.java:300)
27-Oct-2015 13:44:30         at org.apache.maven.surefire.junit4.JUnit4Provider.execute(JUnit4Provider.java:283)
27-Oct-2015 13:44:30         at org.apache.maven.surefire.junit4.JUnit4Provider.executeWithRerun(JUnit4Provider.java:173)
27-Oct-2015 13:44:30         at org.apache.maven.surefire.junit4.JUnit4Provider.executeTestSet(JUnit4Provider.java:153)
27-Oct-2015 13:44:30         at org.apache.maven.surefire.junit4.JUnit4Provider.invoke(JUnit4Provider.java:128)
27-Oct-2015 13:44:30         at org.apache.maven.surefire.booter.ForkedBooter.invokeProviderInSameClassLoader(ForkedBooter.java:203)
27-Oct-2015 13:44:30         at org.apache.maven.surefire.booter.ForkedBooter.runSuitesInProcess(ForkedBooter.java:155)
27-Oct-2015 13:44:30         at org.apache.maven.surefire.booter.ForkedBooter.main(ForkedBooter.java:103)
27-Oct-2015 13:44:30
27-Oct-2015 13:44:30 "JIT Compilation Thread-0" ID=4 RUNNABLE
27-Oct-2015 13:44:30
27-Oct-2015 13:44:30 "JIT Compilation Thread-1 Suspended" ID=5 RUNNABLE
27-Oct-2015 13:44:30
27-Oct-2015 13:44:30 "JIT Compilation Thread-2 Suspended" ID=6 RUNNABLE
27-Oct-2015 13:44:30
27-Oct-2015 13:44:30 "JIT Compilation Thread-3 Suspended" ID=7 RUNNABLE
27-Oct-2015 13:44:30
27-Oct-2015 13:44:30 "JIT Diagnostic Compilation Thread-4 Suspended" ID=8 RUNNABLE
27-Oct-2015 13:44:30
27-Oct-2015 13:44:30 "JIT-SamplerThread" ID=9 TIMED_WAITING
27-Oct-2015 13:44:30
27-Oct-2015 13:44:30 "IProfiler" ID=10 RUNNABLE
27-Oct-2015 13:44:30
27-Oct-2015 13:44:30 "Signal Dispatcher" ID=2 RUNNABLE (in native code)
27-Oct-2015 13:44:30         at com.ibm.misc.SignalDispatcher.waitForSignal(Native Method)
27-Oct-2015 13:44:30         at com.ibm.misc.SignalDispatcher.run(SignalDispatcher.java:73)
27-Oct-2015 13:44:30
27-Oct-2015 13:44:30 "Concurrent Mark Helper" ID=11 RUNNABLE
27-Oct-2015 13:44:30
27-Oct-2015 13:44:30 "GC Slave" ID=12 RUNNABLE
27-Oct-2015 13:44:30
27-Oct-2015 13:44:30 "GC Slave" ID=13 RUNNABLE
27-Oct-2015 13:44:30
27-Oct-2015 13:44:30 "GC Slave" ID=14 RUNNABLE
27-Oct-2015 13:44:30
27-Oct-2015 13:44:30 "GC Slave" ID=15 RUNNABLE
27-Oct-2015 13:44:30
27-Oct-2015 13:44:30 "GC Slave" ID=16 RUNNABLE
27-Oct-2015 13:44:30
27-Oct-2015 13:44:30 "GC Slave" ID=17 RUNNABLE
27-Oct-2015 13:44:30
27-Oct-2015 13:44:30 "GC Slave" ID=18 RUNNABLE
27-Oct-2015 13:44:30
27-Oct-2015 13:44:30 "GC Slave" ID=19 RUNNABLE
27-Oct-2015 13:44:30
27-Oct-2015 13:44:30 "GC Slave" ID=20 RUNNABLE
27-Oct-2015 13:44:30
27-Oct-2015 13:44:30 "GC Slave" ID=21 RUNNABLE
27-Oct-2015 13:44:30
27-Oct-2015 13:44:30 "GC Slave" ID=22 RUNNABLE
27-Oct-2015 13:44:30
27-Oct-2015 13:44:30 "Attach API wait loop" ID=25 RUNNABLE (in native code)
27-Oct-2015 13:44:30         at com.ibm.tools.attach.javaSE.IPC.waitSemaphore(Native Method)
27-Oct-2015 13:44:30         at com.ibm.tools.attach.javaSE.CommonDirectory.waitSemaphore(CommonDirectory.java:193)
27-Oct-2015 13:44:30         at com.ibm.tools.attach.javaSE.AttachHandler$WaitLoop.waitForNotification(AttachHandler.java:359)
27-Oct-2015 13:44:30         at com.ibm.tools.attach.javaSE.AttachHandler$WaitLoop.run(AttachHandler.java:447)
27-Oct-2015 13:44:30
27-Oct-2015 13:44:30 "Finalizer thread" ID=26 RUNNABLE
27-Oct-2015 13:44:30
27-Oct-2015 13:44:30 "MemoryPoolMXBean notification dispatcher" ID=43 RUNNABLE (in native code)
27-Oct-2015 13:44:30         at com.ibm.lang.management.MemoryNotificationThread.processNotificationLoop(Native Method)
27-Oct-2015 13:44:30         at com.ibm.lang.management.MemoryNotificationThread.run(Unknown Source)
27-Oct-2015 13:44:30
27-Oct-2015 13:44:30 "SUITE-Test020SuiteTimeoutStopsTests$Nested1-seed#[32739618D2AE5035]" ID=5272 RUNNABLE (in native code)
27-Oct-2015 13:44:30         at com.ibm.lang.management.ThreadMXBeanImpl.dumpAllThreadsImpl(Native Method)
27-Oct-2015 13:44:30         at com.ibm.lang.management.ThreadMXBeanImpl.dumpAllThreads(Unknown Source)
27-Oct-2015 13:44:30         at com.carrotsearch.randomizedtesting.ThreadLeakControl.formatThreadStacksFull(ThreadLeakControl.java:673)
27-Oct-2015 13:44:30         at com.carrotsearch.randomizedtesting.ThreadLeakControl.access$1000(ThreadLeakControl.java:64)
27-Oct-2015 13:44:30         at com.carrotsearch.randomizedtesting.ThreadLeakControl$2.evaluate(ThreadLeakControl.java:414)
27-Oct-2015 13:44:30         - locked java.lang.Object@a39f05d1
27-Oct-2015 13:44:30         at com.carrotsearch.randomizedtesting.RandomizedRunner.runSuite(RandomizedRunner.java:677)
27-Oct-2015 13:44:30         at com.carrotsearch.randomizedtesting.RandomizedRunner.access$200(RandomizedRunner.java:140)
27-Oct-2015 13:44:30         at com.carrotsearch.randomizedtesting.RandomizedRunner$2.run(RandomizedRunner.java:587)
27-Oct-2015 13:44:30
27-Oct-2015 13:44:30 "TEST-Test020SuiteTimeoutStopsTests$Nested1.test004-seed#[32739618D2AE5035]" ID=5273 TIMED_WAITING (in native code)
27-Oct-2015 13:44:30         at java.lang.Thread.sleep(Native Method)
27-Oct-2015 13:44:30         at java.lang.Thread.sleep(Thread.java:909)
27-Oct-2015 13:44:30         at com.carrotsearch.randomizedtesting.timeouts.Test020SuiteTimeoutStopsTests$Nested1.idle(Test020SuiteTimeoutStopsTests.java:49)
27-Oct-2015 13:44:30         at com.carrotsearch.randomizedtesting.timeouts.Test020SuiteTimeoutStopsTests$Nested1.test004(Test020SuiteTimeoutStopsTests.java:32)
27-Oct-2015 13:44:30         at sun.reflect.NativeMethodAccessorImpl.invoke0(Native Method)
27-Oct-2015 13:44:30         at sun.reflect.NativeMethodAccessorImpl.invoke(NativeMethodAccessorImpl.java:95)
27-Oct-2015 13:44:30         at sun.reflect.DelegatingMethodAccessorImpl.invoke(DelegatingMethodAccessorImpl.java:55)
27-Oct-2015 13:44:30         at java.lang.reflect.Method.invoke(Method.java:507)
27-Oct-2015 13:44:30         at com.carrotsearch.randomizedtesting.RandomizedRunner.invoke(RandomizedRunner.java:1666)
27-Oct-2015 13:44:30         at com.carrotsearch.randomizedtesting.RandomizedRunner$8.evaluate(RandomizedRunner.java:865)
27-Oct-2015 13:44:30         at com.carrotsearch.randomizedtesting.rules.StatementAdapter.evaluate(StatementAdapter.java:36)
27-Oct-2015 13:44:30         at com.carrotsearch.randomizedtesting.ThreadLeakControl$StatementRunner.run(ThreadLeakControl.java:367)
27-Oct-2015 13:44:30         at com.carrotsearch.randomizedtesting.ThreadLeakControl.forkTimeoutingTask(ThreadLeakControl.java:809)
27-Oct-2015 13:44:30         at com.carrotsearch.randomizedtesting.ThreadLeakControl$3.evaluate(ThreadLeakControl.java:460)
27-Oct-2015 13:44:30         at com.carrotsearch.randomizedtesting.RandomizedRunner.runSingleTest(RandomizedRunner.java:874)
27-Oct-2015 13:44:30         at com.carrotsearch.randomizedtesting.RandomizedRunner$5.evaluate(RandomizedRunner.java:776)
27-Oct-2015 13:44:30         at com.carrotsearch.randomizedtesting.RandomizedRunner$6.evaluate(RandomizedRunner.java:810)
27-Oct-2015 13:44:30         at com.carrotsearch.randomizedtesting.RandomizedRunner$7.evaluate(RandomizedRunner.java:821)
27-Oct-2015 13:44:30         at com.carrotsearch.randomizedtesting.rules.StatementAdapter.evaluate(StatementAdapter.java:36)
27-Oct-2015 13:44:30         at com.carrotsearch.randomizedtesting.ThreadLeakControl$StatementRunner.run(ThreadLeakControl.java:367)
27-Oct-2015 13:44:30         at java.lang.Thread.run(Thread.java:785)
27-Oct-2015 13:44:30
27-Oct-2015 13:44:30 ^^==============================================
27-Oct-2015 13:44:30
27-Oct-2015 13:44:30
27-Oct-2015 13:44:30 Oct 27, 2015 1:44:30 PM com.carrotsearch.randomizedtesting.ThreadLeakControl checkThreadLeaks
27-Oct-2015 13:44:30 SEVERE: 1 thread leaked from SUITE scope at com.carrotsearch.randomizedtesting.timeouts.Test020SuiteTimeoutStopsTests$Nested1:
27-Oct-2015 13:44:30    1) Thread[id=5273, name=TEST-Test020SuiteTimeoutStopsTests$Nested1.test004-seed#[32739618D2AE5035], state=TIMED_WAITING, group=TGRP-Test020SuiteTimeoutStopsTests$Nested1]
27-Oct-2015 13:44:30         at java.lang.Thread.sleep(Native Method)
27-Oct-2015 13:44:30         at java.lang.Thread.sleep(Thread.java:909)
27-Oct-2015 13:44:30         at com.carrotsearch.randomizedtesting.timeouts.Test020SuiteTimeoutStopsTests$Nested1.idle(Test020SuiteTimeoutStopsTests.java:49)
27-Oct-2015 13:44:30         at com.carrotsearch.randomizedtesting.timeouts.Test020SuiteTimeoutStopsTests$Nested1.test004(Test020SuiteTimeoutStopsTests.java:32)
27-Oct-2015 13:44:30         at sun.reflect.NativeMethodAccessorImpl.invoke0(Native Method)
27-Oct-2015 13:44:30         at sun.reflect.NativeMethodAccessorImpl.invoke(NativeMethodAccessorImpl.java:95)
27-Oct-2015 13:44:30         at sun.reflect.DelegatingMethodAccessorImpl.invoke(DelegatingMethodAccessorImpl.java:55)
27-Oct-2015 13:44:30         at java.lang.reflect.Method.invoke(Method.java:507)
27-Oct-2015 13:44:30         at com.carrotsearch.randomizedtesting.RandomizedRunner.invoke(RandomizedRunner.java:1666)
27-Oct-2015 13:44:30         at com.carrotsearch.randomizedtesting.RandomizedRunner$8.evaluate(RandomizedRunner.java:865)
27-Oct-2015 13:44:30         at com.carrotsearch.randomizedtesting.rules.StatementAdapter.evaluate(StatementAdapter.java:36)
27-Oct-2015 13:44:30         at com.carrotsearch.randomizedtesting.ThreadLeakControl$StatementRunner.run(ThreadLeakControl.java:367)
27-Oct-2015 13:44:30         at com.carrotsearch.randomizedtesting.ThreadLeakControl.forkTimeoutingTask(ThreadLeakControl.java:809)
27-Oct-2015 13:44:30         at com.carrotsearch.randomizedtesting.ThreadLeakControl$3.evaluate(ThreadLeakControl.java:460)
27-Oct-2015 13:44:30         at com.carrotsearch.randomizedtesting.RandomizedRunner.runSingleTest(RandomizedRunner.java:874)
27-Oct-2015 13:44:30         at com.carrotsearch.randomizedtesting.RandomizedRunner$5.evaluate(RandomizedRunner.java:776)
27-Oct-2015 13:44:30         at com.carrotsearch.randomizedtesting.RandomizedRunner$6.evaluate(RandomizedRunner.java:810)
27-Oct-2015 13:44:30         at com.carrotsearch.randomizedtesting.RandomizedRunner$7.evaluate(RandomizedRunner.java:821)
27-Oct-2015 13:44:30         at com.carrotsearch.randomizedtesting.rules.StatementAdapter.evaluate(StatementAdapter.java:36)
27-Oct-2015 13:44:30         at com.carrotsearch.randomizedtesting.ThreadLeakControl$StatementRunner.run(ThreadLeakControl.java:367)
27-Oct-2015 13:44:30         at java.lang.Thread.run(Thread.java:785)
27-Oct-2015 13:44:30
27-Oct-2015 13:44:30 Oct 27, 2015 1:44:30 PM com.carrotsearch.randomizedtesting.ThreadLeakControl tryToInterruptAll
27-Oct-2015 13:44:30 INFO: Starting to interrupt leaked threads:
27-Oct-2015 13:44:30    1) Thread[id=5273, name=TEST-Test020SuiteTimeoutStopsTests$Nested1.test004-seed#[32739618D2AE5035], state=TIMED_WAITING, group=TGRP-Test020SuiteTimeoutStopsTests$Nested1]
27-Oct-2015 13:44:30
27-Oct-2015 13:44:30 Oct 27, 2015 1:44:30 PM com.carrotsearch.randomizedtesting.ThreadLeakControl tryToInterruptAll
27-Oct-2015 13:44:30 INFO: All leaked threads terminated.
27-Oct-2015 13:44:30
27-Oct-2015 13:44:30
27-Oct-2015 13:44:30 Tests run: 1, Failures: 0, Errors: 0, Skipped: 0, Time elapsed: 0.512 sec - in com.carrotsearch.randomizedtesting.timeouts.Test020SuiteTimeoutStopsTests
27-Oct-2015 13:44:30 Running com.carrotsearch.randomizedtesting.timeouts.Test002TimeoutMethod
27-Oct-2015 13:44:31 Tests run: 4, Failures: 0, Errors: 0, Skipped: 0, Time elapsed: 0.138 sec - in com.carrotsearch.randomizedtesting.timeouts.Test002TimeoutMethod
27-Oct-2015 13:44:31 Running com.carrotsearch.randomizedtesting.timeouts.Test003ThreadLeaksMethod
27-Oct-2015 13:44:31 Tests run: 8, Failures: 0, Errors: 0, Skipped: 0, Time elapsed: 0.057 sec - in com.carrotsearch.randomizedtesting.timeouts.Test003ThreadLeaksMethod
27-Oct-2015 13:44:31 Running com.carrotsearch.randomizedtesting.timeouts.Test013ThreadLeaksScopeNone
27-Oct-2015 13:44:31 Tests run: 8, Failures: 0, Errors: 0, Skipped: 0, Time elapsed: 0.031 sec - in com.carrotsearch.randomizedtesting.timeouts.Test013ThreadLeaksScopeNone
27-Oct-2015 13:44:31 Running com.carrotsearch.randomizedtesting.timeouts.Test005ThreadLeaksSystemThreads
27-Oct-2015 13:44:31 Tests run: 1, Failures: 0, Errors: 0, Skipped: 0, Time elapsed: 0.229 sec - in com.carrotsearch.randomizedtesting.timeouts.Test005ThreadLeaksSystemThreads
27-Oct-2015 13:44:31 Running com.carrotsearch.randomizedtesting.timeouts.Test015TimeoutOverride
27-Oct-2015 13:44:32 Tests run: 2, Failures: 0, Errors: 0, Skipped: 0, Time elapsed: 1.216 sec - in com.carrotsearch.randomizedtesting.timeouts.Test015TimeoutOverride
27-Oct-2015 13:44:32 Running com.carrotsearch.randomizedtesting.timeouts.Test010Zombies
27-Oct-2015 13:44:33 Tests run: 8, Failures: 0, Errors: 0, Skipped: 0, Time elapsed: 0.604 sec - in com.carrotsearch.randomizedtesting.timeouts.Test010Zombies
27-Oct-2015 13:44:33 Running com.carrotsearch.randomizedtesting.timeouts.Test007UncaughtExceptions
27-Oct-2015 13:44:33 Tests run: 2, Failures: 0, Errors: 0, Skipped: 0, Time elapsed: 0.012 sec - in com.carrotsearch.randomizedtesting.timeouts.Test007UncaughtExceptions
27-Oct-2015 13:44:33 Running com.carrotsearch.randomizedtesting.timeouts.Test004ThreadLeaksSuite
27-Oct-2015 13:44:33 Tests run: 8, Failures: 0, Errors: 0, Skipped: 0, Time elapsed: 0.087 sec - in com.carrotsearch.randomizedtesting.timeouts.Test004ThreadLeaksSuite
27-Oct-2015 13:44:33 Running com.carrotsearch.randomizedtesting.timeouts.Test017ThreadLeaksCustomFiltersException
27-Oct-2015 13:44:33 Tests run: 1, Failures: 0, Errors: 0, Skipped: 0, Time elapsed: 0.005 sec - in com.carrotsearch.randomizedtesting.timeouts.Test017ThreadLeaksCustomFiltersException
27-Oct-2015 13:44:33 Running com.carrotsearch.randomizedtesting.timeouts.Test012RunawayThreadsKilledAtOnce
27-Oct-2015 13:44:33 Tests run: 1, Failures: 0, Errors: 0, Skipped: 0, Time elapsed: 0.028 sec - in com.carrotsearch.randomizedtesting.timeouts.Test012RunawayThreadsKilledAtOnce
27-Oct-2015 13:44:33 Running com.carrotsearch.randomizedtesting.timeouts.Test019ThreadLeakGroup
27-Oct-2015 13:44:33 Tests run: 3, Failures: 0, Errors: 0, Skipped: 0, Time elapsed: 0.018 sec - in com.carrotsearch.randomizedtesting.timeouts.Test019ThreadLeakGroup
27-Oct-2015 13:44:33 Running com.carrotsearch.randomizedtesting.timeouts.Test018TimeoutStacks
27-Oct-2015 13:44:34 Tests run: 1, Failures: 0, Errors: 0, Skipped: 0, Time elapsed: 1.018 sec - in com.carrotsearch.randomizedtesting.timeouts.Test018TimeoutStacks
27-Oct-2015 13:44:34 Running com.carrotsearch.randomizedtesting.timeouts.Test006TimeoutAndThreadLeak
27-Oct-2015 13:44:38 Tests run: 8, Failures: 0, Errors: 0, Skipped: 0, Time elapsed: 4.1 sec - in com.carrotsearch.randomizedtesting.timeouts.Test006TimeoutAndThreadLeak
27-Oct-2015 13:44:38 Running com.carrotsearch.randomizedtesting.timeouts.Test009TimeoutOrNotIdenticalSequence
27-Oct-2015 13:44:38 Tests run: 1, Failures: 0, Errors: 0, Skipped: 0, Time elapsed: 0.015 sec - in com.carrotsearch.randomizedtesting.timeouts.Test009TimeoutOrNotIdenticalSequence
27-Oct-2015 13:44:38 Running com.carrotsearch.randomizedtesting.TestListenersAnnotation
27-Oct-2015 13:44:38 Tests run: 1, Failures: 0, Errors: 0, Skipped: 0, Time elapsed: 0.006 sec - in com.carrotsearch.randomizedtesting.TestListenersAnnotation
27-Oct-2015 13:44:38 Running com.carrotsearch.randomizedtesting.rules.TestNoInstanceHooksOverridesRule
27-Oct-2015 13:44:38 Tests run: 4, Failures: 0, Errors: 0, Skipped: 0, Time elapsed: 0.02 sec - in com.carrotsearch.randomizedtesting.rules.TestNoInstanceHooksOverridesRule
27-Oct-2015 13:44:38 Running com.carrotsearch.randomizedtesting.rules.TestStaticFieldsInvariantRule
27-Oct-2015 13:44:38 Tests run: 3, Failures: 0, Errors: 0, Skipped: 0, Time elapsed: 0.025 sec - in com.carrotsearch.randomizedtesting.rules.TestStaticFieldsInvariantRule
27-Oct-2015 13:44:38 Running com.carrotsearch.randomizedtesting.rules.TestNoClassHooksShadowingRule
27-Oct-2015 13:44:38 Tests run: 3, Failures: 0, Errors: 0, Skipped: 0, Time elapsed: 0.015 sec - in com.carrotsearch.randomizedtesting.rules.TestNoClassHooksShadowingRule
27-Oct-2015 13:44:38 Running com.carrotsearch.randomizedtesting.rules.TestSystemPropertiesInvariantRule
27-Oct-2015 13:44:38 Tests run: 4, Failures: 0, Errors: 0, Skipped: 0, Time elapsed: 0.015 sec - in com.carrotsearch.randomizedtesting.rules.TestSystemPropertiesInvariantRule
27-Oct-2015 13:44:38 Running com.carrotsearch.randomizedtesting.TestJUnit3MethodProvider
27-Oct-2015 13:44:38 Tests run: 3, Failures: 0, Errors: 0, Skipped: 0, Time elapsed: 0.012 sec - in com.carrotsearch.randomizedtesting.TestJUnit3MethodProvider
27-Oct-2015 13:44:38 Running com.carrotsearch.randomizedtesting.TestSeedDecorator
27-Oct-2015 13:44:38 Tests run: 1, Failures: 0, Errors: 0, Skipped: 0, Time elapsed: 0.008 sec - in com.carrotsearch.randomizedtesting.TestSeedDecorator
27-Oct-2015 13:44:38 Running com.carrotsearch.randomizedtesting.TestIterationsAnnotation
27-Oct-2015 13:44:38 Tests run: 10, Failures: 0, Errors: 0, Skipped: 0, Time elapsed: 0.013 sec - in com.carrotsearch.randomizedtesting.TestIterationsAnnotation
27-Oct-2015 13:44:38 Running com.carrotsearch.randomizedtesting.TestValidation
27-Oct-2015 13:44:38 Tests run: 1, Failures: 0, Errors: 0, Skipped: 0, Time elapsed: 0.006 sec - in com.carrotsearch.randomizedtesting.TestValidation
27-Oct-2015 13:44:38 Running com.carrotsearch.randomizedtesting.generators.TestRandomPicks
27-Oct-2015 13:44:38 Tests run: 4, Failures: 0, Errors: 0, Skipped: 0, Time elapsed: 0.004 sec - in com.carrotsearch.randomizedtesting.generators.TestRandomPicks
27-Oct-2015 13:44:38 Running com.carrotsearch.randomizedtesting.generators.TestUnicodeGenerator
27-Oct-2015 13:44:38 Tests run: 41, Failures: 0, Errors: 0, Skipped: 0, Time elapsed: 0.036 sec - in com.carrotsearch.randomizedtesting.generators.TestUnicodeGenerator
27-Oct-2015 13:44:38 Running com.carrotsearch.randomizedtesting.generators.TestCodepointSetGenerator
27-Oct-2015 13:44:38 Tests run: 127, Failures: 0, Errors: 0, Skipped: 0, Time elapsed: 0.157 sec - in com.carrotsearch.randomizedtesting.generators.TestCodepointSetGenerator
27-Oct-2015 13:44:38 Running com.carrotsearch.randomizedtesting.generators.TestRealisticUnicodeGenerator
27-Oct-2015 13:44:38 Tests run: 41, Failures: 0, Errors: 0, Skipped: 0, Time elapsed: 0.042 sec - in com.carrotsearch.randomizedtesting.generators.TestRealisticUnicodeGenerator
27-Oct-2015 13:44:38 Running com.carrotsearch.randomizedtesting.TestIgnoredRunCount
27-Oct-2015 13:44:38 Tests run: 1, Failures: 0, Errors: 0, Skipped: 0, Time elapsed: 0 sec - in com.carrotsearch.randomizedtesting.TestIgnoredRunCount
27-Oct-2015 13:44:38 Running com.carrotsearch.randomizedtesting.TestTestGroups
27-Oct-2015 13:44:38 Tests run: 4, Failures: 0, Errors: 0, Skipped: 0, Time elapsed: 0.042 sec - in com.carrotsearch.randomizedtesting.TestTestGroups
27-Oct-2015 13:44:38 Running com.carrotsearch.randomizedtesting.TestFormattingRandomSeeds
27-Oct-2015 13:44:39 Tests run: 1003, Failures: 0, Errors: 0, Skipped: 0, Time elapsed: 0.724 sec - in com.carrotsearch.randomizedtesting.TestFormattingRandomSeeds
27-Oct-2015 13:44:39 Running com.carrotsearch.randomizedtesting.TestUncaughtExceptionsDuplicated
27-Oct-2015 13:44:39 Tests run: 3, Failures: 0, Errors: 0, Skipped: 0, Time elapsed: 0.007 sec - in com.carrotsearch.randomizedtesting.TestUncaughtExceptionsDuplicated
27-Oct-2015 13:44:39 Running com.carrotsearch.randomizedtesting.TestHookMethodOrderWithExceptions
27-Oct-2015 13:44:39 Tests run: 20, Failures: 0, Errors: 0, Skipped: 0, Time elapsed: 0.076 sec - in com.carrotsearch.randomizedtesting.TestHookMethodOrderWithExceptions
27-Oct-2015 13:44:39 Running com.carrotsearch.randomizedtesting.TestRandomizedContext
27-Oct-2015 13:44:39 Tests run: 1, Failures: 0, Errors: 0, Skipped: 0, Time elapsed: 0.021 sec - in com.carrotsearch.randomizedtesting.TestRandomizedContext
27-Oct-2015 13:44:39 Running com.carrotsearch.randomizedtesting.TestRandomizedTest
27-Oct-2015 13:44:40 Tests run: 19, Failures: 0, Errors: 0, Skipped: 0, Time elapsed: 0.325 sec - in com.carrotsearch.randomizedtesting.TestRandomizedTest
27-Oct-2015 13:44:40 Running com.carrotsearch.randomizedtesting.TestStackAugmentation
27-Oct-2015 13:44:40 Tests run: 3, Failures: 0, Errors: 0, Skipped: 0, Time elapsed: 0.019 sec - in com.carrotsearch.randomizedtesting.TestStackAugmentation
27-Oct-2015 13:44:40 Running com.carrotsearch.randomizedtesting.TestSeedFixingWithProperties
27-Oct-2015 13:44:40 Tests run: 2, Failures: 0, Errors: 0, Skipped: 0, Time elapsed: 0.013 sec - in com.carrotsearch.randomizedtesting.TestSeedFixingWithProperties
27-Oct-2015 13:44:40 Running com.carrotsearch.randomizedtesting.TestFilteringWarnings
27-Oct-2015 13:44:40 Tests run: 4, Failures: 0, Errors: 0, Skipped: 0, Time elapsed: 0.033 sec - in com.carrotsearch.randomizedtesting.TestFilteringWarnings
27-Oct-2015 13:44:40 Running com.carrotsearch.randomizedtesting.TestOutOfScopeRandomUse
27-Oct-2015 13:44:40 Tests run: 2, Failures: 0, Errors: 0, Skipped: 0, Time elapsed: 0.035 sec - in com.carrotsearch.randomizedtesting.TestOutOfScopeRandomUse
27-Oct-2015 13:44:40 Running com.carrotsearch.randomizedtesting.TestRepeatTestWithComplexDescription
27-Oct-2015 13:44:40 Tests run: 1, Failures: 0, Errors: 0, Skipped: 0, Time elapsed: 0.663 sec - in com.carrotsearch.randomizedtesting.TestRepeatTestWithComplexDescription
27-Oct-2015 13:44:40 Running com.carrotsearch.randomizedtesting.TestInstantiationTime
27-Oct-2015 13:44:40 Tests run: 1, Failures: 0, Errors: 0, Skipped: 0, Time elapsed: 0.003 sec - in com.carrotsearch.randomizedtesting.TestInstantiationTime
27-Oct-2015 13:44:40 Running com.carrotsearch.randomizedtesting.TestClassMethodFiltering
27-Oct-2015 13:44:41 Tests run: 5, Failures: 0, Errors: 0, Skipped: 0, Time elapsed: 0.033 sec - in com.carrotsearch.randomizedtesting.TestClassMethodFiltering
27-Oct-2015 13:44:41
27-Oct-2015 13:44:41 Results :
27-Oct-2015 13:44:41
27-Oct-2015 13:44:41 Tests run: 1442, Failures: 0, Errors: 0, Skipped: 1
27-Oct-2015 13:44:41
27-Oct-2015 13:44:41 [INFO]
27-Oct-2015 13:44:41 [INFO] --- maven-jar-plugin:2.6:jar (default-jar) @ randomizedtesting-runner ---
27-Oct-2015 13:44:41 [INFO] Building jar: /mnt/work/bamboo-home/xml-data/build-dir/RNDTEST-SOFTWARE-IBM17/randomized-runner/target/randomizedtesting-runner-2.2.0-SNAPSHOT.jar
27-Oct-2015 13:44:41 [INFO]                                                                         
27-Oct-2015 13:44:41 [INFO] ------------------------------------------------------------------------
27-Oct-2015 13:44:41 [INFO] Building RandomizedTesting JUnit4 ANT Task 2.2.0-SNAPSHOT
27-Oct-2015 13:44:41 [INFO] ------------------------------------------------------------------------
27-Oct-2015 13:44:41 [INFO]
27-Oct-2015 13:44:41 [INFO] --- maven-clean-plugin:2.6.1:clean (default-clean) @ junit4-ant ---
27-Oct-2015 13:44:41 [INFO] Deleting /mnt/work/bamboo-home/xml-data/build-dir/RNDTEST-SOFTWARE-IBM17/junit4-ant/target (includes = [], excludes = [eclipse/**, idea/**])
27-Oct-2015 13:44:41 [INFO]
27-Oct-2015 13:44:41 [INFO] --- maven-resources-plugin:2.7:resources (default-resources) @ junit4-ant ---
27-Oct-2015 13:44:41 [INFO] Using 'UTF-8' encoding to copy filtered resources.
27-Oct-2015 13:44:41 [INFO] Copying 15 resources
27-Oct-2015 13:44:41 [INFO]
27-Oct-2015 13:44:41 [INFO] --- maven-compiler-plugin:3.3:compile (default-compile) @ junit4-ant ---
27-Oct-2015 13:44:41 [INFO] Changes detected - recompiling the module!
27-Oct-2015 13:44:41 [INFO] Compiling 94 source files to /mnt/work/bamboo-home/xml-data/build-dir/RNDTEST-SOFTWARE-IBM17/junit4-ant/target/classes
27-Oct-2015 13:44:42 [INFO] /mnt/work/bamboo-home/xml-data/build-dir/RNDTEST-SOFTWARE-IBM17/junit4-ant/src/main/java/com/carrotsearch/ant/tasks/junit4/DuplicateResources.java: /mnt/work/bamboo-home/xml-data/build-dir/RNDTEST-SOFTWARE-IBM17/junit4-ant/src/main/java/com/carrotsearch/ant/tasks/junit4/DuplicateResources.java uses unchecked or unsafe operations.
27-Oct-2015 13:44:42 [INFO] /mnt/work/bamboo-home/xml-data/build-dir/RNDTEST-SOFTWARE-IBM17/junit4-ant/src/main/java/com/carrotsearch/ant/tasks/junit4/DuplicateResources.java: Recompile with -Xlint:unchecked for details.
27-Oct-2015 13:44:42 [INFO]
27-Oct-2015 13:44:42 [INFO] --- maven-resources-plugin:2.7:testResources (default-testResources) @ junit4-ant ---
27-Oct-2015 13:44:42 [INFO] Using 'UTF-8' encoding to copy filtered resources.
27-Oct-2015 13:44:42 [INFO] Copying 2 resources
27-Oct-2015 13:44:42 [INFO]
27-Oct-2015 13:44:42 [INFO] --- maven-compiler-plugin:3.3:testCompile (default-testCompile) @ junit4-ant ---
27-Oct-2015 13:44:42 [INFO] Changes detected - recompiling the module!
27-Oct-2015 13:44:42 [INFO] Compiling 99 source files to /mnt/work/bamboo-home/xml-data/build-dir/RNDTEST-SOFTWARE-IBM17/junit4-ant/target/test-classes
27-Oct-2015 13:44:43 [INFO]
27-Oct-2015 13:44:43 [INFO] --- maven-surefire-plugin:2.18.1:test (default-test) @ junit4-ant ---
27-Oct-2015 13:44:43 [INFO] Surefire report directory: /mnt/work/bamboo-home/xml-data/build-dir/RNDTEST-SOFTWARE-IBM17/junit4-ant/target/surefire-reports
27-Oct-2015 13:44:43
27-Oct-2015 13:44:43 -------------------------------------------------------
27-Oct-2015 13:44:43 T E S T S
27-Oct-2015 13:44:43 -------------------------------------------------------
27-Oct-2015 13:44:44 Running com.carrotsearch.ant.tasks.junit4.TestJsonByteArrayRoundtrip
27-Oct-2015 13:44:44 Tests run: 101, Failures: 0, Errors: 0, Skipped: 0, Time elapsed: 0.377 sec - in com.carrotsearch.ant.tasks.junit4.TestJsonByteArrayRoundtrip
27-Oct-2015 13:44:44 Running com.carrotsearch.ant.tasks.junit4.TestXmlStringsRoundtrip
27-Oct-2015 13:44:45 Tests run: 101, Failures: 0, Errors: 0, Skipped: 0, Time elapsed: 0.66 sec - in com.carrotsearch.ant.tasks.junit4.TestXmlStringsRoundtrip
27-Oct-2015 13:44:45 Running com.carrotsearch.ant.tasks.junit4.TestEventBusSanityCheck
27-Oct-2015 13:44:46 Tests run: 100, Failures: 0, Errors: 0, Skipped: 0, Time elapsed: 1.401 sec - in com.carrotsearch.ant.tasks.junit4.TestEventBusSanityCheck
27-Oct-2015 13:44:46 Running com.carrotsearch.ant.tasks.junit4.events.TestRemoteEventSerialization
27-Oct-2015 13:44:46 Tests run: 13, Failures: 0, Errors: 0, Skipped: 0, Time elapsed: 0.053 sec - in com.carrotsearch.ant.tasks.junit4.events.TestRemoteEventSerialization
27-Oct-2015 13:44:46 Running com.carrotsearch.ant.tasks.junit4.events.TestRemoteEventSerialization$Clazz1
27-Oct-2015 13:44:46 Tests run: 0, Failures: 0, Errors: 0, Skipped: 0, Time elapsed: 0 sec - in com.carrotsearch.ant.tasks.junit4.events.TestRemoteEventSerialization$Clazz1
27-Oct-2015 13:44:46
27-Oct-2015 13:44:46 Results :
27-Oct-2015 13:44:46
27-Oct-2015 13:44:46 Tests run: 315, Failures: 0, Errors: 0, Skipped: 0
27-Oct-2015 13:44:46
27-Oct-2015 13:44:46 [INFO]
27-Oct-2015 13:44:46 [INFO] --- maven-jar-plugin:2.6:jar (default-jar) @ junit4-ant ---
27-Oct-2015 13:44:46 [INFO] Building jar: /mnt/work/bamboo-home/xml-data/build-dir/RNDTEST-SOFTWARE-IBM17/junit4-ant/target/junit4-ant-2.2.0-SNAPSHOT.jar
27-Oct-2015 13:44:46 [INFO]
27-Oct-2015 13:44:46 [INFO] --- maven-dependency-plugin:2.10:copy-dependencies (copy-dependencies) @ junit4-ant ---
27-Oct-2015 13:44:47 [INFO] Copying asm-5.0.4.jar to /mnt/work/bamboo-home/xml-data/build-dir/RNDTEST-SOFTWARE-IBM17/junit4-ant/target/dependency/asm-5.0.4.jar
27-Oct-2015 13:44:47 [INFO] Copying randomizedtesting-runner-2.2.0-SNAPSHOT.jar to /mnt/work/bamboo-home/xml-data/build-dir/RNDTEST-SOFTWARE-IBM17/junit4-ant/target/dependency/randomizedtesting-runner-2.2.0-SNAPSHOT.jar
27-Oct-2015 13:44:47 [INFO] Copying junit-4.10.jar to /mnt/work/bamboo-home/xml-data/build-dir/RNDTEST-SOFTWARE-IBM17/junit4-ant/target/dependency/junit-4.10.jar
27-Oct-2015 13:44:47 [INFO]
27-Oct-2015 13:44:47 [INFO] --- proguard-maven-plugin:2.0.4:proguard (default) @ junit4-ant ---
27-Oct-2015 13:44:47 [INFO] execute ProGuard [-injars, '/mnt/work/bamboo-home/.m2/AGENT-1146882/repository/com/google/guava/guava/16.0.1/guava-16.0.1.jar'(!META-INF/MANIFEST.MF,!com/google/common/eventbus/SynchronizedEventHandler.class), -injars, '/mnt/work/bamboo-home/.m2/AGENT-1146882/repository/org/ow2/asm/asm/5.0.4/asm-5.0.4.jar'(!META-INF/MANIFEST.MF), -injars, '/mnt/work/bamboo-home/.m2/AGENT-1146882/repository/org/simpleframework/simple-xml/2.7.1/simple-xml-2.7.1.jar'(!META-INF/MANIFEST.MF), -injars, '/mnt/work/bamboo-home/xml-data/build-dir/RNDTEST-SOFTWARE-IBM17/randomized-runner/target/randomizedtesting-runner-2.2.0-SNAPSHOT.jar'(!META-INF/MANIFEST.MF), -injars, '/mnt/work/bamboo-home/xml-data/build-dir/RNDTEST-SOFTWARE-IBM17/junit4-ant/target/junit4-ant-2.2.0-SNAPSHOT_proguard_base.jar', -outjars, '/mnt/work/bamboo-home/xml-data/build-dir/RNDTEST-SOFTWARE-IBM17/junit4-ant/target/junit4-ant-2.2.0-SNAPSHOT.jar', -include, '/mnt/work/bamboo-home/xml-data/build-dir/RNDTEST-SOFTWARE-IBM17/junit4-ant/src/proguard/rules.pro', -libraryjars, '/mnt/work/bamboo-home/.m2/AGENT-1146882/repository/org/apache/ant/ant/1.9.4/ant-1.9.4.jar', -libraryjars, '/mnt/work/bamboo-home/.m2/AGENT-1146882/repository/org/apache/ant/ant-launcher/1.9.4/ant-launcher-1.9.4.jar', -libraryjars, '/mnt/work/bamboo-home/.m2/AGENT-1146882/repository/org/apache/ant/ant-junit/1.9.4/ant-junit-1.9.4.jar', -libraryjars, '/mnt/work/bamboo-home/.m2/AGENT-1146882/repository/junit/junit/4.10/junit-4.10.jar', -libraryjars, '/mnt/work/bamboo-home/.m2/AGENT-1146882/repository/stax/stax-api/1.0.1/stax-api-1.0.1.jar', -libraryjars, '/mnt/work/bamboo-home/.m2/AGENT-1146882/repository/stax/stax/1.2.0/stax-1.2.0.jar', -libraryjars, '/mnt/work/bamboo-home/.m2/AGENT-1146882/repository/xpp3/xpp3/1.1.3.3/xpp3-1.1.3.3.jar', -libraryjars, '/usr/lib/jvm/jvms-linux/ibm-jdk1.8.0-20150417/jre/lib/rt.jar', -printmapping, '/mnt/work/bamboo-home/xml-data/build-dir/RNDTEST-SOFTWARE-IBM17/junit4-ant/target/proguard_map.txt', -printseeds, '/mnt/work/bamboo-home/xml-data/build-dir/RNDTEST-SOFTWARE-IBM17/junit4-ant/target/proguard_seeds.txt', -printusage /mnt/work/bamboo-home/xml-data/build-dir/RNDTEST-SOFTWARE-IBM17/junit4-ant/target/proguard_dead.txt]
27-Oct-2015 13:44:47 [INFO] proguard jar: /mnt/work/bamboo-home/xml-data/build-dir/RNDTEST-SOFTWARE-IBM17/junit4-ant/lib/proguard.jar
27-Oct-2015 13:44:47 [proguard] ProGuard, version 5.2
27-Oct-2015 13:44:47 [proguard] Reading program jar [/mnt/work/bamboo-home/.m2/AGENT-1146882/repository/com/google/guava/guava/16.0.1/guava-16.0.1.jar] (filtered)
27-Oct-2015 13:44:47 [proguard] Reading program jar [/mnt/work/bamboo-home/.m2/AGENT-1146882/repository/org/ow2/asm/asm/5.0.4/asm-5.0.4.jar] (filtered)
27-Oct-2015 13:44:47 [proguard] Reading program jar [/mnt/work/bamboo-home/.m2/AGENT-1146882/repository/org/simpleframework/simple-xml/2.7.1/simple-xml-2.7.1.jar] (filtered)
27-Oct-2015 13:44:47 [proguard] Reading program jar [/mnt/work/bamboo-home/xml-data/build-dir/RNDTEST-SOFTWARE-IBM17/randomized-runner/target/randomizedtesting-runner-2.2.0-SNAPSHOT.jar] (filtered)
27-Oct-2015 13:44:48 [proguard] Reading program jar [/mnt/work/bamboo-home/xml-data/build-dir/RNDTEST-SOFTWARE-IBM17/junit4-ant/target/junit4-ant-2.2.0-SNAPSHOT_proguard_base.jar]
27-Oct-2015 13:44:48 [proguard] Reading library jar [/mnt/work/bamboo-home/.m2/AGENT-1146882/repository/org/apache/ant/ant/1.9.4/ant-1.9.4.jar]
27-Oct-2015 13:44:48 [proguard] Reading library jar [/mnt/work/bamboo-home/.m2/AGENT-1146882/repository/org/apache/ant/ant-launcher/1.9.4/ant-launcher-1.9.4.jar]
27-Oct-2015 13:44:48 [proguard] Reading library jar [/mnt/work/bamboo-home/.m2/AGENT-1146882/repository/org/apache/ant/ant-junit/1.9.4/ant-junit-1.9.4.jar]
27-Oct-2015 13:44:48 [proguard] Reading library jar [/mnt/work/bamboo-home/.m2/AGENT-1146882/repository/junit/junit/4.10/junit-4.10.jar]
27-Oct-2015 13:44:48 [proguard] Reading library jar [/mnt/work/bamboo-home/.m2/AGENT-1146882/repository/stax/stax-api/1.0.1/stax-api-1.0.1.jar]
27-Oct-2015 13:44:48 [proguard] Reading library jar [/mnt/work/bamboo-home/.m2/AGENT-1146882/repository/stax/stax/1.2.0/stax-1.2.0.jar]
27-Oct-2015 13:44:48 [proguard] Reading library jar [/mnt/work/bamboo-home/.m2/AGENT-1146882/repository/xpp3/xpp3/1.1.3.3/xpp3-1.1.3.3.jar]
27-Oct-2015 13:44:48 [proguard] Reading library jar [/usr/lib/jvm/jvms-linux/ibm-jdk1.8.0-20150417/jre/lib/rt.jar]
27-Oct-2015 13:44:52 [proguard] Unexpected error while performing partial evaluation:
27-Oct-2015 13:44:52 [proguard]   Class       = [com/carrotsearch/ant/tasks/junit4/JUnit4]
27-Oct-2015 13:44:52 [proguard]   Method      = [execute()V]
27-Oct-2015 13:44:52 [proguard]   Exception   = [java.lang.IllegalArgumentException] (Can't find common super class of [org/apache/tools/ant/Project] (with 1 known super classes) and [java/util/ArrayList] (with 3 known super classes))
27-Oct-2015 13:44:52 [proguard] Unexpected error while preverifying:
27-Oct-2015 13:44:52 [proguard]   Class       = [com/carrotsearch/ant/tasks/junit4/JUnit4]
27-Oct-2015 13:44:52 [proguard]   Method      = [execute()V]
27-Oct-2015 13:44:52 [proguard]   Exception   = [java.lang.IllegalArgumentException] (Can't find common super class of [org/apache/tools/ant/Project] (with 1 known super classes) and [java/util/ArrayList] (with 3 known super classes))
27-Oct-2015 13:44:52 [proguard] Error: Can't find common super class of [org/apache/tools/ant/Project] (with 1 known super classes) and [java/util/ArrayList] (with 3 known super classes)
27-Oct-2015 13:44:52 [INFO] ------------------------------------------------------------------------
27-Oct-2015 13:44:52 [INFO] Reactor Summary:
27-Oct-2015 13:44:52 [INFO]
27-Oct-2015 13:44:52 [INFO] RandomizedTesting Parent POM ....................... SUCCESS [  0.203 s]
27-Oct-2015 13:44:52 [INFO] RandomizedTesting Randomized Runner ................ SUCCESS [ 46.968 s]
27-Oct-2015 13:44:52 [INFO] RandomizedTesting JUnit4 ANT Task .................. FAILURE [ 10.397 s]
27-Oct-2015 13:44:52 [INFO] RandomizedTesting JUnit4 Maven Plugin .............. SKIPPED
27-Oct-2015 13:44:52 [INFO] RandomizedTesting JUnit4 Maven Plugin Tests ........ SKIPPED
27-Oct-2015 13:44:52 [INFO] RandomizedTesting Examples ......................... SKIPPED
27-Oct-2015 13:44:52 [INFO] RandomizedTesting ANT Examples ..................... SKIPPED
27-Oct-2015 13:44:52 [INFO] RandomizedTesting Security Manager Example ......... SKIPPED
27-Oct-2015 13:44:52 [INFO] ------------------------------------------------------------------------
27-Oct-2015 13:44:52 [INFO] BUILD FAILURE
27-Oct-2015 13:44:52 [INFO] ------------------------------------------------------------------------
27-Oct-2015 13:44:52 [INFO] Total time: 57.987 s
27-Oct-2015 13:44:52 [INFO] Finished at: 2015-10-27T13:44:52+01:00
27-Oct-2015 13:44:52 [INFO] Final Memory: 30M/51M
27-Oct-2015 13:44:52 [INFO] ------------------------------------------------------------------------
27-Oct-2015 13:44:52 [ERROR] Failed to execute goal com.pyx4me:proguard-maven-plugin:2.0.4:proguard (default) on project junit4-ant: Obfuscation failed (result=1) -> [Help 1]
27-Oct-2015 13:44:52 [ERROR]
27-Oct-2015 13:44:52 [ERROR] To see the full stack trace of the errors, re-run Maven with the -e switch.
27-Oct-2015 13:44:52 [ERROR] Re-run Maven using the -X switch to enable full debug logging.
27-Oct-2015 13:44:52 [ERROR]
27-Oct-2015 13:44:52 [ERROR] For more information about the errors and possible solutions, please read the following articles:
27-Oct-2015 13:44:52 [ERROR] [Help 1] http://cwiki.apache.org/confluence/display/MAVEN/MojoExecutionException
27-Oct-2015 13:44:52 [ERROR]
27-Oct-2015 13:44:52 [ERROR] After correcting the problems, you can resume the build with the command
27-Oct-2015 13:44:52 [ERROR]   mvn <goals> -rf :junit4-ant
27-Oct-2015 13:44:52 Failing task since return code of [/home/bamboo/tools/apache-maven-3.2.5/bin/mvn --batch-mode -Djava.io.tmpdir=/home/bamboo/bamboo-software/temp/RNDTEST-SOFTWARE-IBM17 -Dmaven.repo.local=/mnt/work/bamboo-home/.m2/AGENT-1146882/repository clean verify] was 1 while expected 0
27-Oct-2015 13:44:52 Parsing test results under /mnt/work/bamboo-home/xml-data/build-dir/RNDTEST-SOFTWARE-IBM17...
27-Oct-2015 13:44:52 Finished task 'Maven 3.x' with result: Failed
27-Oct-2015 13:44:52 Running post build plugin 'Clover Results Collector'
27-Oct-2015 13:44:52 Running post build plugin 'Artifact Copier'
27-Oct-2015 13:44:52 Running post build plugin 'Docker Container Cleanup'
27-Oct-2015 13:44:52 Running post build plugin 'NCover Results Collector'
27-Oct-2015 13:44:52 Running post build plugin 'npm Cache Cleanup'
27-Oct-2015 13:44:52 Finalising the build...
27-Oct-2015 13:44:52 Stopping timer.
27-Oct-2015 13:44:52 Build RNDTEST-SOFTWARE-IBM17-84 completed.
27-Oct-2015 13:44:52 Running on server: post build plugin 'Clover Delta Calculator'
27-Oct-2015 13:44:52 Running on server: post build plugin 'Build Hanging Detection Configuration'
27-Oct-2015 13:44:52 Running on server: post build plugin 'NCover Results Collector'
27-Oct-2015 13:44:52 Running on server: post build plugin 'Maven Dependencies Postprocessor'
27-Oct-2015 13:44:52 All post build plugins have finished
27-Oct-2015 13:44:52 Generating build results summary...
27-Oct-2015 13:44:54 Saving build results to disk...
27-Oct-2015 13:44:54 Logging substituted variables...
27-Oct-2015 13:44:54 Indexing build results...
27-Oct-2015 13:44:54 Finished building RNDTEST-SOFTWARE-IBM17-84.