Build #225

Build: #225 failed

Job: JDK 11 J9 failed

Stages & jobs

  1. Compile and test

  2. Package

Build log

The build generated 3,674 lines of output.The output is too long and has been truncated to the last 1,000 lines. Download or view full build log

20-Nov-2018 10:01:07 Run started.
20-Nov-2018 10:01:07 Assumpt.: com.carrotsearch.randomizedtesting.timeouts.Test010Zombies$Nested: Leaked background threads present (zombies).
20-Nov-2018 10:01:07 Ignored : testMethod
20-Nov-2018 10:01:07 Run finished: run=0, ignored=1, failures=0, assumptions=1
20-Nov-2018 10:01:07
20-Nov-2018 10:01:07 Run started.
20-Nov-2018 10:01:07 Assumpt.: com.carrotsearch.randomizedtesting.timeouts.Test010Zombies$Nested: Leaked background threads present (zombies).
20-Nov-2018 10:01:07 Ignored : testMethod
20-Nov-2018 10:01:07 Run finished: run=0, ignored=1, failures=0, assumptions=1
20-Nov-2018 10:01:07
20-Nov-2018 10:01:07 Run started.
20-Nov-2018 10:01:07 Assumpt.: com.carrotsearch.randomizedtesting.timeouts.Test010Zombies$Nested: Leaked background threads present (zombies).
20-Nov-2018 10:01:07 Ignored : testMethod
20-Nov-2018 10:01:07 Run finished: run=0, ignored=1, failures=0, assumptions=1
20-Nov-2018 10:01:07
20-Nov-2018 10:01:07 Run started.
20-Nov-2018 10:01:07 Assumpt.: com.carrotsearch.randomizedtesting.timeouts.Test010Zombies$Nested: Leaked background threads present (zombies).
20-Nov-2018 10:01:07 Ignored : testMethod
20-Nov-2018 10:01:07 Run finished: run=0, ignored=1, failures=0, assumptions=1
20-Nov-2018 10:01:07
20-Nov-2018 10:01:07 Run started.
20-Nov-2018 10:01:07 Assumpt.: com.carrotsearch.randomizedtesting.timeouts.Test010Zombies$Nested: Leaked background threads present (zombies).
20-Nov-2018 10:01:07 Ignored : testMethod
20-Nov-2018 10:01:07 Run finished: run=0, ignored=1, failures=0, assumptions=1
20-Nov-2018 10:01:07
20-Nov-2018 10:01:07 Run started.
20-Nov-2018 10:01:07 Assumpt.: com.carrotsearch.randomizedtesting.timeouts.Test010Zombies$Nested: Leaked background threads present (zombies).
20-Nov-2018 10:01:07 Ignored : testMethod
20-Nov-2018 10:01:07 Run finished: run=0, ignored=1, failures=0, assumptions=1
20-Nov-2018 10:01:07
20-Nov-2018 10:01:07 Run started.
20-Nov-2018 10:01:07 Started : testMethod
20-Nov-2018 10:01:07 Finished: testMethod
20-Nov-2018 10:01:07 Failure : com.carrotsearch.randomizedtesting.timeouts.Test010Zombies$Nested: 1 thread leaked from SUITE scope at com.carrotsearch.randomizedtesting.timeouts.Test010Zombies$Nested:
20-Nov-2018 10:01:07    1) Thread[id=5793, name=foobarZombie, state=TIMED_WAITING, group=TGRP-Test010Zombies$Nested]
20-Nov-2018 10:01:07         at java.lang.Thread.sleep(Native Method)
20-Nov-2018 10:01:07         at java.lang.Thread.sleep(Thread.java:909)
20-Nov-2018 10:01:07         at com.carrotsearch.randomizedtesting.WithNestedTestClass$3.run(WithNestedTestClass.java:252)
20-Nov-2018 10:01:07 Failure : com.carrotsearch.randomizedtesting.timeouts.Test010Zombies$Nested: There are still zombie threads that couldn't be terminated:
20-Nov-2018 10:01:07    1) Thread[id=5793, name=foobarZombie, state=TIMED_WAITING, group=TGRP-Test010Zombies$Nested]
20-Nov-2018 10:01:07         at java.lang.Thread.sleep(Native Method)
20-Nov-2018 10:01:07         at java.lang.Thread.sleep(Thread.java:909)
20-Nov-2018 10:01:07         at com.carrotsearch.randomizedtesting.WithNestedTestClass$3.run(WithNestedTestClass.java:252)
20-Nov-2018 10:01:07 Run finished: run=1, ignored=0, failures=2, assumptions=0
20-Nov-2018 10:01:07
20-Nov-2018 10:01:07 Run started.
20-Nov-2018 10:01:07 Assumpt.: com.carrotsearch.randomizedtesting.timeouts.Test010Zombies$Nested: Leaked background threads present (zombies).
20-Nov-2018 10:01:07 Ignored : testMethod
20-Nov-2018 10:01:07 Run finished: run=0, ignored=1, failures=0, assumptions=1
20-Nov-2018 10:01:07
20-Nov-2018 10:01:07 Run started.
20-Nov-2018 10:01:07 Assumpt.: com.carrotsearch.randomizedtesting.timeouts.Test010Zombies$Nested: Leaked background threads present (zombies).
20-Nov-2018 10:01:07 Ignored : testMethod
20-Nov-2018 10:01:07 Run finished: run=0, ignored=1, failures=0, assumptions=1
20-Nov-2018 10:01:07
20-Nov-2018 10:01:07 Run started.
20-Nov-2018 10:01:07 Assumpt.: com.carrotsearch.randomizedtesting.timeouts.Test010Zombies$Nested: Leaked background threads present (zombies).
20-Nov-2018 10:01:07 Ignored : testMethod
20-Nov-2018 10:01:07 Run finished: run=0, ignored=1, failures=0, assumptions=1
20-Nov-2018 10:01:07
20-Nov-2018 10:01:07 Run started.
20-Nov-2018 10:01:07 Assumpt.: com.carrotsearch.randomizedtesting.timeouts.Test010Zombies$Nested: Leaked background threads present (zombies).
20-Nov-2018 10:01:07 Ignored : testMethod
20-Nov-2018 10:01:07 Run finished: run=0, ignored=1, failures=0, assumptions=1
20-Nov-2018 10:01:07
20-Nov-2018 10:01:07 Run started.
20-Nov-2018 10:01:07 Assumpt.: com.carrotsearch.randomizedtesting.timeouts.Test010Zombies$Nested: Leaked background threads present (zombies).
20-Nov-2018 10:01:07 Ignored : testMethod
20-Nov-2018 10:01:07 Run finished: run=0, ignored=1, failures=0, assumptions=1
20-Nov-2018 10:01:07
20-Nov-2018 10:01:07 Run started.
20-Nov-2018 10:01:07 Assumpt.: com.carrotsearch.randomizedtesting.timeouts.Test010Zombies$Nested: Leaked background threads present (zombies).
20-Nov-2018 10:01:07 Ignored : testMethod
20-Nov-2018 10:01:07 Run finished: run=0, ignored=1, failures=0, assumptions=1
20-Nov-2018 10:01:07
20-Nov-2018 10:01:07 Run started.
20-Nov-2018 10:01:07 Assumpt.: com.carrotsearch.randomizedtesting.timeouts.Test010Zombies$Nested: Leaked background threads present (zombies).
20-Nov-2018 10:01:07 Ignored : testMethod
20-Nov-2018 10:01:07 Run finished: run=0, ignored=1, failures=0, assumptions=1
20-Nov-2018 10:01:07
20-Nov-2018 10:01:07 Run started.
20-Nov-2018 10:01:07 Assumpt.: com.carrotsearch.randomizedtesting.timeouts.Test010Zombies$Nested: Leaked background threads present (zombies).
20-Nov-2018 10:01:07 Ignored : testMethod
20-Nov-2018 10:01:07 Run finished: run=0, ignored=1, failures=0, assumptions=1
20-Nov-2018 10:01:07
20-Nov-2018 10:01:07 Run started.
20-Nov-2018 10:01:07 Started : testMethod
20-Nov-2018 10:01:07 Finished: testMethod
20-Nov-2018 10:01:07 Failure : com.carrotsearch.randomizedtesting.timeouts.Test010Zombies$Nested: 1 thread leaked from SUITE scope at com.carrotsearch.randomizedtesting.timeouts.Test010Zombies$Nested:
20-Nov-2018 10:01:07    1) Thread[id=5812, name=foobarZombie, state=TIMED_WAITING, group=TGRP-Test010Zombies$Nested]
20-Nov-2018 10:01:07         at java.lang.Thread.sleep(Native Method)
20-Nov-2018 10:01:07         at java.lang.Thread.sleep(Thread.java:909)
20-Nov-2018 10:01:07         at com.carrotsearch.randomizedtesting.WithNestedTestClass$3.run(WithNestedTestClass.java:252)
20-Nov-2018 10:01:07 Failure : com.carrotsearch.randomizedtesting.timeouts.Test010Zombies$Nested: There are still zombie threads that couldn't be terminated:
20-Nov-2018 10:01:07    1) Thread[id=5812, name=foobarZombie, state=TIMED_WAITING, group=TGRP-Test010Zombies$Nested]
20-Nov-2018 10:01:07         at java.lang.Thread.sleep(Native Method)
20-Nov-2018 10:01:07         at java.lang.Thread.sleep(Thread.java:909)
20-Nov-2018 10:01:07         at com.carrotsearch.randomizedtesting.WithNestedTestClass$3.run(WithNestedTestClass.java:252)
20-Nov-2018 10:01:07 Run finished: run=1, ignored=0, failures=2, assumptions=0
20-Nov-2018 10:01:07
20-Nov-2018 10:01:07 Run started.
20-Nov-2018 10:01:07 Assumpt.: com.carrotsearch.randomizedtesting.timeouts.Test010Zombies$Nested: Leaked background threads present (zombies).
20-Nov-2018 10:01:07 Ignored : testMethod
20-Nov-2018 10:01:07 Run finished: run=0, ignored=1, failures=0, assumptions=1
20-Nov-2018 10:01:07
20-Nov-2018 10:01:07 Run started.
20-Nov-2018 10:01:07 Assumpt.: com.carrotsearch.randomizedtesting.timeouts.Test010Zombies$Nested: Leaked background threads present (zombies).
20-Nov-2018 10:01:07 Ignored : testMethod
20-Nov-2018 10:01:07 Run finished: run=0, ignored=1, failures=0, assumptions=1
20-Nov-2018 10:01:07
20-Nov-2018 10:01:07 Run started.
20-Nov-2018 10:01:07 Assumpt.: com.carrotsearch.randomizedtesting.timeouts.Test010Zombies$Nested: Leaked background threads present (zombies).
20-Nov-2018 10:01:07 Ignored : testMethod
20-Nov-2018 10:01:07 Run finished: run=0, ignored=1, failures=0, assumptions=1
20-Nov-2018 10:01:07
20-Nov-2018 10:01:07 Run started.
20-Nov-2018 10:01:07 Assumpt.: com.carrotsearch.randomizedtesting.timeouts.Test010Zombies$Nested: Leaked background threads present (zombies).
20-Nov-2018 10:01:07 Ignored : testMethod
20-Nov-2018 10:01:07 Run finished: run=0, ignored=1, failures=0, assumptions=1
20-Nov-2018 10:01:07
20-Nov-2018 10:01:07 Run started.
20-Nov-2018 10:01:07 Assumpt.: com.carrotsearch.randomizedtesting.timeouts.Test010Zombies$Nested: Leaked background threads present (zombies).
20-Nov-2018 10:01:07 Ignored : testMethod
20-Nov-2018 10:01:07 Run finished: run=0, ignored=1, failures=0, assumptions=1
20-Nov-2018 10:01:07
20-Nov-2018 10:01:07 Run started.
20-Nov-2018 10:01:07 Assumpt.: com.carrotsearch.randomizedtesting.timeouts.Test010Zombies$Nested: Leaked background threads present (zombies).
20-Nov-2018 10:01:07 Ignored : testMethod
20-Nov-2018 10:01:07 Run finished: run=0, ignored=1, failures=0, assumptions=1
20-Nov-2018 10:01:07
20-Nov-2018 10:01:07 Run started.
20-Nov-2018 10:01:07 Assumpt.: com.carrotsearch.randomizedtesting.timeouts.Test010Zombies$Nested: Leaked background threads present (zombies).
20-Nov-2018 10:01:07 Ignored : testMethod
20-Nov-2018 10:01:07 Run finished: run=0, ignored=1, failures=0, assumptions=1
20-Nov-2018 10:01:07
20-Nov-2018 10:01:07 Run started.
20-Nov-2018 10:01:07 Assumpt.: com.carrotsearch.randomizedtesting.timeouts.Test010Zombies$Nested: Leaked background threads present (zombies).
20-Nov-2018 10:01:07 Ignored : testMethod
20-Nov-2018 10:01:07 Run finished: run=0, ignored=1, failures=0, assumptions=1
20-Nov-2018 10:01:07
20-Nov-2018 10:01:07 Run started.
20-Nov-2018 10:01:07 Started : testMethod
20-Nov-2018 10:01:07 Failure : testMethod(com.carrotsearch.randomizedtesting.timeouts.Test010Zombies$Nested): 1 thread leaked from TEST scope at testMethod(com.carrotsearch.randomizedtesting.timeouts.Test010Zombies$Nested):
20-Nov-2018 10:01:07    1) Thread[id=5831, name=foobarZombie, state=TIMED_WAITING, group=TGRP-Test010Zombies$Nested]
20-Nov-2018 10:01:07         at java.lang.Thread.sleep(Native Method)
20-Nov-2018 10:01:07         at java.lang.Thread.sleep(Thread.java:909)
20-Nov-2018 10:01:07         at com.carrotsearch.randomizedtesting.WithNestedTestClass$3.run(WithNestedTestClass.java:252)
20-Nov-2018 10:01:07 Failure : testMethod(com.carrotsearch.randomizedtesting.timeouts.Test010Zombies$Nested): There are still zombie threads that couldn't be terminated:
20-Nov-2018 10:01:07    1) Thread[id=5831, name=foobarZombie, state=TIMED_WAITING, group=TGRP-Test010Zombies$Nested]
20-Nov-2018 10:01:07         at java.lang.Thread.sleep(Native Method)
20-Nov-2018 10:01:07         at java.lang.Thread.sleep(Thread.java:909)
20-Nov-2018 10:01:07         at com.carrotsearch.randomizedtesting.WithNestedTestClass$3.run(WithNestedTestClass.java:252)
20-Nov-2018 10:01:07 Finished: testMethod
20-Nov-2018 10:01:07 Failure : com.carrotsearch.randomizedtesting.timeouts.Test010Zombies$Nested: 1 thread leaked from SUITE scope at com.carrotsearch.randomizedtesting.timeouts.Test010Zombies$Nested:
20-Nov-2018 10:01:07    1) Thread[id=5831, name=foobarZombie, state=TIMED_WAITING, group=TGRP-Test010Zombies$Nested]
20-Nov-2018 10:01:07         at java.lang.Thread.sleep(Native Method)
20-Nov-2018 10:01:07         at java.lang.Thread.sleep(Thread.java:909)
20-Nov-2018 10:01:07         at com.carrotsearch.randomizedtesting.WithNestedTestClass$3.run(WithNestedTestClass.java:252)
20-Nov-2018 10:01:07 Failure : com.carrotsearch.randomizedtesting.timeouts.Test010Zombies$Nested: There are still zombie threads that couldn't be terminated:
20-Nov-2018 10:01:07    1) Thread[id=5831, name=foobarZombie, state=TIMED_WAITING, group=TGRP-Test010Zombies$Nested]
20-Nov-2018 10:01:07         at java.lang.Thread.sleep(Native Method)
20-Nov-2018 10:01:07         at java.lang.Thread.sleep(Thread.java:909)
20-Nov-2018 10:01:07         at com.carrotsearch.randomizedtesting.WithNestedTestClass$3.run(WithNestedTestClass.java:252)
20-Nov-2018 10:01:07 Run finished: run=1, ignored=0, failures=4, assumptions=0
20-Nov-2018 10:01:07
20-Nov-2018 10:01:07 Run started.
20-Nov-2018 10:01:07 Assumpt.: com.carrotsearch.randomizedtesting.timeouts.Test010Zombies$Nested: Leaked background threads present (zombies).
20-Nov-2018 10:01:07 Ignored : testMethod
20-Nov-2018 10:01:07 Run finished: run=0, ignored=1, failures=0, assumptions=1
20-Nov-2018 10:01:07
20-Nov-2018 10:01:07 Run started.
20-Nov-2018 10:01:07 Assumpt.: com.carrotsearch.randomizedtesting.timeouts.Test010Zombies$Nested: Leaked background threads present (zombies).
20-Nov-2018 10:01:07 Ignored : testMethod
20-Nov-2018 10:01:07 Run finished: run=0, ignored=1, failures=0, assumptions=1
20-Nov-2018 10:01:07
20-Nov-2018 10:01:07 Run started.
20-Nov-2018 10:01:07 Assumpt.: com.carrotsearch.randomizedtesting.timeouts.Test010Zombies$Nested: Leaked background threads present (zombies).
20-Nov-2018 10:01:07 Ignored : testMethod
20-Nov-2018 10:01:07 Run finished: run=0, ignored=1, failures=0, assumptions=1
20-Nov-2018 10:01:07
20-Nov-2018 10:01:07 Run started.
20-Nov-2018 10:01:07 Assumpt.: com.carrotsearch.randomizedtesting.timeouts.Test010Zombies$Nested: Leaked background threads present (zombies).
20-Nov-2018 10:01:07 Ignored : testMethod
20-Nov-2018 10:01:07 Run finished: run=0, ignored=1, failures=0, assumptions=1
20-Nov-2018 10:01:07
20-Nov-2018 10:01:07 Run started.
20-Nov-2018 10:01:07 Assumpt.: com.carrotsearch.randomizedtesting.timeouts.Test010Zombies$Nested: Leaked background threads present (zombies).
20-Nov-2018 10:01:07 Ignored : testMethod
20-Nov-2018 10:01:07 Run finished: run=0, ignored=1, failures=0, assumptions=1
20-Nov-2018 10:01:07
20-Nov-2018 10:01:07 Run started.
20-Nov-2018 10:01:07 Assumpt.: com.carrotsearch.randomizedtesting.timeouts.Test010Zombies$Nested: Leaked background threads present (zombies).
20-Nov-2018 10:01:07 Ignored : testMethod
20-Nov-2018 10:01:07 Run finished: run=0, ignored=1, failures=0, assumptions=1
20-Nov-2018 10:01:07
20-Nov-2018 10:01:07 Run started.
20-Nov-2018 10:01:07 Assumpt.: com.carrotsearch.randomizedtesting.timeouts.Test010Zombies$Nested: Leaked background threads present (zombies).
20-Nov-2018 10:01:07 Ignored : testMethod
20-Nov-2018 10:01:07 Run finished: run=0, ignored=1, failures=0, assumptions=1
20-Nov-2018 10:01:07
20-Nov-2018 10:01:07 Run started.
20-Nov-2018 10:01:07 Assumpt.: com.carrotsearch.randomizedtesting.timeouts.Test010Zombies$Nested: Leaked background threads present (zombies).
20-Nov-2018 10:01:07 Ignored : testMethod
20-Nov-2018 10:01:07 Run finished: run=0, ignored=1, failures=0, assumptions=1
20-Nov-2018 10:01:07
20-Nov-2018 10:01:07 Run started.
20-Nov-2018 10:01:07 Started : testMethod
20-Nov-2018 10:01:07 Finished: testMethod
20-Nov-2018 10:01:07 Failure : com.carrotsearch.randomizedtesting.timeouts.Test010Zombies$Nested: 1 thread leaked from SUITE scope at com.carrotsearch.randomizedtesting.timeouts.Test010Zombies$Nested:
20-Nov-2018 10:01:07    1) Thread[id=5850, name=foobarZombie, state=TIMED_WAITING, group=TGRP-Test010Zombies$Nested]
20-Nov-2018 10:01:07         at java.lang.Thread.sleep(Native Method)
20-Nov-2018 10:01:07         at java.lang.Thread.sleep(Thread.java:909)
20-Nov-2018 10:01:07         at com.carrotsearch.randomizedtesting.WithNestedTestClass$3.run(WithNestedTestClass.java:252)
20-Nov-2018 10:01:07 Failure : com.carrotsearch.randomizedtesting.timeouts.Test010Zombies$Nested: There are still zombie threads that couldn't be terminated:
20-Nov-2018 10:01:07    1) Thread[id=5850, name=foobarZombie, state=TIMED_WAITING, group=TGRP-Test010Zombies$Nested]
20-Nov-2018 10:01:07         at java.lang.Thread.sleep(Native Method)
20-Nov-2018 10:01:07         at java.lang.Thread.sleep(Thread.java:909)
20-Nov-2018 10:01:07         at com.carrotsearch.randomizedtesting.WithNestedTestClass$3.run(WithNestedTestClass.java:252)
20-Nov-2018 10:01:07 Run finished: run=1, ignored=0, failures=2, assumptions=0
20-Nov-2018 10:01:07
20-Nov-2018 10:01:07 Run started.
20-Nov-2018 10:01:07 Assumpt.: com.carrotsearch.randomizedtesting.timeouts.Test010Zombies$Nested: Leaked background threads present (zombies).
20-Nov-2018 10:01:07 Ignored : testMethod
20-Nov-2018 10:01:07 Run finished: run=0, ignored=1, failures=0, assumptions=1
20-Nov-2018 10:01:07
20-Nov-2018 10:01:07 Run started.
20-Nov-2018 10:01:07 Assumpt.: com.carrotsearch.randomizedtesting.timeouts.Test010Zombies$Nested: Leaked background threads present (zombies).
20-Nov-2018 10:01:07 Ignored : testMethod
20-Nov-2018 10:01:07 Run finished: run=0, ignored=1, failures=0, assumptions=1
20-Nov-2018 10:01:07
20-Nov-2018 10:01:07 Run started.
20-Nov-2018 10:01:07 Assumpt.: com.carrotsearch.randomizedtesting.timeouts.Test010Zombies$Nested: Leaked background threads present (zombies).
20-Nov-2018 10:01:07 Ignored : testMethod
20-Nov-2018 10:01:07 Run finished: run=0, ignored=1, failures=0, assumptions=1
20-Nov-2018 10:01:07
20-Nov-2018 10:01:07 Run started.
20-Nov-2018 10:01:07 Assumpt.: com.carrotsearch.randomizedtesting.timeouts.Test010Zombies$Nested: Leaked background threads present (zombies).
20-Nov-2018 10:01:07 Ignored : testMethod
20-Nov-2018 10:01:07 Run finished: run=0, ignored=1, failures=0, assumptions=1
20-Nov-2018 10:01:07
20-Nov-2018 10:01:07 Run started.
20-Nov-2018 10:01:07 Assumpt.: com.carrotsearch.randomizedtesting.timeouts.Test010Zombies$Nested: Leaked background threads present (zombies).
20-Nov-2018 10:01:07 Ignored : testMethod
20-Nov-2018 10:01:07 Run finished: run=0, ignored=1, failures=0, assumptions=1
20-Nov-2018 10:01:07
20-Nov-2018 10:01:07 Run started.
20-Nov-2018 10:01:07 Assumpt.: com.carrotsearch.randomizedtesting.timeouts.Test010Zombies$Nested: Leaked background threads present (zombies).
20-Nov-2018 10:01:07 Ignored : testMethod
20-Nov-2018 10:01:07 Run finished: run=0, ignored=1, failures=0, assumptions=1
20-Nov-2018 10:01:07
20-Nov-2018 10:01:07 Run started.
20-Nov-2018 10:01:07 Assumpt.: com.carrotsearch.randomizedtesting.timeouts.Test010Zombies$Nested: Leaked background threads present (zombies).
20-Nov-2018 10:01:07 Ignored : testMethod
20-Nov-2018 10:01:07 Run finished: run=0, ignored=1, failures=0, assumptions=1
20-Nov-2018 10:01:07
20-Nov-2018 10:01:07 Run started.
20-Nov-2018 10:01:07 Assumpt.: com.carrotsearch.randomizedtesting.timeouts.Test010Zombies$Nested: Leaked background threads present (zombies).
20-Nov-2018 10:01:07 Ignored : testMethod
20-Nov-2018 10:01:07 Run finished: run=0, ignored=1, failures=0, assumptions=1
20-Nov-2018 10:01:07
20-Nov-2018 10:01:08 Tests run: 8, Failures: 0, Errors: 0, Skipped: 0, Time elapsed: 0.797 sec - in com.carrotsearch.randomizedtesting.timeouts.Test010Zombies
20-Nov-2018 10:01:08 Running com.carrotsearch.randomizedtesting.timeouts.Test011RunawayThreads
20-Nov-2018 10:01:08 Run started.
20-Nov-2018 10:01:08 Started : spinoffAndThrow
20-Nov-2018 10:01:08 Finished: spinoffAndThrow
20-Nov-2018 10:01:08 Failure : com.carrotsearch.randomizedtesting.timeouts.Test011RunawayThreads$NestedClassScope: 1 thread leaked from SUITE scope at com.carrotsearch.randomizedtesting.timeouts.Test011RunawayThreads$NestedClassScope:
20-Nov-2018 10:01:08    1) Thread[id=5870, name=Thread-5330, state=TIMED_WAITING, group=TGRP-Test011RunawayThreads$NestedClassScope]
20-Nov-2018 10:01:08         at java.lang.Thread.sleep(Native Method)
20-Nov-2018 10:01:08         at java.lang.Thread.sleep(Thread.java:909)
20-Nov-2018 10:01:08         at com.carrotsearch.randomizedtesting.RandomizedTest.sleep(RandomizedTest.java:681)
20-Nov-2018 10:01:08         at com.carrotsearch.randomizedtesting.timeouts.Test011RunawayThreads$NestedClassScope$1.run(Test011RunawayThreads.java:139)
20-Nov-2018 10:01:08 Run finished: run=1, ignored=0, failures=1, assumptions=0
20-Nov-2018 10:01:08
20-Nov-2018 10:01:08 Run started.
20-Nov-2018 10:01:08 Started : spinoffAndThrow
20-Nov-2018 10:01:08 Failure : spinoffAndThrow(com.carrotsearch.randomizedtesting.timeouts.Test011RunawayThreads$Nested): Captured an uncaught exception in thread: Thread[id=5873, name=Thread-5332, state=RUNNABLE, group=TGRP-Test011RunawayThreads$Nested]
20-Nov-2018 10:01:08 Finished: spinoffAndThrow
20-Nov-2018 10:01:08 Run finished: run=1, ignored=0, failures=1, assumptions=0
20-Nov-2018 10:01:08
20-Nov-2018 10:01:08 Run started.
20-Nov-2018 10:01:08 Started : spinoffAndThrow
20-Nov-2018 10:01:08 Failure : spinoffAndThrow(com.carrotsearch.randomizedtesting.timeouts.Test011RunawayThreads$NestedNoJoin): 1 thread leaked from TEST scope at spinoffAndThrow(com.carrotsearch.randomizedtesting.timeouts.Test011RunawayThreads$NestedNoJoin):
20-Nov-2018 10:01:08    1) Thread[id=5877, name=Thread-5334, state=TIMED_WAITING, group=TGRP-Test011RunawayThreads$NestedNoJoin]
20-Nov-2018 10:01:08         at java.lang.Thread.sleep(Native Method)
20-Nov-2018 10:01:08         at java.lang.Thread.sleep(Thread.java:909)
20-Nov-2018 10:01:08         at com.carrotsearch.randomizedtesting.RandomizedTest.sleep(RandomizedTest.java:681)
20-Nov-2018 10:01:08         at com.carrotsearch.randomizedtesting.timeouts.Test011RunawayThreads$Nested$1.run(Test011RunawayThreads.java:93)
20-Nov-2018 10:01:08 Finished: spinoffAndThrow
20-Nov-2018 10:01:08 Run finished: run=1, ignored=0, failures=1, assumptions=0
20-Nov-2018 10:01:08
20-Nov-2018 10:01:08 Tests run: 5, Failures: 0, Errors: 0, Skipped: 0, Time elapsed: 0.516 sec - in com.carrotsearch.randomizedtesting.timeouts.Test011RunawayThreads
20-Nov-2018 10:01:08 Running com.carrotsearch.randomizedtesting.timeouts.Test012RunawayThreadsKilledAtOnce
20-Nov-2018 10:01:08 Run started.
20-Nov-2018 10:01:08 Started : lotsOfStubbornThreads
20-Nov-2018 10:01:08 Failure : lotsOfStubbornThreads(com.carrotsearch.randomizedtesting.timeouts.Test012RunawayThreadsKilledAtOnce$NestedClass): 50 threads leaked from TEST scope at lotsOfStubbornThreads(com.carrotsearch.randomizedtesting.timeouts.Test012RunawayThreadsKilledAtOnce$NestedClass):
20-Nov-2018 10:01:08    1) Thread[id=5906, name=stubborn-24, state=TIMED_WAITING, group=TGRP-Test012RunawayThreadsKilledAtOnce$NestedClass]
20-Nov-2018 10:01:08         at java.lang.Thread.sleep(Native Method)
20-Nov-2018 10:01:08         at java.lang.Thread.sleep(Thread.java:909)
20-Nov-2018 10:01:08         at com.carrotsearch.randomizedtesting.timeouts.Test012RunawayThreadsKilledAtOnce$NestedClass$1.run(Test012RunawayThreadsKilledAtOnce.java:29)
20-Nov-2018 10:01:08    2) Thread[id=5907, name=stubborn-25, state=TIMED_WAITING, group=TGRP-Test012RunawayThreadsKilledAtOnce$NestedClass]
20-Nov-2018 10:01:08         at java.lang.Thread.sleep(Native Method)
20-Nov-2018 10:01:08         at java.lang.Thread.sleep(Thread.java:909)
20-Nov-2018 10:01:08         at com.carrotsearch.randomizedtesting.timeouts.Test012RunawayThreadsKilledAtOnce$NestedClass$1.run(Test012RunawayThreadsKilledAtOnce.java:29)
20-Nov-2018 10:01:08    3) Thread[id=5915, name=stubborn-33, state=TIMED_WAITING, group=TGRP-Test012RunawayThreadsKilledAtOnce$NestedClass]
20-Nov-2018 10:01:08         at java.lang.Thread.sleep(Native Method)
20-Nov-2018 10:01:08         at java.lang.Thread.sleep(Thread.java:909)
20-Nov-2018 10:01:08         at com.carrotsearch.randomizedtesting.timeouts.Test012RunawayThreadsKilledAtOnce$NestedClass$1.run(Test012RunawayThreadsKilledAtOnce.java:29)
20-Nov-2018 10:01:08    4) Thread[id=5896, name=stubborn-14, state=TIMED_WAITING, group=TGRP-Test012RunawayThreadsKilledAtOnce$NestedClass]
20-Nov-2018 10:01:08         at java.lang.Thread.sleep(Native Method)
20-Nov-2018 10:01:08         at java.lang.Thread.sleep(Thread.java:909)
20-Nov-2018 10:01:08         at com.carrotsearch.randomizedtesting.timeouts.Test012RunawayThreadsKilledAtOnce$NestedClass$1.run(Test012RunawayThreadsKilledAtOnce.java:29)
20-Nov-2018 10:01:08    5) Thread[id=5925, name=stubborn-43, state=TIMED_WAITING, group=TGRP-Test012RunawayThreadsKilledAtOnce$NestedClass]
20-Nov-2018 10:01:08         at java.lang.Thread.sleep(Native Method)
20-Nov-2018 10:01:08         at java.lang.Thread.sleep(Thread.java:909)
20-Nov-2018 10:01:08         at com.carrotsearch.randomizedtesting.timeouts.Test012RunawayThreadsKilledAtOnce$NestedClass$1.run(Test012RunawayThreadsKilledAtOnce.java:29)
20-Nov-2018 10:01:08    6) Thread[id=5897, name=stubborn-15, state=TIMED_WAITING, group=TGRP-Test012RunawayThreadsKilledAtOnce$NestedClass]
20-Nov-2018 10:01:08         at java.lang.Thread.sleep(Native Method)
20-Nov-2018 10:01:08         at java.lang.Thread.sleep(Thread.java:909)
20-Nov-2018 10:01:08         at com.carrotsearch.randomizedtesting.timeouts.Test012RunawayThreadsKilledAtOnce$NestedClass$1.run(Test012RunawayThreadsKilledAtOnce.java:29)
20-Nov-2018 10:01:08    7) Thread[id=5895, name=stubborn-13, state=TIMED_WAITING, group=TGRP-Test012RunawayThreadsKilledAtOnce$NestedClass]
20-Nov-2018 10:01:08         at java.lang.Thread.sleep(Native Method)
20-Nov-2018 10:01:08         at java.lang.Thread.sleep(Thread.java:909)
20-Nov-2018 10:01:08         at com.carrotsearch.randomizedtesting.timeouts.Test012RunawayThreadsKilledAtOnce$NestedClass$1.run(Test012RunawayThreadsKilledAtOnce.java:29)
20-Nov-2018 10:01:08    8) Thread[id=5920, name=stubborn-38, state=TIMED_WAITING, group=TGRP-Test012RunawayThreadsKilledAtOnce$NestedClass]
20-Nov-2018 10:01:08         at java.lang.Thread.sleep(Native Method)
20-Nov-2018 10:01:08         at java.lang.Thread.sleep(Thread.java:909)
20-Nov-2018 10:01:08         at com.carrotsearch.randomizedtesting.timeouts.Test012RunawayThreadsKilledAtOnce$NestedClass$1.run(Test012RunawayThreadsKilledAtOnce.java:29)
20-Nov-2018 10:01:08    9) Thread[id=5922, name=stubborn-40, state=TIMED_WAITING, group=TGRP-Test012RunawayThreadsKilledAtOnce$NestedClass]
20-Nov-2018 10:01:08         at java.lang.Thread.sleep(Native Method)
20-Nov-2018 10:01:08         at java.lang.Thread.sleep(Thread.java:909)
20-Nov-2018 10:01:08         at com.carrotsearch.randomizedtesting.timeouts.Test012RunawayThreadsKilledAtOnce$NestedClass$1.run(Test012RunawayThreadsKilledAtOnce.java:29)
20-Nov-2018 10:01:08   10) Thread[id=5885, name=stubborn-3, state=TIMED_WAITING, group=TGRP-Test012RunawayThreadsKilledAtOnce$NestedClass]
20-Nov-2018 10:01:08         at java.lang.Thread.sleep(Native Method)
20-Nov-2018 10:01:08         at java.lang.Thread.sleep(Thread.java:909)
20-Nov-2018 10:01:08         at com.carrotsearch.randomizedtesting.timeouts.Test012RunawayThreadsKilledAtOnce$NestedClass$1.run(Test012RunawayThreadsKilledAtOnce.java:29)
20-Nov-2018 10:01:08   11) Thread[id=5890, name=stubborn-8, state=TIMED_WAITING, group=TGRP-Test012RunawayThreadsKilledAtOnce$NestedClass]
20-Nov-2018 10:01:08         at java.lang.Thread.sleep(Native Method)
20-Nov-2018 10:01:08         at java.lang.Thread.sleep(Thread.java:909)
20-Nov-2018 10:01:08         at com.carrotsearch.randomizedtesting.timeouts.Test012RunawayThreadsKilledAtOnce$NestedClass$1.run(Test012RunawayThreadsKilledAtOnce.java:29)
20-Nov-2018 10:01:08   12) Thread[id=5887, name=stubborn-5, state=TIMED_WAITING, group=TGRP-Test012RunawayThreadsKilledAtOnce$NestedClass]
20-Nov-2018 10:01:08         at java.lang.Thread.sleep(Native Method)
20-Nov-2018 10:01:08         at java.lang.Thread.sleep(Thread.java:909)
20-Nov-2018 10:01:08         at com.carrotsearch.randomizedtesting.timeouts.Test012RunawayThreadsKilledAtOnce$NestedClass$1.run(Test012RunawayThreadsKilledAtOnce.java:29)
20-Nov-2018 10:01:08   13) Thread[id=5913, name=stubborn-31, state=TIMED_WAITING, group=TGRP-Test012RunawayThreadsKilledAtOnce$NestedClass]
20-Nov-2018 10:01:08         at java.lang.Thread.sleep(Native Method)
20-Nov-2018 10:01:08         at java.lang.Thread.sleep(Thread.java:909)
20-Nov-2018 10:01:08         at com.carrotsearch.randomizedtesting.timeouts.Test012RunawayThreadsKilledAtOnce$NestedClass$1.run(Test012RunawayThreadsKilledAtOnce.java:29)
20-Nov-2018 10:01:08   14) Thread[id=5884, name=stubborn-2, state=TIMED_WAITING, group=TGRP-Test012RunawayThreadsKilledAtOnce$NestedClass]
20-Nov-2018 10:01:08         at java.lang.Thread.sleep(Native Method)
20-Nov-2018 10:01:08         at java.lang.Thread.sleep(Thread.java:909)
20-Nov-2018 10:01:08         at com.carrotsearch.randomizedtesting.timeouts.Test012RunawayThreadsKilledAtOnce$NestedClass$1.run(Test012RunawayThreadsKilledAtOnce.java:29)
20-Nov-2018 10:01:08   15) Thread[id=5888, name=stubborn-6, state=TIMED_WAITING, group=TGRP-Test012RunawayThreadsKilledAtOnce$NestedClass]
20-Nov-2018 10:01:08         at java.lang.Thread.sleep(Native Method)
20-Nov-2018 10:01:08         at java.lang.Thread.sleep(Thread.java:909)
20-Nov-2018 10:01:08         at com.carrotsearch.randomizedtesting.timeouts.Test012RunawayThreadsKilledAtOnce$NestedClass$1.run(Test012RunawayThreadsKilledAtOnce.java:29)
20-Nov-2018 10:01:08   16) Thread[id=5923, name=stubborn-41, state=TIMED_WAITING, group=TGRP-Test012RunawayThreadsKilledAtOnce$NestedClass]
20-Nov-2018 10:01:08         at java.lang.Thread.sleep(Native Method)
20-Nov-2018 10:01:08         at java.lang.Thread.sleep(Thread.java:909)
20-Nov-2018 10:01:08         at com.carrotsearch.randomizedtesting.timeouts.Test012RunawayThreadsKilledAtOnce$NestedClass$1.run(Test012RunawayThreadsKilledAtOnce.java:29)
20-Nov-2018 10:01:08   17) Thread[id=5917, name=stubborn-35, state=TIMED_WAITING, group=TGRP-Test012RunawayThreadsKilledAtOnce$NestedClass]
20-Nov-2018 10:01:08         at java.lang.Thread.sleep(Native Method)
20-Nov-2018 10:01:08         at java.lang.Thread.sleep(Thread.java:909)
20-Nov-2018 10:01:08         at com.carrotsearch.randomizedtesting.timeouts.Test012RunawayThreadsKilledAtOnce$NestedClass$1.run(Test012RunawayThreadsKilledAtOnce.java:29)
20-Nov-2018 10:01:08   18) Thread[id=5909, name=stubborn-27, state=TIMED_WAITING, group=TGRP-Test012RunawayThreadsKilledAtOnce$NestedClass]
20-Nov-2018 10:01:08         at java.lang.Thread.sleep(Native Method)
20-Nov-2018 10:01:08         at java.lang.Thread.sleep(Thread.java:909)
20-Nov-2018 10:01:08         at com.carrotsearch.randomizedtesting.timeouts.Test012RunawayThreadsKilledAtOnce$NestedClass$1.run(Test012RunawayThreadsKilledAtOnce.java:29)
20-Nov-2018 10:01:08   19) Thread[id=5902, name=stubborn-20, state=TIMED_WAITING, group=TGRP-Test012RunawayThreadsKilledAtOnce$NestedClass]
20-Nov-2018 10:01:08         at java.lang.Thread.sleep(Native Method)
20-Nov-2018 10:01:08         at java.lang.Thread.sleep(Thread.java:909)
20-Nov-2018 10:01:08         at com.carrotsearch.randomizedtesting.timeouts.Test012RunawayThreadsKilledAtOnce$NestedClass$1.run(Test012RunawayThreadsKilledAtOnce.java:29)
20-Nov-2018 10:01:08   20) Thread[id=5919, name=stubborn-37, state=TIMED_WAITING, group=TGRP-Test012RunawayThreadsKilledAtOnce$NestedClass]
20-Nov-2018 10:01:08         at java.lang.Thread.sleep(Native Method)
20-Nov-2018 10:01:08         at java.lang.Thread.sleep(Thread.java:909)
20-Nov-2018 10:01:08         at com.carrotsearch.randomizedtesting.timeouts.Test012RunawayThreadsKilledAtOnce$NestedClass$1.run(Test012RunawayThreadsKilledAtOnce.java:29)
20-Nov-2018 10:01:08   21) Thread[id=5918, name=stubborn-36, state=TIMED_WAITING, group=TGRP-Test012RunawayThreadsKilledAtOnce$NestedClass]
20-Nov-2018 10:01:08         at java.lang.Thread.sleep(Native Method)
20-Nov-2018 10:01:08         at java.lang.Thread.sleep(Thread.java:909)
20-Nov-2018 10:01:08         at com.carrotsearch.randomizedtesting.timeouts.Test012RunawayThreadsKilledAtOnce$NestedClass$1.run(Test012RunawayThreadsKilledAtOnce.java:29)
20-Nov-2018 10:01:08   22) Thread[id=5903, name=stubborn-21, state=TIMED_WAITING, group=TGRP-Test012RunawayThreadsKilledAtOnce$NestedClass]
20-Nov-2018 10:01:08         at java.lang.Thread.sleep(Native Method)
20-Nov-2018 10:01:08         at java.lang.Thread.sleep(Thread.java:909)
20-Nov-2018 10:01:08         at com.carrotsearch.randomizedtesting.timeouts.Test012RunawayThreadsKilledAtOnce$NestedClass$1.run(Test012RunawayThreadsKilledAtOnce.java:29)
20-Nov-2018 10:01:08   23) Thread[id=5899, name=stubborn-17, state=TIMED_WAITING, group=TGRP-Test012RunawayThreadsKilledAtOnce$NestedClass]
20-Nov-2018 10:01:08         at java.lang.Thread.sleep(Native Method)
20-Nov-2018 10:01:08         at java.lang.Thread.sleep(Thread.java:909)
20-Nov-2018 10:01:08         at com.carrotsearch.randomizedtesting.timeouts.Test012RunawayThreadsKilledAtOnce$NestedClass$1.run(Test012RunawayThreadsKilledAtOnce.java:29)
20-Nov-2018 10:01:08   24) Thread[id=5910, name=stubborn-28, state=TIMED_WAITING, group=TGRP-Test012RunawayThreadsKilledAtOnce$NestedClass]
20-Nov-2018 10:01:08         at java.lang.Thread.sleep(Native Method)
20-Nov-2018 10:01:08         at java.lang.Thread.sleep(Thread.java:909)
20-Nov-2018 10:01:08         at com.carrotsearch.randomizedtesting.timeouts.Test012RunawayThreadsKilledAtOnce$NestedClass$1.run(Test012RunawayThreadsKilledAtOnce.java:29)
20-Nov-2018 10:01:08   25) Thread[id=5927, name=stubborn-45, state=TIMED_WAITING, group=TGRP-Test012RunawayThreadsKilledAtOnce$NestedClass]
20-Nov-2018 10:01:08         at java.lang.Thread.sleep(Native Method)
20-Nov-2018 10:01:08         at java.lang.Thread.sleep(Thread.java:909)
20-Nov-2018 10:01:08         at com.carrotsearch.randomizedtesting.timeouts.Test012RunawayThreadsKilledAtOnce$NestedClass$1.run(Test012RunawayThreadsKilledAtOnce.java:29)
20-Nov-2018 10:01:08   26) Thread[id=5916, name=stubborn-34, state=TIMED_WAITING, group=TGRP-Test012RunawayThreadsKilledAtOnce$NestedClass]
20-Nov-2018 10:01:08         at java.lang.Thread.sleep(Native Method)
20-Nov-2018 10:01:08         at java.lang.Thread.sleep(Thread.java:909)
20-Nov-2018 10:01:08         at com.carrotsearch.randomizedtesting.timeouts.Test012RunawayThreadsKilledAtOnce$NestedClass$1.run(Test012RunawayThreadsKilledAtOnce.java:29)
20-Nov-2018 10:01:08   27) Thread[id=5914, name=stubborn-32, state=TIMED_WAITING, group=TGRP-Test012RunawayThreadsKilledAtOnce$NestedClass]
20-Nov-2018 10:01:08         at java.lang.Thread.sleep(Native Method)
20-Nov-2018 10:01:08         at java.lang.Thread.sleep(Thread.java:909)
20-Nov-2018 10:01:08         at com.carrotsearch.randomizedtesting.timeouts.Test012RunawayThreadsKilledAtOnce$NestedClass$1.run(Test012RunawayThreadsKilledAtOnce.java:29)
20-Nov-2018 10:01:08   28) Thread[id=5931, name=stubborn-49, state=TIMED_WAITING, group=TGRP-Test012RunawayThreadsKilledAtOnce$NestedClass]
20-Nov-2018 10:01:08         at java.lang.Thread.sleep(Native Method)
20-Nov-2018 10:01:08         at java.lang.Thread.sleep(Thread.java:909)
20-Nov-2018 10:01:08         at com.carrotsearch.randomizedtesting.timeouts.Test012RunawayThreadsKilledAtOnce$NestedClass$1.run(Test012RunawayThreadsKilledAtOnce.java:29)
20-Nov-2018 10:01:08   29) Thread[id=5928, name=stubborn-46, state=TIMED_WAITING, group=TGRP-Test012RunawayThreadsKilledAtOnce$NestedClass]
20-Nov-2018 10:01:08         at java.lang.Thread.sleep(Native Method)
20-Nov-2018 10:01:08         at java.lang.Thread.sleep(Thread.java:909)
20-Nov-2018 10:01:08         at com.carrotsearch.randomizedtesting.timeouts.Test012RunawayThreadsKilledAtOnce$NestedClass$1.run(Test012RunawayThreadsKilledAtOnce.java:29)
20-Nov-2018 10:01:08   30) Thread[id=5901, name=stubborn-19, state=TIMED_WAITING, group=TGRP-Test012RunawayThreadsKilledAtOnce$NestedClass]
20-Nov-2018 10:01:08         at java.lang.Thread.sleep(Native Method)
20-Nov-2018 10:01:08         at java.lang.Thread.sleep(Thread.java:909)
20-Nov-2018 10:01:08         at com.carrotsearch.randomizedtesting.timeouts.Test012RunawayThreadsKilledAtOnce$NestedClass$1.run(Test012RunawayThreadsKilledAtOnce.java:29)
20-Nov-2018 10:01:08   31) Thread[id=5926, name=stubborn-44, state=TIMED_WAITING, group=TGRP-Test012RunawayThreadsKilledAtOnce$NestedClass]
20-Nov-2018 10:01:08         at java.lang.Thread.sleep(Native Method)
20-Nov-2018 10:01:08         at java.lang.Thread.sleep(Thread.java:909)
20-Nov-2018 10:01:08         at com.carrotsearch.randomizedtesting.timeouts.Test012RunawayThreadsKilledAtOnce$NestedClass$1.run(Test012RunawayThreadsKilledAtOnce.java:29)
20-Nov-2018 10:01:08   32) Thread[id=5892, name=stubborn-10, state=TIMED_WAITING, group=TGRP-Test012RunawayThreadsKilledAtOnce$NestedClass]
20-Nov-2018 10:01:08         at java.lang.Thread.sleep(Native Method)
20-Nov-2018 10:01:08         at java.lang.Thread.sleep(Thread.java:909)
20-Nov-2018 10:01:08         at com.carrotsearch.randomizedtesting.timeouts.Test012RunawayThreadsKilledAtOnce$NestedClass$1.run(Test012RunawayThreadsKilledAtOnce.java:29)
20-Nov-2018 10:01:08   33) Thread[id=5891, name=stubborn-9, state=TIMED_WAITING, group=TGRP-Test012RunawayThreadsKilledAtOnce$NestedClass]
20-Nov-2018 10:01:08         at java.lang.Thread.sleep(Native Method)
20-Nov-2018 10:01:08         at java.lang.Thread.sleep(Thread.java:909)
20-Nov-2018 10:01:08         at com.carrotsearch.randomizedtesting.timeouts.Test012RunawayThreadsKilledAtOnce$NestedClass$1.run(Test012RunawayThreadsKilledAtOnce.java:29)
20-Nov-2018 10:01:08   34) Thread[id=5904, name=stubborn-22, state=TIMED_WAITING, group=TGRP-Test012RunawayThreadsKilledAtOnce$NestedClass]
20-Nov-2018 10:01:08         at java.lang.Thread.sleep(Native Method)
20-Nov-2018 10:01:08         at java.lang.Thread.sleep(Thread.java:909)
20-Nov-2018 10:01:08         at com.carrotsearch.randomizedtesting.timeouts.Test012RunawayThreadsKilledAtOnce$NestedClass$1.run(Test012RunawayThreadsKilledAtOnce.java:29)
20-Nov-2018 10:01:08   35) Thread[id=5924, name=stubborn-42, state=TIMED_WAITING, group=TGRP-Test012RunawayThreadsKilledAtOnce$NestedClass]
20-Nov-2018 10:01:08         at java.lang.Thread.sleep(Native Method)
20-Nov-2018 10:01:08         at java.lang.Thread.sleep(Thread.java:909)
20-Nov-2018 10:01:08         at com.carrotsearch.randomizedtesting.timeouts.Test012RunawayThreadsKilledAtOnce$NestedClass$1.run(Test012RunawayThreadsKilledAtOnce.java:29)
20-Nov-2018 10:01:08   36) Thread[id=5930, name=stubborn-48, state=TIMED_WAITING, group=TGRP-Test012RunawayThreadsKilledAtOnce$NestedClass]
20-Nov-2018 10:01:08         at java.lang.Thread.sleep(Native Method)
20-Nov-2018 10:01:08         at java.lang.Thread.sleep(Thread.java:909)
20-Nov-2018 10:01:08         at com.carrotsearch.randomizedtesting.timeouts.Test012RunawayThreadsKilledAtOnce$NestedClass$1.run(Test012RunawayThreadsKilledAtOnce.java:29)
20-Nov-2018 10:01:08   37) Thread[id=5883, name=stubborn-1, state=TIMED_WAITING, group=TGRP-Test012RunawayThreadsKilledAtOnce$NestedClass]
20-Nov-2018 10:01:08         at java.lang.Thread.sleep(Native Method)
20-Nov-2018 10:01:08         at java.lang.Thread.sleep(Thread.java:909)
20-Nov-2018 10:01:08         at com.carrotsearch.randomizedtesting.timeouts.Test012RunawayThreadsKilledAtOnce$NestedClass$1.run(Test012RunawayThreadsKilledAtOnce.java:29)
20-Nov-2018 10:01:08   38) Thread[id=5921, name=stubborn-39, state=TIMED_WAITING, group=TGRP-Test012RunawayThreadsKilledAtOnce$NestedClass]
20-Nov-2018 10:01:08         at java.lang.Thread.sleep(Native Method)
20-Nov-2018 10:01:08         at java.lang.Thread.sleep(Thread.java:909)
20-Nov-2018 10:01:08         at com.carrotsearch.randomizedtesting.timeouts.Test012RunawayThreadsKilledAtOnce$NestedClass$1.run(Test012RunawayThreadsKilledAtOnce.java:29)
20-Nov-2018 10:01:08   39) Thread[id=5912, name=stubborn-30, state=TIMED_WAITING, group=TGRP-Test012RunawayThreadsKilledAtOnce$NestedClass]
20-Nov-2018 10:01:08         at java.lang.Thread.sleep(Native Method)
20-Nov-2018 10:01:08         at java.lang.Thread.sleep(Thread.java:909)
20-Nov-2018 10:01:08         at com.carrotsearch.randomizedtesting.timeouts.Test012RunawayThreadsKilledAtOnce$NestedClass$1.run(Test012RunawayThreadsKilledAtOnce.java:29)
20-Nov-2018 10:01:08   40) Thread[id=5886, name=stubborn-4, state=TIMED_WAITING, group=TGRP-Test012RunawayThreadsKilledAtOnce$NestedClass]
20-Nov-2018 10:01:08         at java.lang.Thread.sleep(Native Method)
20-Nov-2018 10:01:08         at java.lang.Thread.sleep(Thread.java:909)
20-Nov-2018 10:01:08         at com.carrotsearch.randomizedtesting.timeouts.Test012RunawayThreadsKilledAtOnce$NestedClass$1.run(Test012RunawayThreadsKilledAtOnce.java:29)
20-Nov-2018 10:01:08   41) Thread[id=5894, name=stubborn-12, state=TIMED_WAITING, group=TGRP-Test012RunawayThreadsKilledAtOnce$NestedClass]
20-Nov-2018 10:01:08         at java.lang.Thread.sleep(Native Method)
20-Nov-2018 10:01:08         at java.lang.Thread.sleep(Thread.java:909)
20-Nov-2018 10:01:08         at com.carrotsearch.randomizedtesting.timeouts.Test012RunawayThreadsKilledAtOnce$NestedClass$1.run(Test012RunawayThreadsKilledAtOnce.java:29)
20-Nov-2018 10:01:08   42) Thread[id=5908, name=stubborn-26, state=TIMED_WAITING, group=TGRP-Test012RunawayThreadsKilledAtOnce$NestedClass]
20-Nov-2018 10:01:08         at java.lang.Thread.sleep(Native Method)
20-Nov-2018 10:01:08         at java.lang.Thread.sleep(Thread.java:909)
20-Nov-2018 10:01:08         at com.carrotsearch.randomizedtesting.timeouts.Test012RunawayThreadsKilledAtOnce$NestedClass$1.run(Test012RunawayThreadsKilledAtOnce.java:29)
20-Nov-2018 10:01:08   43) Thread[id=5898, name=stubborn-16, state=TIMED_WAITING, group=TGRP-Test012RunawayThreadsKilledAtOnce$NestedClass]
20-Nov-2018 10:01:08         at java.lang.Thread.sleep(Native Method)
20-Nov-2018 10:01:08         at java.lang.Thread.sleep(Thread.java:909)
20-Nov-2018 10:01:08         at com.carrotsearch.randomizedtesting.timeouts.Test012RunawayThreadsKilledAtOnce$NestedClass$1.run(Test012RunawayThreadsKilledAtOnce.java:29)
20-Nov-2018 10:01:08   44) Thread[id=5905, name=stubborn-23, state=TIMED_WAITING, group=TGRP-Test012RunawayThreadsKilledAtOnce$NestedClass]
20-Nov-2018 10:01:08         at java.lang.Thread.sleep(Native Method)
20-Nov-2018 10:01:08         at java.lang.Thread.sleep(Thread.java:909)
20-Nov-2018 10:01:08         at com.carrotsearch.randomizedtesting.timeouts.Test012RunawayThreadsKilledAtOnce$NestedClass$1.run(Test012RunawayThreadsKilledAtOnce.java:29)
20-Nov-2018 10:01:08   45) Thread[id=5893, name=stubborn-11, state=TIMED_WAITING, group=TGRP-Test012RunawayThreadsKilledAtOnce$NestedClass]
20-Nov-2018 10:01:08         at java.lang.Thread.sleep(Native Method)
20-Nov-2018 10:01:08         at java.lang.Thread.sleep(Thread.java:909)
20-Nov-2018 10:01:08         at com.carrotsearch.randomizedtesting.timeouts.Test012RunawayThreadsKilledAtOnce$NestedClass$1.run(Test012RunawayThreadsKilledAtOnce.java:29)
20-Nov-2018 10:01:08   46) Thread[id=5900, name=stubborn-18, state=TIMED_WAITING, group=TGRP-Test012RunawayThreadsKilledAtOnce$NestedClass]
20-Nov-2018 10:01:08         at java.lang.Thread.sleep(Native Method)
20-Nov-2018 10:01:08         at java.lang.Thread.sleep(Thread.java:909)
20-Nov-2018 10:01:08         at com.carrotsearch.randomizedtesting.timeouts.Test012RunawayThreadsKilledAtOnce$NestedClass$1.run(Test012RunawayThreadsKilledAtOnce.java:29)
20-Nov-2018 10:01:08   47) Thread[id=5911, name=stubborn-29, state=TIMED_WAITING, group=TGRP-Test012RunawayThreadsKilledAtOnce$NestedClass]
20-Nov-2018 10:01:08         at java.lang.Thread.sleep(Native Method)
20-Nov-2018 10:01:08         at java.lang.Thread.sleep(Thread.java:909)
20-Nov-2018 10:01:08         at com.carrotsearch.randomizedtesting.timeouts.Test012RunawayThreadsKilledAtOnce$NestedClass$1.run(Test012RunawayThreadsKilledAtOnce.java:29)
20-Nov-2018 10:01:08   48) Thread[id=5882, name=stubborn-0, state=TIMED_WAITING, group=TGRP-Test012RunawayThreadsKilledAtOnce$NestedClass]
20-Nov-2018 10:01:08         at java.lang.Thread.sleep(Native Method)
20-Nov-2018 10:01:08         at java.lang.Thread.sleep(Thread.java:909)
20-Nov-2018 10:01:08         at com.carrotsearch.randomizedtesting.timeouts.Test012RunawayThreadsKilledAtOnce$NestedClass$1.run(Test012RunawayThreadsKilledAtOnce.java:29)
20-Nov-2018 10:01:08   49) Thread[id=5889, name=stubborn-7, state=TIMED_WAITING, group=TGRP-Test012RunawayThreadsKilledAtOnce$NestedClass]
20-Nov-2018 10:01:08         at java.lang.Thread.sleep(Native Method)
20-Nov-2018 10:01:08         at java.lang.Thread.sleep(Thread.java:909)
20-Nov-2018 10:01:08         at com.carrotsearch.randomizedtesting.timeouts.Test012RunawayThreadsKilledAtOnce$NestedClass$1.run(Test012RunawayThreadsKilledAtOnce.java:29)
20-Nov-2018 10:01:08   50) Thread[id=5929, name=stubborn-47, state=TIMED_WAITING, group=TGRP-Test012RunawayThreadsKilledAtOnce$NestedClass]
20-Nov-2018 10:01:08         at java.lang.Thread.sleep(Native Method)
20-Nov-2018 10:01:08         at java.lang.Thread.sleep(Thread.java:909)
20-Nov-2018 10:01:08         at com.carrotsearch.randomizedtesting.timeouts.Test012RunawayThreadsKilledAtOnce$NestedClass$1.run(Test012RunawayThreadsKilledAtOnce.java:29)
20-Nov-2018 10:01:08 Finished: lotsOfStubbornThreads
20-Nov-2018 10:01:08 Run finished: run=1, ignored=0, failures=1, assumptions=0
20-Nov-2018 10:01:08
20-Nov-2018 10:01:08 Tests run: 1, Failures: 0, Errors: 0, Skipped: 0, Time elapsed: 0.047 sec - in com.carrotsearch.randomizedtesting.timeouts.Test012RunawayThreadsKilledAtOnce
20-Nov-2018 10:01:08 Running com.carrotsearch.randomizedtesting.timeouts.Test013ThreadLeaksScopeNone
20-Nov-2018 10:01:08 Run started.
20-Nov-2018 10:01:08 Started : testMethod
20-Nov-2018 10:01:08 Finished: testMethod
20-Nov-2018 10:01:08 Run finished: run=1, ignored=0, failures=0, assumptions=0
20-Nov-2018 10:01:08
20-Nov-2018 10:01:08 Run started.
20-Nov-2018 10:01:08 Started : testMethod
20-Nov-2018 10:01:08 Finished: testMethod
20-Nov-2018 10:01:08 Run finished: run=1, ignored=0, failures=0, assumptions=0
20-Nov-2018 10:01:08
20-Nov-2018 10:01:08 Run started.
20-Nov-2018 10:01:08 Started : testMethod
20-Nov-2018 10:01:08 Finished: testMethod
20-Nov-2018 10:01:08 Run finished: run=1, ignored=0, failures=0, assumptions=0
20-Nov-2018 10:01:08
20-Nov-2018 10:01:08 Run started.
20-Nov-2018 10:01:08 Started : testMethod
20-Nov-2018 10:01:08 Finished: testMethod
20-Nov-2018 10:01:08 Run finished: run=1, ignored=0, failures=0, assumptions=0
20-Nov-2018 10:01:08
20-Nov-2018 10:01:08 Run started.
20-Nov-2018 10:01:08 Started : testMethod
20-Nov-2018 10:01:08 Finished: testMethod
20-Nov-2018 10:01:08 Run finished: run=1, ignored=0, failures=0, assumptions=0
20-Nov-2018 10:01:08
20-Nov-2018 10:01:08 Run started.
20-Nov-2018 10:01:08 Started : testMethod
20-Nov-2018 10:01:08 Finished: testMethod
20-Nov-2018 10:01:08 Run finished: run=1, ignored=0, failures=0, assumptions=0
20-Nov-2018 10:01:08
20-Nov-2018 10:01:08 Run started.
20-Nov-2018 10:01:08 Started : testMethod
20-Nov-2018 10:01:08 Finished: testMethod
20-Nov-2018 10:01:08 Run finished: run=1, ignored=0, failures=0, assumptions=0
20-Nov-2018 10:01:08
20-Nov-2018 10:01:08 Run started.
20-Nov-2018 10:01:08 Started : testMethod
20-Nov-2018 10:01:08 Finished: testMethod
20-Nov-2018 10:01:08 Run finished: run=1, ignored=0, failures=0, assumptions=0
20-Nov-2018 10:01:08
20-Nov-2018 10:01:08 Tests run: 8, Failures: 0, Errors: 0, Skipped: 0, Time elapsed: 0 sec - in com.carrotsearch.randomizedtesting.timeouts.Test013ThreadLeaksScopeNone
20-Nov-2018 10:01:08 Running com.carrotsearch.randomizedtesting.timeouts.Test014Timeout
20-Nov-2018 10:01:08 Run started.
20-Nov-2018 10:01:08 Started : testMethod1
20-Nov-2018 10:01:08 Failure : testMethod1(com.carrotsearch.randomizedtesting.timeouts.Test014Timeout$Nested): Test timeout exceeded (>= 100 msec).
20-Nov-2018 10:01:08 Finished: testMethod1
20-Nov-2018 10:01:08 Started : testMethod2
20-Nov-2018 10:01:08 Failure : testMethod2(com.carrotsearch.randomizedtesting.timeouts.Test014Timeout$Nested): Test timeout exceeded (>= 100 msec).
20-Nov-2018 10:01:08 Finished: testMethod2
20-Nov-2018 10:01:08 Run finished: run=2, ignored=0, failures=2, assumptions=0
20-Nov-2018 10:01:08
20-Nov-2018 10:01:08 Tests run: 1, Failures: 0, Errors: 0, Skipped: 0, Time elapsed: 0.188 sec - in com.carrotsearch.randomizedtesting.timeouts.Test014Timeout
20-Nov-2018 10:01:08 Running com.carrotsearch.randomizedtesting.timeouts.Test015TimeoutOverride
20-Nov-2018 10:01:08 Run started.
20-Nov-2018 10:01:08 Started : testMethod1
20-Nov-2018 10:01:09 Finished: testMethod1
20-Nov-2018 10:01:09 Run finished: run=1, ignored=0, failures=0, assumptions=0
20-Nov-2018 10:01:09
20-Nov-2018 10:01:09 Run started.
20-Nov-2018 10:01:09 Started : testMethod1
20-Nov-2018 10:01:09 Failure : testMethod1(com.carrotsearch.randomizedtesting.timeouts.Test015TimeoutOverride$Nested): Test timeout exceeded (>= 200 msec).
20-Nov-2018 10:01:09 Finished: testMethod1
20-Nov-2018 10:01:09 Run finished: run=1, ignored=0, failures=1, assumptions=0
20-Nov-2018 10:01:09
20-Nov-2018 10:01:10 Tests run: 2, Failures: 0, Errors: 0, Skipped: 0, Time elapsed: 1.218 sec - in com.carrotsearch.randomizedtesting.timeouts.Test015TimeoutOverride
20-Nov-2018 10:01:10 Running com.carrotsearch.randomizedtesting.timeouts.Test016ThreadLeaksCustomFilters
20-Nov-2018 10:01:10 Run started.
20-Nov-2018 10:01:10 Started : testFooBars
20-Nov-2018 10:01:10 Finished: testFooBars
20-Nov-2018 10:01:10 Run finished: run=1, ignored=0, failures=0, assumptions=0
20-Nov-2018 10:01:10
20-Nov-2018 10:01:10 Tests run: 1, Failures: 0, Errors: 0, Skipped: 0, Time elapsed: 0 sec - in com.carrotsearch.randomizedtesting.timeouts.Test016ThreadLeaksCustomFilters
20-Nov-2018 10:01:10 Running com.carrotsearch.randomizedtesting.timeouts.Test017ThreadLeaksCustomFiltersException
20-Nov-2018 10:01:10 Run started.
20-Nov-2018 10:01:10 Started : testFooBars
20-Nov-2018 10:01:10 Failure : testFooBars(com.carrotsearch.randomizedtesting.timeouts.Test017ThreadLeaksCustomFiltersException$Nested1): filter-exception
20-Nov-2018 10:01:10 Finished: testFooBars
20-Nov-2018 10:01:10 Failure : com.carrotsearch.randomizedtesting.timeouts.Test017ThreadLeaksCustomFiltersException$Nested1: filter-exception
20-Nov-2018 10:01:10 Run finished: run=1, ignored=0, failures=2, assumptions=0
20-Nov-2018 10:01:10
20-Nov-2018 10:01:10 Tests run: 1, Failures: 0, Errors: 0, Skipped: 0, Time elapsed: 0 sec - in com.carrotsearch.randomizedtesting.timeouts.Test017ThreadLeaksCustomFiltersException
20-Nov-2018 10:01:10 Running com.carrotsearch.randomizedtesting.timeouts.Test018TimeoutStacks
20-Nov-2018 10:01:11 Tests run: 1, Failures: 0, Errors: 0, Skipped: 0, Time elapsed: 1 sec - in com.carrotsearch.randomizedtesting.timeouts.Test018TimeoutStacks
20-Nov-2018 10:01:11 Running com.carrotsearch.randomizedtesting.timeouts.Test019ThreadLeakGroup
20-Nov-2018 10:01:11 Run started.
20-Nov-2018 10:01:11 Started : testLeakOutsideOfGroup
20-Nov-2018 10:01:11 Failure : testLeakOutsideOfGroup(com.carrotsearch.randomizedtesting.timeouts.Test019ThreadLeakGroup$Nested3): 1 thread leaked from TEST scope at testLeakOutsideOfGroup(com.carrotsearch.randomizedtesting.timeouts.Test019ThreadLeakGroup$Nested3):
20-Nov-2018 10:01:11    1) Thread[id=5988, name=foobar, state=TIMED_WAITING, group=foobar-group]
20-Nov-2018 10:01:11         at java.lang.Thread.sleep(Native Method)
20-Nov-2018 10:01:11         at java.lang.Thread.sleep(Thread.java:909)
20-Nov-2018 10:01:11         at com.carrotsearch.randomizedtesting.timeouts.Test019ThreadLeakGroup$Nested1$1.run(Test019ThreadLeakGroup.java:37)
20-Nov-2018 10:01:11 Finished: testLeakOutsideOfGroup
20-Nov-2018 10:01:11 Run finished: run=1, ignored=0, failures=1, assumptions=0
20-Nov-2018 10:01:11
20-Nov-2018 10:01:11 Run started.
20-Nov-2018 10:01:11 Started : testLeakOutsideOfGroup
20-Nov-2018 10:01:11 Finished: testLeakOutsideOfGroup
20-Nov-2018 10:01:11 Run finished: run=1, ignored=0, failures=0, assumptions=0
20-Nov-2018 10:01:11
20-Nov-2018 10:01:11 Run started.
20-Nov-2018 10:01:11 Started : testLeakOutsideOfGroup
20-Nov-2018 10:01:11 Finished: testLeakOutsideOfGroup
20-Nov-2018 10:01:11 Run finished: run=1, ignored=0, failures=0, assumptions=0
20-Nov-2018 10:01:11
20-Nov-2018 10:01:11 Tests run: 3, Failures: 0, Errors: 0, Skipped: 0, Time elapsed: 0.015 sec - in com.carrotsearch.randomizedtesting.timeouts.Test019ThreadLeakGroup
20-Nov-2018 10:01:11 Running com.carrotsearch.randomizedtesting.timeouts.Test020SuiteTimeoutStopsTests
20-Nov-2018 10:01:11 Run started.
20-Nov-2018 10:01:11 Started : test001
20-Nov-2018 10:01:11 before timeout(1)
20-Nov-2018 10:01:11
20-Nov-2018 10:01:11 Failure : test001(com.carrotsearch.randomizedtesting.timeouts.Test020SuiteTimeoutStopsTests$Nested1): Test abandoned because suite timeout was reached.
20-Nov-2018 10:01:11 Finished: test001
20-Nov-2018 10:01:11 suite timeout(1)
20-Nov-2018 10:01:11
20-Nov-2018 10:01:11 Failure : com.carrotsearch.randomizedtesting.timeouts.Test020SuiteTimeoutStopsTests$Nested1: Suite timeout exceeded (>= 500 msec).
20-Nov-2018 10:01:11 Run finished: run=1, ignored=0, failures=2, assumptions=0
20-Nov-2018 10:01:11
20-Nov-2018 10:01:11 Nov 20, 2018 10:01:11 AM com.carrotsearch.randomizedtesting.ThreadLeakControl$2 evaluate
20-Nov-2018 10:01:11
20-Nov-2018 10:01:11 WARNING: Suite execution timed out: com.carrotsearch.randomizedtesting.timeouts.Test020SuiteTimeoutStopsTests$Nested1
20-Nov-2018 10:01:11 ==== jstack at approximately timeout time ====
20-Nov-2018 10:01:11 "main" ID=1 WAITING on com.carrotsearch.randomizedtesting.WithNestedTestClass$5@9e80ad0 (in native code)
20-Nov-2018 10:01:11         at java.lang.Object.wait(Native Method)
20-Nov-2018 10:01:11         - waiting on com.carrotsearch.randomizedtesting.WithNestedTestClass$5@9e80ad0
20-Nov-2018 10:01:11         at java.lang.Object.wait(Object.java:201)
20-Nov-2018 10:01:11         at java.lang.Thread.join(Thread.java:665)
20-Nov-2018 10:01:11         - locked com.carrotsearch.randomizedtesting.WithNestedTestClass$5@9e80ad0
20-Nov-2018 10:01:11         at com.carrotsearch.randomizedtesting.WithNestedTestClass.runTests(WithNestedTestClass.java:341)
20-Nov-2018 10:01:11         at com.carrotsearch.randomizedtesting.timeouts.Test020SuiteTimeoutStopsTests.testExceptionInFilter(Test020SuiteTimeoutStopsTests.java:63)
20-Nov-2018 10:01:11         at sun.reflect.NativeMethodAccessorImpl.invoke0(Native Method)
20-Nov-2018 10:01:11         at sun.reflect.NativeMethodAccessorImpl.invoke(NativeMethodAccessorImpl.java:95)
20-Nov-2018 10:01:11         at sun.reflect.DelegatingMethodAccessorImpl.invoke(DelegatingMethodAccessorImpl.java:55)
20-Nov-2018 10:01:11         at java.lang.reflect.Method.invoke(Method.java:508)
20-Nov-2018 10:01:11         at org.junit.runners.model.FrameworkMethod$1.runReflectiveCall(FrameworkMethod.java:50)
20-Nov-2018 10:01:11         at org.junit.internal.runners.model.ReflectiveCallable.run(ReflectiveCallable.java:12)
20-Nov-2018 10:01:11         at org.junit.runners.model.FrameworkMethod.invokeExplosively(FrameworkMethod.java:47)
20-Nov-2018 10:01:11         at org.junit.internal.runners.statements.InvokeMethod.evaluate(InvokeMethod.java:17)
20-Nov-2018 10:01:11         at org.junit.internal.runners.statements.RunBefores.evaluate(RunBefores.java:26)
20-Nov-2018 10:01:11         at org.junit.internal.runners.statements.RunAfters.evaluate(RunAfters.java:27)
20-Nov-2018 10:01:11         at org.junit.runners.ParentRunner.runLeaf(ParentRunner.java:325)
20-Nov-2018 10:01:11         at org.junit.runners.BlockJUnit4ClassRunner.runChild(BlockJUnit4ClassRunner.java:78)
20-Nov-2018 10:01:11         at org.junit.runners.BlockJUnit4ClassRunner.runChild(BlockJUnit4ClassRunner.java:57)
20-Nov-2018 10:01:11         at org.junit.runners.ParentRunner$3.run(ParentRunner.java:290)
20-Nov-2018 10:01:11         at org.junit.runners.ParentRunner$1.schedule(ParentRunner.java:71)
20-Nov-2018 10:01:11         at org.junit.runners.ParentRunner.runChildren(ParentRunner.java:288)
20-Nov-2018 10:01:11         at org.junit.runners.ParentRunner.access$000(ParentRunner.java:58)
20-Nov-2018 10:01:11         at org.junit.runners.ParentRunner$2.evaluate(ParentRunner.java:268)
20-Nov-2018 10:01:11         at org.junit.internal.runners.statements.RunBefores.evaluate(RunBefores.java:26)
20-Nov-2018 10:01:11         at org.junit.internal.runners.statements.RunAfters.evaluate(RunAfters.java:27)
20-Nov-2018 10:01:11         at com.carrotsearch.randomizedtesting.rules.StatementAdapter.evaluate(StatementAdapter.java:36)
20-Nov-2018 10:01:11         at com.carrotsearch.randomizedtesting.rules.SystemPropertiesInvariantRule$1.evaluate(SystemPropertiesInvariantRule.java:59)
20-Nov-2018 10:01:11         at org.junit.rules.RunRules.evaluate(RunRules.java:20)
20-Nov-2018 10:01:11         at org.junit.runners.ParentRunner.run(ParentRunner.java:363)
20-Nov-2018 10:01:11         at org.apache.maven.surefire.junit4.JUnit4Provider.execute(JUnit4Provider.java:367)
20-Nov-2018 10:01:11         at org.apache.maven.surefire.junit4.JUnit4Provider.executeWithRerun(JUnit4Provider.java:274)
20-Nov-2018 10:01:11         at org.apache.maven.surefire.junit4.JUnit4Provider.executeTestSet(JUnit4Provider.java:238)
20-Nov-2018 10:01:11         at org.apache.maven.surefire.junit4.JUnit4Provider.invoke(JUnit4Provider.java:161)
20-Nov-2018 10:01:11         at org.apache.maven.surefire.booter.ForkedBooter.invokeProviderInSameClassLoader(ForkedBooter.java:290)
20-Nov-2018 10:01:11         at org.apache.maven.surefire.booter.ForkedBooter.runSuitesInProcess(ForkedBooter.java:242)
20-Nov-2018 10:01:11         at org.apache.maven.surefire.booter.ForkedBooter.main(ForkedBooter.java:121)
20-Nov-2018 10:01:11
20-Nov-2018 10:01:11 "JIT Compilation Thread-0" ID=4 RUNNABLE
20-Nov-2018 10:01:11
20-Nov-2018 10:01:11 "JIT Compilation Thread-1 Suspended" ID=5 RUNNABLE
20-Nov-2018 10:01:11
20-Nov-2018 10:01:11 "JIT Compilation Thread-2 Suspended" ID=6 RUNNABLE
20-Nov-2018 10:01:11
20-Nov-2018 10:01:11 "JIT Compilation Thread-3 Suspended" ID=7 RUNNABLE
20-Nov-2018 10:01:11
20-Nov-2018 10:01:11 "JIT Diagnostic Compilation Thread-4 Suspended" ID=8 RUNNABLE
20-Nov-2018 10:01:11
20-Nov-2018 10:01:11 "JIT-SamplerThread" ID=9 TIMED_WAITING
20-Nov-2018 10:01:11
20-Nov-2018 10:01:11 "IProfiler" ID=10 RUNNABLE
20-Nov-2018 10:01:11
20-Nov-2018 10:01:11 "Signal Dispatcher" ID=2 RUNNABLE (in native code)
20-Nov-2018 10:01:11         at com.ibm.misc.SignalDispatcher.waitForSignal(Native Method)
20-Nov-2018 10:01:11         at com.ibm.misc.SignalDispatcher.run(SignalDispatcher.java:73)
20-Nov-2018 10:01:11
20-Nov-2018 10:01:11 "Concurrent Mark Helper" ID=11 RUNNABLE
20-Nov-2018 10:01:11
20-Nov-2018 10:01:11 "GC Slave" ID=12 RUNNABLE
20-Nov-2018 10:01:11
20-Nov-2018 10:01:11 "GC Slave" ID=13 RUNNABLE
20-Nov-2018 10:01:11
20-Nov-2018 10:01:11 "GC Slave" ID=14 RUNNABLE
20-Nov-2018 10:01:11
20-Nov-2018 10:01:11 "GC Slave" ID=15 RUNNABLE
20-Nov-2018 10:01:11
20-Nov-2018 10:01:11 "GC Slave" ID=16 RUNNABLE
20-Nov-2018 10:01:11
20-Nov-2018 10:01:11 "GC Slave" ID=17 RUNNABLE
20-Nov-2018 10:01:11
20-Nov-2018 10:01:11 "GC Slave" ID=18 RUNNABLE
20-Nov-2018 10:01:11
20-Nov-2018 10:01:11 "Attach API wait loop" ID=21 RUNNABLE (in native code)
20-Nov-2018 10:01:11         at com.ibm.tools.attach.javaSE.IPC.waitSemaphore(Native Method)
20-Nov-2018 10:01:11         at com.ibm.tools.attach.javaSE.CommonDirectory.waitSemaphore(CommonDirectory.java:193)
20-Nov-2018 10:01:11         at com.ibm.tools.attach.javaSE.AttachHandler$WaitLoop.waitForNotification(AttachHandler.java:356)
20-Nov-2018 10:01:11         at com.ibm.tools.attach.javaSE.AttachHandler$WaitLoop.run(AttachHandler.java:444)
20-Nov-2018 10:01:11
20-Nov-2018 10:01:11 "Finalizer thread" ID=22 RUNNABLE
20-Nov-2018 10:01:11
20-Nov-2018 10:01:11 "last-ditch-daemon-shutdown-thread-30sec" ID=23 TIMED_WAITING on java.util.concurrent.locks.AbstractQueuedSynchronizer$ConditionObject@85688a9a (in native code)
20-Nov-2018 10:01:11         at sun.misc.Unsafe.park(Native Method)
20-Nov-2018 10:01:11         - timed waiting on java.util.concurrent.locks.AbstractQueuedSynchronizer$ConditionObject@85688a9a
20-Nov-2018 10:01:11         at java.util.concurrent.locks.LockSupport.parkNanos(LockSupport.java:226)
20-Nov-2018 10:01:11         at java.util.concurrent.locks.AbstractQueuedSynchronizer$ConditionObject.awaitNanos(AbstractQueuedSynchronizer.java:2089)
20-Nov-2018 10:01:11         at java.util.concurrent.ScheduledThreadPoolExecutor$DelayedWorkQueue.take(ScheduledThreadPoolExecutor.java:1104)
20-Nov-2018 10:01:11         at java.util.concurrent.ScheduledThreadPoolExecutor$DelayedWorkQueue.take(ScheduledThreadPoolExecutor.java:820)
20-Nov-2018 10:01:11         at java.util.concurrent.ThreadPoolExecutor.getTask(ThreadPoolExecutor.java:1078)
20-Nov-2018 10:01:11         at java.util.concurrent.ThreadPoolExecutor.runWorker(ThreadPoolExecutor.java:1138)
20-Nov-2018 10:01:11         at java.util.concurrent.ThreadPoolExecutor$Worker.run(ThreadPoolExecutor.java:628)
20-Nov-2018 10:01:11         at java.lang.Thread.run(Thread.java:785)
20-Nov-2018 10:01:11
20-Nov-2018 10:01:11 "surefire-forkedjvm-command-thread" ID=24 RUNNABLE (in native code)
20-Nov-2018 10:01:11         at java.io.FileInputStream.readBytes(Native Method)
20-Nov-2018 10:01:11         at java.io.FileInputStream.read(FileInputStream.java:272)
20-Nov-2018 10:01:11         at java.io.BufferedInputStream.fill(BufferedInputStream.java:257)
20-Nov-2018 10:01:11         at java.io.BufferedInputStream.read1(BufferedInputStream.java:297)
20-Nov-2018 10:01:11         at java.io.BufferedInputStream.read(BufferedInputStream.java:356)
20-Nov-2018 10:01:11         - locked java.io.BufferedInputStream@dc1f3a3e
20-Nov-2018 10:01:11         at com.ibm.jvm.io.ConsoleInputStream.read(ConsoleInputStream.java:245)
20-Nov-2018 10:01:11         at java.io.DataInputStream.readFully(DataInputStream.java:206)
20-Nov-2018 10:01:11         at java.io.DataInputStream.readInt(DataInputStream.java:398)
20-Nov-2018 10:01:11         at org.apache.maven.surefire.booter.MasterProcessCommand.decode(MasterProcessCommand.java:117)
20-Nov-2018 10:01:11         at org.apache.maven.surefire.booter.CommandReader$CommandRunnable.run(CommandReader.java:360)
20-Nov-2018 10:01:11         at java.lang.Thread.run(Thread.java:785)
20-Nov-2018 10:01:11
20-Nov-2018 10:01:11 "MemoryPoolMXBean notification dispatcher" ID=298 RUNNABLE (in native code)
20-Nov-2018 10:01:11         at com.ibm.lang.management.MemoryNotificationThread.processNotificationLoop(Native Method)
20-Nov-2018 10:01:11         at com.ibm.lang.management.MemoryNotificationThread.run(MemoryNotificationThread.java:63)
20-Nov-2018 10:01:11
20-Nov-2018 10:01:11 "GC Daemon" ID=5658 TIMED_WAITING on sun.misc.GC$LatencyLock@88973ae8 (in native code)
20-Nov-2018 10:01:11         at java.lang.Object.wait(Native Method)
20-Nov-2018 10:01:11         - timed waiting on sun.misc.GC$LatencyLock@88973ae8
20-Nov-2018 10:01:11         at java.lang.Object.wait(Object.java:201)
20-Nov-2018 10:01:11         at sun.misc.GC$Daemon.run(GC.java:129)
20-Nov-2018 10:01:11         - locked sun.misc.GC$LatencyLock@88973ae8
20-Nov-2018 10:01:11
20-Nov-2018 10:01:11 "Thread-5353" ID=5995 WAITING on com.carrotsearch.randomizedtesting.RandomizedRunner$2@a2cc75ba (in native code)
20-Nov-2018 10:01:11         at java.lang.Object.wait(Native Method)
20-Nov-2018 10:01:11         - waiting on com.carrotsearch.randomizedtesting.RandomizedRunner$2@a2cc75ba
20-Nov-2018 10:01:11         at java.lang.Object.wait(Object.java:201)
20-Nov-2018 10:01:11         at java.lang.Thread.join(Thread.java:665)
20-Nov-2018 10:01:11         - locked com.carrotsearch.randomizedtesting.RandomizedRunner$2@a2cc75ba
20-Nov-2018 10:01:11         at com.carrotsearch.randomizedtesting.RandomizedRunner.runSuite(RandomizedRunner.java:639)
20-Nov-2018 10:01:11         at com.carrotsearch.randomizedtesting.RandomizedRunner.run(RandomizedRunner.java:496)
20-Nov-2018 10:01:11         at org.junit.runners.Suite.runChild(Suite.java:128)
20-Nov-2018 10:01:11         at org.junit.runners.Suite.runChild(Suite.java:27)
20-Nov-2018 10:01:11         at org.junit.runners.ParentRunner$3.run(ParentRunner.java:290)
20-Nov-2018 10:01:11         at org.junit.runners.ParentRunner$1.schedule(ParentRunner.java:71)
20-Nov-2018 10:01:11         at org.junit.runners.ParentRunner.runChildren(ParentRunner.java:288)
20-Nov-2018 10:01:11         at org.junit.runners.ParentRunner.access$000(ParentRunner.java:58)
20-Nov-2018 10:01:11         at org.junit.runners.ParentRunner$2.evaluate(ParentRunner.java:268)
20-Nov-2018 10:01:11         at org.junit.runners.ParentRunner.run(ParentRunner.java:363)
20-Nov-2018 10:01:11         at org.junit.runner.JUnitCore.run(JUnitCore.java:137)
20-Nov-2018 10:01:11         at org.junit.runner.JUnitCore.run(JUnitCore.java:115)
20-Nov-2018 10:01:11         at org.junit.runner.JUnitCore.run(JUnitCore.java:105)
20-Nov-2018 10:01:11         at org.junit.runner.JUnitCore.run(JUnitCore.java:94)
20-Nov-2018 10:01:11         at com.carrotsearch.randomizedtesting.WithNestedTestClass$5.run(WithNestedTestClass.java:336)
20-Nov-2018 10:01:11
20-Nov-2018 10:01:11 "SUITE-Test020SuiteTimeoutStopsTests$Nested1-seed#[B032EC525716289E]" ID=5996 RUNNABLE (in native code)
20-Nov-2018 10:01:11         at com.ibm.lang.management.ThreadMXBeanImpl.dumpAllThreadsImpl(Native Method)
20-Nov-2018 10:01:11         at com.ibm.lang.management.ThreadMXBeanImpl.dumpAllThreads(ThreadMXBeanImpl.java:698)
20-Nov-2018 10:01:11         at com.carrotsearch.randomizedtesting.ThreadLeakControl.formatThreadStacksFull(ThreadLeakControl.java:681)
20-Nov-2018 10:01:11         at com.carrotsearch.randomizedtesting.ThreadLeakControl.access$1000(ThreadLeakControl.java:65)
20-Nov-2018 10:01:11         at com.carrotsearch.randomizedtesting.ThreadLeakControl$2.evaluate(ThreadLeakControl.java:415)
20-Nov-2018 10:01:11         - locked java.lang.Object@d18977c3
20-Nov-2018 10:01:11         at com.carrotsearch.randomizedtesting.RandomizedRunner.runSuite(RandomizedRunner.java:708)
20-Nov-2018 10:01:11         at com.carrotsearch.randomizedtesting.RandomizedRunner.access$200(RandomizedRunner.java:138)
20-Nov-2018 10:01:11         at com.carrotsearch.randomizedtesting.RandomizedRunner$2.run(RandomizedRunner.java:629)
20-Nov-2018 10:01:11
20-Nov-2018 10:01:11 "TEST-Test020SuiteTimeoutStopsTests$Nested1.test001-seed#[B032EC525716289E]" ID=5997 TIMED_WAITING (in native code)
20-Nov-2018 10:01:11         at java.lang.Thread.sleep(Native Method)
20-Nov-2018 10:01:11         at java.lang.Thread.sleep(Thread.java:909)
20-Nov-2018 10:01:11         at com.carrotsearch.randomizedtesting.timeouts.Test020SuiteTimeoutStopsTests$Nested1.idle(Test020SuiteTimeoutStopsTests.java:49)
20-Nov-2018 10:01:11         at com.carrotsearch.randomizedtesting.timeouts.Test020SuiteTimeoutStopsTests$Nested1.test001(Test020SuiteTimeoutStopsTests.java:25)
20-Nov-2018 10:01:11         at sun.reflect.NativeMethodAccessorImpl.invoke0(Native Method)
20-Nov-2018 10:01:11         at sun.reflect.NativeMethodAccessorImpl.invoke(NativeMethodAccessorImpl.java:95)
20-Nov-2018 10:01:11         at sun.reflect.DelegatingMethodAccessorImpl.invoke(DelegatingMethodAccessorImpl.java:55)
20-Nov-2018 10:01:11         at java.lang.reflect.Method.invoke(Method.java:508)
20-Nov-2018 10:01:11         at com.carrotsearch.randomizedtesting.RandomizedRunner.invoke(RandomizedRunner.java:1750)
20-Nov-2018 10:01:11         at com.carrotsearch.randomizedtesting.RandomizedRunner$8.evaluate(RandomizedRunner.java:938)
20-Nov-2018 10:01:11         at com.carrotsearch.randomizedtesting.rules.StatementAdapter.evaluate(StatementAdapter.java:36)
20-Nov-2018 10:01:11         at com.carrotsearch.randomizedtesting.ThreadLeakControl$StatementRunner.run(ThreadLeakControl.java:368)
20-Nov-2018 10:01:11         at com.carrotsearch.randomizedtesting.ThreadLeakControl.forkTimeoutingTask(ThreadLeakControl.java:817)
20-Nov-2018 10:01:11         at com.carrotsearch.randomizedtesting.ThreadLeakControl$3.evaluate(ThreadLeakControl.java:468)
20-Nov-2018 10:01:11         at com.carrotsearch.randomizedtesting.RandomizedRunner.runSingleTest(RandomizedRunner.java:947)
20-Nov-2018 10:01:11         at com.carrotsearch.randomizedtesting.RandomizedRunner$5.evaluate(RandomizedRunner.java:832)
20-Nov-2018 10:01:11         at com.carrotsearch.randomizedtesting.RandomizedRunner$6.evaluate(RandomizedRunner.java:883)
20-Nov-2018 10:01:11         at com.carrotsearch.randomizedtesting.RandomizedRunner$7.evaluate(RandomizedRunner.java:894)
20-Nov-2018 10:01:11         at com.carrotsearch.randomizedtesting.rules.StatementAdapter.evaluate(StatementAdapter.java:36)
20-Nov-2018 10:01:11         at com.carrotsearch.randomizedtesting.ThreadLeakControl$StatementRunner.run(ThreadLeakControl.java:368)
20-Nov-2018 10:01:11         at java.lang.Thread.run(Thread.java:785)
20-Nov-2018 10:01:11
20-Nov-2018 10:01:11 ^^==============================================
20-Nov-2018 10:01:11
20-Nov-2018 10:01:11
20-Nov-2018 10:01:11
20-Nov-2018 10:01:11 Nov 20, 2018 10:01:11 AM com.carrotsearch.randomizedtesting.ThreadLeakControl checkThreadLeaks
20-Nov-2018 10:01:11
20-Nov-2018 10:01:11 SEVERE: 1 thread leaked from SUITE scope at com.carrotsearch.randomizedtesting.timeouts.Test020SuiteTimeoutStopsTests$Nested1:
20-Nov-2018 10:01:11    1) Thread[id=5997, name=TEST-Test020SuiteTimeoutStopsTests$Nested1.test001-seed#[B032EC525716289E], state=TIMED_WAITING, group=TGRP-Test020SuiteTimeoutStopsTests$Nested1]
20-Nov-2018 10:01:11         at java.lang.Thread.sleep(Native Method)
20-Nov-2018 10:01:11         at java.lang.Thread.sleep(Thread.java:909)
20-Nov-2018 10:01:11         at com.carrotsearch.randomizedtesting.timeouts.Test020SuiteTimeoutStopsTests$Nested1.idle(Test020SuiteTimeoutStopsTests.java:49)
20-Nov-2018 10:01:11         at com.carrotsearch.randomizedtesting.timeouts.Test020SuiteTimeoutStopsTests$Nested1.test001(Test020SuiteTimeoutStopsTests.java:25)
20-Nov-2018 10:01:11         at sun.reflect.NativeMethodAccessorImpl.invoke0(Native Method)
20-Nov-2018 10:01:11         at sun.reflect.NativeMethodAccessorImpl.invoke(NativeMethodAccessorImpl.java:95)
20-Nov-2018 10:01:11         at sun.reflect.DelegatingMethodAccessorImpl.invoke(DelegatingMethodAccessorImpl.java:55)
20-Nov-2018 10:01:11         at java.lang.reflect.Method.invoke(Method.java:508)
20-Nov-2018 10:01:11         at com.carrotsearch.randomizedtesting.RandomizedRunner.invoke(RandomizedRunner.java:1750)
20-Nov-2018 10:01:11         at com.carrotsearch.randomizedtesting.RandomizedRunner$8.evaluate(RandomizedRunner.java:938)
20-Nov-2018 10:01:11         at com.carrotsearch.randomizedtesting.rules.StatementAdapter.evaluate(StatementAdapter.java:36)
20-Nov-2018 10:01:11         at com.carrotsearch.randomizedtesting.ThreadLeakControl$StatementRunner.run(ThreadLeakControl.java:368)
20-Nov-2018 10:01:11         at com.carrotsearch.randomizedtesting.ThreadLeakControl.forkTimeoutingTask(ThreadLeakControl.java:817)
20-Nov-2018 10:01:11         at com.carrotsearch.randomizedtesting.ThreadLeakControl$3.evaluate(ThreadLeakControl.java:468)
20-Nov-2018 10:01:11         at com.carrotsearch.randomizedtesting.RandomizedRunner.runSingleTest(RandomizedRunner.java:947)
20-Nov-2018 10:01:11         at com.carrotsearch.randomizedtesting.RandomizedRunner$5.evaluate(RandomizedRunner.java:832)
20-Nov-2018 10:01:11         at com.carrotsearch.randomizedtesting.RandomizedRunner$6.evaluate(RandomizedRunner.java:883)
20-Nov-2018 10:01:11         at com.carrotsearch.randomizedtesting.RandomizedRunner$7.evaluate(RandomizedRunner.java:894)
20-Nov-2018 10:01:11         at com.carrotsearch.randomizedtesting.rules.StatementAdapter.evaluate(StatementAdapter.java:36)
20-Nov-2018 10:01:11         at com.carrotsearch.randomizedtesting.ThreadLeakControl$StatementRunner.run(ThreadLeakControl.java:368)
20-Nov-2018 10:01:11         at java.lang.Thread.run(Thread.java:785)
20-Nov-2018 10:01:11
20-Nov-2018 10:01:11
20-Nov-2018 10:01:11 Nov 20, 2018 10:01:11 AM com.carrotsearch.randomizedtesting.ThreadLeakControl tryToInterruptAll
20-Nov-2018 10:01:11
20-Nov-2018 10:01:11 INFO: Starting to interrupt leaked threads:
20-Nov-2018 10:01:11    1) Thread[id=5997, name=TEST-Test020SuiteTimeoutStopsTests$Nested1.test001-seed#[B032EC525716289E], state=TIMED_WAITING, group=TGRP-Test020SuiteTimeoutStopsTests$Nested1]
20-Nov-2018 10:01:11
20-Nov-2018 10:01:11
20-Nov-2018 10:01:11 Nov 20, 2018 10:01:11 AM com.carrotsearch.randomizedtesting.ThreadLeakControl tryToInterruptAll
20-Nov-2018 10:01:11
20-Nov-2018 10:01:11 INFO: All leaked threads terminated.
20-Nov-2018 10:01:11
20-Nov-2018 10:01:11
20-Nov-2018 10:01:11
20-Nov-2018 10:01:11 Tests run: 1, Failures: 0, Errors: 0, Skipped: 0, Time elapsed: 0.547 sec - in com.carrotsearch.randomizedtesting.timeouts.Test020SuiteTimeoutStopsTests
20-Nov-2018 10:01:11
20-Nov-2018 10:01:11
20-Nov-2018 10:01:11 Results :
20-Nov-2018 10:01:11
20-Nov-2018 10:01:11
20-Nov-2018 10:01:11
20-Nov-2018 10:01:11 Tests run: 2257, Failures: 0, Errors: 0, Skipped: 6
20-Nov-2018 10:01:11
20-Nov-2018 10:01:11
20-Nov-2018 10:01:11
20-Nov-2018 10:01:11 [INFO]
20-Nov-2018 10:01:11
20-Nov-2018 10:01:11 [INFO] --- maven-jar-plugin:3.0.2:jar (default-jar) @ randomizedtesting-runner ---
20-Nov-2018 10:01:11
20-Nov-2018 10:01:12 [INFO] Building jar: C:\bamboo\xml-data\build-dir\RNDTEST-SOFTWARE-IBM17\randomized-runner\target\randomizedtesting-runner-2.7.1.jar
20-Nov-2018 10:01:12
20-Nov-2018 10:01:12 [INFO]
20-Nov-2018 10:01:12
20-Nov-2018 10:01:12 [INFO] --- maven-site-plugin:3.5.1:attach-descriptor (attach-descriptor) @ randomizedtesting-runner ---
20-Nov-2018 10:01:12
20-Nov-2018 10:01:12 [INFO]
20-Nov-2018 10:01:12
20-Nov-2018 10:01:12 [INFO] --- forbiddenapis:2.5:check (check-forbidden-apis) @ randomizedtesting-runner ---
20-Nov-2018 10:01:12
20-Nov-2018 10:01:12 [INFO] Scanning for classes to check...
20-Nov-2018 10:01:12
20-Nov-2018 10:01:12 [INFO] Reading bundled API signatures: jdk-unsafe-1.8
20-Nov-2018 10:01:12
20-Nov-2018 10:01:12 [INFO] Reading bundled API signatures: jdk-deprecated-1.8
20-Nov-2018 10:01:12
20-Nov-2018 10:01:12 [INFO] Reading bundled API signatures: jdk-system-out
20-Nov-2018 10:01:12
20-Nov-2018 10:01:12 [INFO] Reading bundled API signatures: jdk-non-portable
20-Nov-2018 10:01:12
20-Nov-2018 10:01:12 [INFO] Loading classes to check...
20-Nov-2018 10:01:12
20-Nov-2018 10:01:12 [INFO] Scanning classes for violations...
20-Nov-2018 10:01:12
20-Nov-2018 10:01:12 [INFO] Scanned 190 class file(s) for forbidden API invocations (in 0.38s), 0 error(s).
20-Nov-2018 10:01:12
20-Nov-2018 10:01:12 [INFO]
20-Nov-2018 10:01:12
20-Nov-2018 10:01:12 [INFO] -----------< com.carrotsearch.randomizedtesting:junit4-ant >------------
20-Nov-2018 10:01:12
20-Nov-2018 10:01:12 [INFO] Building RandomizedTesting JUnit4 ANT Task 2.7.1                   [3/8]
20-Nov-2018 10:01:12
20-Nov-2018 10:01:12 [INFO] --------------------------------[ jar ]---------------------------------
20-Nov-2018 10:01:12
20-Nov-2018 10:01:12 [INFO]
20-Nov-2018 10:01:12
20-Nov-2018 10:01:12 [INFO] --- maven-clean-plugin:3.0.0:clean (default-clean) @ junit4-ant ---
20-Nov-2018 10:01:12
20-Nov-2018 10:01:12 [INFO]
20-Nov-2018 10:01:12
20-Nov-2018 10:01:12 [INFO] --- maven-resources-plugin:3.0.1:resources (default-resources) @ junit4-ant ---
20-Nov-2018 10:01:12
20-Nov-2018 10:01:12 [INFO] Using 'UTF-8' encoding to copy filtered resources.
20-Nov-2018 10:01:12
20-Nov-2018 10:01:12 [INFO] Copying 15 resources
20-Nov-2018 10:01:12
20-Nov-2018 10:01:12 [INFO]
20-Nov-2018 10:01:12
20-Nov-2018 10:01:12 [INFO] --- maven-compiler-plugin:3.5.1:compile (default-compile) @ junit4-ant ---
20-Nov-2018 10:01:12
20-Nov-2018 10:01:12 [INFO] Changes detected - recompiling the module!
20-Nov-2018 10:01:12
20-Nov-2018 10:01:12 [INFO] Compiling 99 source files to C:\bamboo\xml-data\build-dir\RNDTEST-SOFTWARE-IBM17\junit4-ant\target\classes
20-Nov-2018 10:01:12
20-Nov-2018 10:01:12 [INFO] -------------------------------------------------------------
20-Nov-2018 10:01:12
20-Nov-2018 10:01:12 [ERROR] COMPILATION ERROR :
20-Nov-2018 10:01:12
20-Nov-2018 10:01:12 [INFO] -------------------------------------------------------------
20-Nov-2018 10:01:12
20-Nov-2018 10:01:12 [ERROR] /C:/bamboo/xml-data/build-dir/RNDTEST-SOFTWARE-IBM17/junit4-ant/src/main/java/com/carrotsearch/ant/tasks/junit4/listeners/json/JsonReport.java:[267,9] ';' expected
20-Nov-2018 10:01:12
20-Nov-2018 10:01:12 [INFO] 1 error
20-Nov-2018 10:01:12
20-Nov-2018 10:01:12 [INFO] -------------------------------------------------------------
20-Nov-2018 10:01:12
20-Nov-2018 10:01:12 [INFO] ------------------------------------------------------------------------
20-Nov-2018 10:01:12
20-Nov-2018 10:01:12 [INFO] Reactor Summary:
20-Nov-2018 10:01:12
20-Nov-2018 10:01:12 [INFO]
20-Nov-2018 10:01:12
20-Nov-2018 10:01:12 [INFO] RandomizedTesting Parent POM 2.7.1 ................. SUCCESS [  1.703 s]
20-Nov-2018 10:01:12
20-Nov-2018 10:01:12 [INFO] RandomizedTesting Randomized Runner ................ SUCCESS [ 36.085 s]
20-Nov-2018 10:01:12
20-Nov-2018 10:01:12 [INFO] RandomizedTesting JUnit4 ANT Task .................. FAILURE [  0.359 s]
20-Nov-2018 10:01:12
20-Nov-2018 10:01:12 [INFO] RandomizedTesting JUnit4 Maven Plugin .............. SKIPPED
20-Nov-2018 10:01:12
20-Nov-2018 10:01:12 [INFO] RandomizedTesting JUnit4 Maven Plugin Tests ........ SKIPPED
20-Nov-2018 10:01:12
20-Nov-2018 10:01:12 [INFO] RandomizedTesting Examples ......................... SKIPPED
20-Nov-2018 10:01:12
20-Nov-2018 10:01:12 [INFO] RandomizedTesting ANT Examples ..................... SKIPPED
20-Nov-2018 10:01:12
20-Nov-2018 10:01:12 [INFO] RandomizedTesting Security Manager Example 2.7.1 ... SKIPPED
20-Nov-2018 10:01:12
20-Nov-2018 10:01:12 [INFO] ------------------------------------------------------------------------
20-Nov-2018 10:01:12
20-Nov-2018 10:01:12 [INFO] BUILD FAILURE
20-Nov-2018 10:01:12
20-Nov-2018 10:01:12 [INFO] ------------------------------------------------------------------------
20-Nov-2018 10:01:12
20-Nov-2018 10:01:12 [INFO] Total time: 38.412 s
20-Nov-2018 10:01:12
20-Nov-2018 10:01:12 [INFO] Finished at: 2018-11-20T10:01:12+01:00
20-Nov-2018 10:01:12
20-Nov-2018 10:01:12 [INFO] ------------------------------------------------------------------------
20-Nov-2018 10:01:12
20-Nov-2018 10:01:12 [ERROR] Failed to execute goal org.apache.maven.plugins:maven-compiler-plugin:3.5.1:compile (default-compile) on project junit4-ant: Compilation failure
20-Nov-2018 10:01:12
20-Nov-2018 10:01:12 [ERROR] /C:/bamboo/xml-data/build-dir/RNDTEST-SOFTWARE-IBM17/junit4-ant/src/main/java/com/carrotsearch/ant/tasks/junit4/listeners/json/JsonReport.java:[267,9] ';' expected
20-Nov-2018 10:01:12
20-Nov-2018 10:01:12 [ERROR] -> [Help 1]
20-Nov-2018 10:01:12
20-Nov-2018 10:01:12 [ERROR]
20-Nov-2018 10:01:12
20-Nov-2018 10:01:12 [ERROR] To see the full stack trace of the errors, re-run Maven with the -e switch.
20-Nov-2018 10:01:12
20-Nov-2018 10:01:12 [ERROR] Re-run Maven using the -X switch to enable full debug logging.
20-Nov-2018 10:01:12
20-Nov-2018 10:01:12 [ERROR]
20-Nov-2018 10:01:12
20-Nov-2018 10:01:12 [ERROR] For more information about the errors and possible solutions, please read the following articles:
20-Nov-2018 10:01:12
20-Nov-2018 10:01:12 [ERROR] [Help 1] http://cwiki.apache.org/confluence/display/MAVEN/MojoFailureException
20-Nov-2018 10:01:12
20-Nov-2018 10:01:12 [ERROR]
20-Nov-2018 10:01:12
20-Nov-2018 10:01:12 [ERROR] After correcting the problems, you can resume the build with the command
20-Nov-2018 10:01:12
20-Nov-2018 10:01:12 [ERROR]   mvn <goals> -rf :junit4-ant
20-Nov-2018 10:01:12
20-Nov-2018 10:01:13 Failing task since return code of [c:\software\java\jdk\maven\bin\mvn.cmd --batch-mode -Djava.io.tmpdir=C:\Users\bamboo\AppData\Local\Temp\RNDTEST-SOFTWARE-IBM17 -Dmaven.repo.local=C:\bamboo\bamboo-home-1\.m2\AGENT-61898754\repository clean verify -Dproguard.java.home=c:\software\java\jdk\jdk1.8/jre] was 1 while expected 0
20-Nov-2018 10:01:13 Parsing test results under C:\bamboo\xml-data\build-dir\RNDTEST-SOFTWARE-IBM17...
20-Nov-2018 10:01:13 Finished task 'Maven 3.x' with result: Failed
20-Nov-2018 10:01:13 Running post build plugin 'Docker Container Cleanup'
20-Nov-2018 10:01:13 Running post build plugin 'NCover Results Collector'
20-Nov-2018 10:01:13 Running post build plugin 'Clover Results Collector'
20-Nov-2018 10:01:13 Running post build plugin 'npm Cache Cleanup'
20-Nov-2018 10:01:13 Running post build plugin 'Artifact Copier'
20-Nov-2018 10:01:13 Successfully removed working directory at 'C:\bamboo\xml-data\build-dir\RNDTEST-SOFTWARE-IBM17'
20-Nov-2018 10:01:13 Finalising the build...
20-Nov-2018 10:01:13 Stopping timer.
20-Nov-2018 10:01:13 Build RNDTEST-SOFTWARE-IBM17-225 completed.
20-Nov-2018 10:01:15 Running on server: post build plugin 'NCover Results Collector'
20-Nov-2018 10:01:15 Running on server: post build plugin 'Build Hanging Detection Configuration'
20-Nov-2018 10:01:15 Running on server: post build plugin 'Clover Delta Calculator'
20-Nov-2018 10:01:15 Running on server: post build plugin 'Maven Dependencies Postprocessor'
20-Nov-2018 10:01:15 All post build plugins have finished
20-Nov-2018 10:01:15 Generating build results summary...
20-Nov-2018 10:01:23 Saving build results to disk...
20-Nov-2018 10:01:23 Logging substituted variables...
20-Nov-2018 10:01:23 Indexing build results...
20-Nov-2018 10:01:23 Finished building RNDTEST-SOFTWARE-IBM17-225.