Build #209

Build: #209 failed

Job: JDK 1.8 IBM failed

Stages & jobs

  1. Compile and test

  2. Package

Job result summary

Completed
Duration
2 minutes
Agent
Windows Agent 1
Revision
9b933c19378bcb7c0801be4c7fe77bff50d7fa3f 9b933c19378bcb7c0801be4c7fe77bff50d7fa3f
Total tests
2663
Fixed in
#210 (Code changes detected)

Tests

  • 2,663 tests in total
  • 1 test failed
  • 1 failure is new
  • 10 tests were quarantined / skipped
  • 2 minutes taken in total.
New test failures 1
Status Test Duration
Collapse Failed TestOnNonEmptyWorkDirectory tmpDirUnderCwd History
< 1 sec
org.apache.tools.ant.BuildException: There were test failures: 1 suite, 0 tests, 1 suite-level error [seed: 676CA27A3026D3C5]
	at com.carrotsearch.ant.tasks.junit4.it.TestOnNonEmptyWorkDirectory.tmpDirUnderCwd(TestOnNonEmptyWorkDirectory.java:31)

Error summary

The build generated some errors. See the full build log for more details.

Loaded from C:\bamboo\xml-data\build-dir\RNDTEST-SOFTWARE-IBM17\junit4-ant\target\junit4-ant-2.6.4-SNAPSHOT.jar com/carrotsearch/ant/tasks/junit4/dependencies/com/google/common/graph/SuccessorsFunction.class

Class com.carrotsearch.ant.tasks.junit4.dependencies.com.google.common.graph.SuccessorsFunction loaded from ant loader (parentFirst)

Finding class com.carrotsearch.ant.tasks.junit4.dependencies.com.google.common.io.Files$3

Loaded from C:\bamboo\xml-data\build-dir\RNDTEST-SOFTWARE-IBM17\junit4-ant\target\junit4-ant-2.6.4-SNAPSHOT.jar com/carrotsearch/ant/tasks/junit4/dependencies/com/google/common/io/Files$3.class

Class com.carrotsearch.ant.tasks.junit4.dependencies.com.google.common.io.Files$3 loaded from ant loader (parentFirst)

Finding class com.carrotsearch.ant.tasks.junit4.dependencies.com.google.common.io.CharSource

Loaded from C:\bamboo\xml-data\build-dir\RNDTEST-SOFTWARE-IBM17\junit4-ant\target\junit4-ant-2.6.4-SNAPSHOT.jar com/carrotsearch/ant/tasks/junit4/dependencies/com/google/common/io/CharSource.class

Class com.carrotsearch.ant.tasks.junit4.dependencies.com.google.common.io.CharSource loaded from ant loader (parentFirst)

Finding class com.carrotsearch.ant.tasks.junit4.dependencies.com.google.common.io.ByteSource$AsCharSource

Loaded from C:\bamboo\xml-data\build-dir\RNDTEST-SOFTWARE-IBM17\junit4-ant\target\junit4-ant-2.6.4-SNAPSHOT.jar com/carrotsearch/ant/tasks/junit4/dependencies/com/google/common/io/ByteSource$AsCharSource.class

Class com.carrotsearch.ant.tasks.junit4.dependencies.com.google.common.io.ByteSource$AsCharSource loaded from ant loader (parentFirst)

Finding class com.carrotsearch.ant.tasks.junit4.dependencies.com.google.common.io.FileWriteMode

Loaded from C:\bamboo\xml-data\build-dir\RNDTEST-SOFTWARE-IBM17\junit4-ant\target\junit4-ant-2.6.4-SNAPSHOT.jar com/carrotsearch/ant/tasks/junit4/dependencies/com/google/common/io/FileWriteMode.class

Class com.carrotsearch.ant.tasks.junit4.dependencies.com.google.common.io.FileWriteMode loaded from ant loader (parentFirst)

Finding class com.carrotsearch.ant.tasks.junit4.dependencies.com.google.common.io.CharSink

Loaded from C:\bamboo\xml-data\build-dir\RNDTEST-SOFTWARE-IBM17\junit4-ant\target\junit4-ant-2.6.4-SNAPSHOT.jar com/carrotsearch/ant/tasks/junit4/dependencies/com/google/common/io/CharSink.class

Class com.carrotsearch.ant.tasks.junit4.dependencies.com.google.common.io.CharSink loaded from ant loader (parentFirst)

Finding class com.carrotsearch.ant.tasks.junit4.dependencies.com.google.common.io.ByteSink$AsCharSink

Loaded from C:\bamboo\xml-data\build-dir\RNDTEST-SOFTWARE-IBM17\junit4-ant\target\junit4-ant-2.6.4-SNAPSHOT.jar com/carrotsearch/ant/tasks/junit4/dependencies/com/google/common/io/ByteSink$AsCharSink.class

Class com.carrotsearch.ant.tasks.junit4.dependencies.com.google.common.io.ByteSink$AsCharSink loaded from ant loader (parentFirst)

Finding class com.carrotsearch.ant.tasks.junit4.dependencies.com.google.common.io.ByteStreams

Loaded from C:\bamboo\xml-data\build-dir\RNDTEST-SOFTWARE-IBM17\junit4-ant\target\junit4-ant-2.6.4-SNAPSHOT.jar com/carrotsearch/ant/tasks/junit4/dependencies/com/google/common/io/ByteStreams.class

Class com.carrotsearch.ant.tasks.junit4.dependencies.com.google.common.io.ByteStreams loaded from ant loader (parentFirst)

Finding class com.carrotsearch.ant.tasks.junit4.dependencies.com.google.common.io.ByteStreams$1

Loaded from C:\bamboo\xml-data\build-dir\RNDTEST-SOFTWARE-IBM17\junit4-ant\target\junit4-ant-2.6.4-SNAPSHOT.jar com/carrotsearch/ant/tasks/junit4/dependencies/com/google/common/io/ByteStreams$1.class

Class com.carrotsearch.ant.tasks.junit4.dependencies.com.google.common.io.ByteStreams$1 loaded from ant loader (parentFirst)


Tests with failures [seed: 1ABC8AC7B12FEFD2]:
  - com.carrotsearch.ant.tasks.junit4.tests.SysoutsOnSuiteFailure (suite)


Finding class com.carrotsearch.ant.tasks.junit4.dependencies.com.google.common.io.Closeables

Loaded from C:\bamboo\xml-data\build-dir\RNDTEST-SOFTWARE-IBM17\junit4-ant\target\junit4-ant-2.6.4-SNAPSHOT.jar com/carrotsearch/ant/tasks/junit4/dependencies/com/google/common/io/Closeables.class

Class com.carrotsearch.ant.tasks.junit4.dependencies.com.google.common.io.Closeables loaded from ant loader (parentFirst)

Class java.lang.Float loaded from parent loader (parentFirst)

[junit4:junit4] JVM J0:     0.30 ..     0.56 =     0.27s

Finding class com.carrotsearch.ant.tasks.junit4.Duration

Loaded from C:\bamboo\xml-data\build-dir\RNDTEST-SOFTWARE-IBM17\junit4-ant\target\junit4-ant-2.6.4-SNAPSHOT.jar com/carrotsearch/ant/tasks/junit4/Duration.class

Class com.carrotsearch.ant.tasks.junit4.Duration loaded from ant loader (parentFirst)

[junit4:junit4] Execution time total: 0.58 sec.

[junit4:junit4] Tests summary: 1 suite, 2 tests, 1 suite-level error, 1 ignored (1 assumption)


[junit4.preconf] ERROR: JVM J0 ended with an exception: Forked process returned with error code: 240. Very likely a JVM crash.  See process stderr at: C:\bamboo\xml-data\build-dir\RNDTEST-SOFTWARE-IBM17\junit4-ant\target\test-classes\junit4-J0-20180904_144349_4436560238385881006571.syserr

[junit4.preconf]         at com.carrotsearch.ant.tasks.junit4.JUnit4.executeSlave(JUnit4.java:1536)

[junit4.preconf]         at com.carrotsearch.ant.tasks.junit4.JUnit4.access$000(JUnit4.java:123)

[junit4.preconf]         at com.carrotsearch.ant.tasks.junit4.JUnit4$2.call(JUnit4.java:991)

[junit4.preconf]         at com.carrotsearch.ant.tasks.junit4.JUnit4$2.call(JUnit4.java:988)

[junit4.preconf]         at java.util.concurrent.FutureTask.run(FutureTask.java:277)

[junit4.preconf]         at java.util.concurrent.ThreadPoolExecutor.runWorker(ThreadPoolExecutor.java:1153)

[junit4.preconf]         at java.util.concurrent.ThreadPoolExecutor$Worker.run(ThreadPoolExecutor.java:628)

[junit4.preconf]         at java.lang.Thread.run(Thread.java:785)

    [junit] Test com.carrotsearch.ant.tasks.junit4.tests.bad.TestAbstract FAILED

    [junit] Test com.carrotsearch.ant.tasks.junit4.tests.bad.TestPackagePrivate FAILED