Build #20

Build: #20 was successful

Job: JDK 11 J9 was successful

Stages & jobs

  1. Compile and test

  2. Package

Build log

The build generated 817 lines of output. Download or view full build log

10-Mar-2014 11:46:10 Build RandomizedTesting - Software - IBM J9 1.7 #20 (RNDTEST-SOFTWARE-IBM17-20) started building on agent Local Agent 2
10-Mar-2014 11:46:10 Build working directory is /mnt/work/bamboo-home/xml-data/build-dir/RNDTEST-SOFTWARE-IBM17
10-Mar-2014 11:46:10 Executing build RandomizedTesting - Software - IBM J9 1.7 #20 (RNDTEST-SOFTWARE-IBM17-20)
10-Mar-2014 11:46:10 Starting task 'Checkout Default Repository' of type 'com.atlassian.bamboo.plugins.vcs:task.vcs.checkout'
10-Mar-2014 11:46:10 Updating source code to revision: c133a197194f61d2b320d8bd033d73cb9642b4df
10-Mar-2014 11:46:11 Fetching 'refs/heads/master' from 'https://github.com/carrotsearch/randomizedtesting.git'.
10-Mar-2014 11:46:12 Checking out revision c133a197194f61d2b320d8bd033d73cb9642b4df.
10-Mar-2014 11:46:12 Warning: you are leaving 15 commits behind, not connected to
10-Mar-2014 11:46:12 any of your branches:
10-Mar-2014 11:46:12
10-Mar-2014 11:46:12   e98dbc4 Squashed commit of the following:
10-Mar-2014 11:46:12   ff09aef Cleaned up some warnings.
10-Mar-2014 11:46:12   dd6c8e7 Fixes GH-144: Flush dynamic suites file when appending to it
10-Mar-2014 11:46:12   27e8ad7 Fixes GH-131: the bug was .min instead of .max (to bump the minimum in nightly/ multiplied runs, but still enforce it to be at least min). Simplified the implementation to just use scaling between 0..Integer.MAX_INTEGER.
10-Mar-2014 11:46:12 ... and 11 more.
10-Mar-2014 11:46:12
10-Mar-2014 11:46:12 If you want to keep them by creating a new branch, this may be a good time
10-Mar-2014 11:46:12 to do so with:
10-Mar-2014 11:46:12
10-Mar-2014 11:46:12 git branch new_branch_name e98dbc44d50d2d03be7bd93ceeb6b3c8f4690794
10-Mar-2014 11:46:12
10-Mar-2014 11:46:12 HEAD is now at c133a19... Merge branch 'gh-122'
10-Mar-2014 11:46:12 Updated source code to revision: c133a197194f61d2b320d8bd033d73cb9642b4df
10-Mar-2014 11:46:12 Finished task 'Checkout Default Repository'
10-Mar-2014 11:46:12 Running pre-build action: Clover Grails PreBuild Action
10-Mar-2014 11:46:12 Running pre-build action: VCS Version Collector
10-Mar-2014 11:46:12 Starting task 'Maven 3.x' of type 'com.atlassian.bamboo.plugins.maven:task.builder.mvn3'
10-Mar-2014 11:46:12
Beginning to execute external process for build 'RandomizedTesting - Software - IBM J9 1.7 #20 (RNDTEST-SOFTWARE-IBM17-20)'
... running command line:
/home/bamboo/tools/apache-maven-3.0.4/bin/mvn --batch-mode -Djava.io.tmpdir=/home/bamboo/bamboo-software/temp/RNDTEST-SOFTWARE-IBM17 clean verify
... in: /mnt/work/bamboo-home/xml-data/build-dir/RNDTEST-SOFTWARE-IBM17
... using extra environment variables:
bamboo_carrotsearch_download_staging_path=/srv/vhosts/staging-get.carrotsearch.com
bamboo_carrot2_download_host=gamma.carrotsearch.com
bamboo_carrotsearch_download_official_path=~/sites/download.carrotsearch.com
JAVA_HOME=/usr/lib/jvm/java-7-ibm
bamboo_carrotsearch_labs_ssh=carrotse@site5.carrot2.org:~/sites/labs.carrotsearch.com
useMavenReturnCode=false
bamboo_carrotsearch_secure_ssh=seccarro@site5.carrot2.org:~/www
bamboo_carrot2_website_ssh=carrot2o@site5.carrot2.org:~/sites/project.carrot2.org
bamboo_carrotsearch_download_staging_user=bamboo
bamboo_carrot2_download_path=/srv/vhosts/get.carrot2.org
M2_HOME=/home/bamboo/tools/apache-maven-3.0.4
bamboo_carrotsearch_download_official_host=download.carrotsearch.com
bamboo_csssprites_download_user=bamboo
bamboo_carrotsearch_download_staging_host=gamma.carrotsearch.com
bamboo_csssprites_download_path=/srv/vhosts/get.csssprites.org
bamboo_carrot2_download_user=bamboo
MAVEN2_HOME=/home/bamboo/tools/apache-maven-3.0.4
bamboo_carrotsearch_website_ssh=carrotse@site5.carrot2.org:~/sites/www.carrotsearch.com
bamboo_carrotsearch_download_official_user=carrotse
bamboo_csssprites_download_host=gamma.carrotsearch.com
PATH=/usr/lib/jvm/java-7-ibm/bin:/usr/local/bin:/usr/bin:/bin:/usr/local/games:/usr/games
10-Mar-2014 11:46:13 [INFO] Scanning for projects...
10-Mar-2014 11:46:14 [INFO] ------------------------------------------------------------------------
10-Mar-2014 11:46:14 [INFO] Reactor Build Order:
10-Mar-2014 11:46:14 [INFO]
10-Mar-2014 11:46:14 [INFO] RandomizedTesting Parent POM
10-Mar-2014 11:46:14 [INFO] RandomizedTesting Randomized Runner
10-Mar-2014 11:46:14 [INFO] RandomizedTesting JUnit4 ANT Task
10-Mar-2014 11:46:14 [INFO] RandomizedTesting JUnit4 Maven Plugin
10-Mar-2014 11:46:14 [INFO] RandomizedTesting JUnit4 Maven Plugin Tests
10-Mar-2014 11:46:14 [INFO] RandomizedTesting Examples
10-Mar-2014 11:46:14 [INFO] RandomizedTesting ANT Examples
10-Mar-2014 11:46:14 [INFO] RandomizedTesting Packaging
10-Mar-2014 11:46:14 [INFO]                                                                         
10-Mar-2014 11:46:14 [INFO] ------------------------------------------------------------------------
10-Mar-2014 11:46:14 [INFO] Building RandomizedTesting Parent POM 2.1.0-SNAPSHOT
10-Mar-2014 11:46:14 [INFO] ------------------------------------------------------------------------
10-Mar-2014 11:46:14 [INFO]
10-Mar-2014 11:46:14 [INFO] --- maven-clean-plugin:2.4.1:clean (default-clean) @ randomizedtesting-parent ---
10-Mar-2014 11:46:14 [INFO]
10-Mar-2014 11:46:14 [INFO] --- maven-enforcer-plugin:1.2:enforce (enforce-maven) @ randomizedtesting-parent ---
10-Mar-2014 11:46:14 [INFO]                                                                         
10-Mar-2014 11:46:14 [INFO] ------------------------------------------------------------------------
10-Mar-2014 11:46:14 [INFO] Building RandomizedTesting Randomized Runner 2.1.0-SNAPSHOT
10-Mar-2014 11:46:14 [INFO] ------------------------------------------------------------------------
10-Mar-2014 11:46:14 [INFO]
10-Mar-2014 11:46:14 [INFO] --- maven-clean-plugin:2.4.1:clean (default-clean) @ randomizedtesting-runner ---
10-Mar-2014 11:46:14 [INFO] Deleting /mnt/work/bamboo-home/xml-data/build-dir/RNDTEST-SOFTWARE-IBM17/randomized-runner/target
10-Mar-2014 11:46:14 [INFO]
10-Mar-2014 11:46:14 [INFO] --- maven-enforcer-plugin:1.2:enforce (enforce-maven) @ randomizedtesting-runner ---
10-Mar-2014 11:46:14 [INFO]
10-Mar-2014 11:46:14 [INFO] --- maven-resources-plugin:2.5:resources (default-resources) @ randomizedtesting-runner ---
10-Mar-2014 11:46:14 [debug] execute contextualize
10-Mar-2014 11:46:14 [INFO] Using 'UTF-8' encoding to copy filtered resources.
10-Mar-2014 11:46:14 [INFO] skip non existing resourceDirectory /mnt/work/bamboo-home/xml-data/build-dir/RNDTEST-SOFTWARE-IBM17/randomized-runner/src/main/resources
10-Mar-2014 11:46:14 [INFO]
10-Mar-2014 11:46:14 [INFO] --- maven-compiler-plugin:3.1:compile (default-compile) @ randomizedtesting-runner ---
10-Mar-2014 11:46:15 [INFO] Changes detected - recompiling the module!
10-Mar-2014 11:46:15 [INFO] Compiling 78 source files to /mnt/work/bamboo-home/xml-data/build-dir/RNDTEST-SOFTWARE-IBM17/randomized-runner/target/classes
10-Mar-2014 11:46:16 [WARNING] /mnt/work/bamboo-home/xml-data/build-dir/RNDTEST-SOFTWARE-IBM17/randomized-runner/src/main/java/com/carrotsearch/randomizedtesting/RandomizedRunner.java: Some input files use unchecked or unsafe operations.
10-Mar-2014 11:46:16 [WARNING] /mnt/work/bamboo-home/xml-data/build-dir/RNDTEST-SOFTWARE-IBM17/randomized-runner/src/main/java/com/carrotsearch/randomizedtesting/RandomizedRunner.java: Recompile with -Xlint:unchecked for details.
10-Mar-2014 11:46:16 [INFO]
10-Mar-2014 11:46:16 [INFO] --- maven-bundle-plugin:2.3.4:manifest (bundle-manifest) @ randomizedtesting-runner ---
10-Mar-2014 11:46:18 [INFO]
10-Mar-2014 11:46:18 [INFO] --- maven-resources-plugin:2.5:testResources (default-testResources) @ randomizedtesting-runner ---
10-Mar-2014 11:46:18 [debug] execute contextualize
10-Mar-2014 11:46:18 [INFO] Using 'UTF-8' encoding to copy filtered resources.
10-Mar-2014 11:46:18 [INFO] skip non existing resourceDirectory /mnt/work/bamboo-home/xml-data/build-dir/RNDTEST-SOFTWARE-IBM17/randomized-runner/src/test/resources
10-Mar-2014 11:46:18 [INFO]
10-Mar-2014 11:46:18 [INFO] --- maven-compiler-plugin:3.1:testCompile (default-testCompile) @ randomizedtesting-runner ---
10-Mar-2014 11:46:18 [INFO] Changes detected - recompiling the module!
10-Mar-2014 11:46:18 [INFO] Compiling 78 source files to /mnt/work/bamboo-home/xml-data/build-dir/RNDTEST-SOFTWARE-IBM17/randomized-runner/target/test-classes
10-Mar-2014 11:46:19 [WARNING] /mnt/work/bamboo-home/xml-data/build-dir/RNDTEST-SOFTWARE-IBM17/randomized-runner/src/test/java/com/carrotsearch/randomizedtesting/contracts/TestBeforeAfterMethodOrder.java: /mnt/work/bamboo-home/xml-data/build-dir/RNDTEST-SOFTWARE-IBM17/randomized-runner/src/test/java/com/carrotsearch/randomizedtesting/contracts/TestBeforeAfterMethodOrder.java uses or overrides a deprecated API.
10-Mar-2014 11:46:19 [WARNING] /mnt/work/bamboo-home/xml-data/build-dir/RNDTEST-SOFTWARE-IBM17/randomized-runner/src/test/java/com/carrotsearch/randomizedtesting/contracts/TestBeforeAfterMethodOrder.java: Recompile with -Xlint:deprecation for details.
10-Mar-2014 11:46:19 [INFO]
10-Mar-2014 11:46:19 [INFO] --- maven-surefire-plugin:2.10:test (default-test) @ randomizedtesting-runner ---
10-Mar-2014 11:46:19 [INFO] Surefire report directory: /mnt/work/bamboo-home/xml-data/build-dir/RNDTEST-SOFTWARE-IBM17/randomized-runner/target/surefire-reports
10-Mar-2014 11:46:19
10-Mar-2014 11:46:19 -------------------------------------------------------
10-Mar-2014 11:46:19 T E S T S
10-Mar-2014 11:46:19 -------------------------------------------------------
10-Mar-2014 11:46:19 Running com.carrotsearch.randomizedtesting.TestFilterExpressionParser
10-Mar-2014 11:46:19 Tests run: 5, Failures: 0, Errors: 0, Skipped: 0, Time elapsed: 0.071 sec
10-Mar-2014 11:46:19 Running com.carrotsearch.randomizedtesting.TestRandomInStaticInitializer
10-Mar-2014 11:46:19 Tests run: 1, Failures: 0, Errors: 0, Skipped: 0, Time elapsed: 0.086 sec
10-Mar-2014 11:46:19 Running com.carrotsearch.randomizedtesting.TestTestFiltering
10-Mar-2014 11:46:19 Tests run: 1, Failures: 0, Errors: 0, Skipped: 0, Time elapsed: 0.075 sec
10-Mar-2014 11:46:19 Running com.carrotsearch.randomizedtesting.TestOverridingDefaultExceptionHandler
10-Mar-2014 11:46:19 Tests run: 1, Failures: 0, Errors: 0, Skipped: 0, Time elapsed: 0.028 sec
10-Mar-2014 11:46:19 Running com.carrotsearch.randomizedtesting.TestExpected
10-Mar-2014 11:46:19 Tests run: 2, Failures: 0, Errors: 0, Skipped: 0, Time elapsed: 0.033 sec
10-Mar-2014 11:46:19 Running com.carrotsearch.randomizedtesting.TestOverlappingMethodProviders
10-Mar-2014 11:46:19 Tests run: 1, Failures: 0, Errors: 0, Skipped: 0, Time elapsed: 0 sec
10-Mar-2014 11:46:19 Running com.carrotsearch.randomizedtesting.TestSetSeedLocked
10-Mar-2014 11:46:19 Tests run: 1, Failures: 0, Errors: 0, Skipped: 0, Time elapsed: 0.006 sec
10-Mar-2014 11:46:19 Running com.carrotsearch.randomizedtesting.TestRules
10-Mar-2014 11:46:19 Tests run: 2, Failures: 0, Errors: 0, Skipped: 0, Time elapsed: 0.018 sec
10-Mar-2014 11:46:19 Running com.carrotsearch.randomizedtesting.TestJ9SysThreads
10-Mar-2014 11:46:19 Tests run: 1, Failures: 0, Errors: 0, Skipped: 0, Time elapsed: 0.021 sec
10-Mar-2014 11:46:19 Running com.carrotsearch.randomizedtesting.TestManyThreadsOOM
10-Mar-2014 11:46:37 Tests run: 10, Failures: 0, Errors: 0, Skipped: 0, Time elapsed: 17.344 sec
10-Mar-2014 11:46:37 Running com.carrotsearch.randomizedtesting.TestParameterized
10-Mar-2014 11:46:37 Tests run: 3, Failures: 0, Errors: 0, Skipped: 0, Time elapsed: 0.079 sec
10-Mar-2014 11:46:37 Running com.carrotsearch.randomizedtesting.TestFailurePropagationCompatibility
10-Mar-2014 11:46:37 Tests run: 1, Failures: 0, Errors: 0, Skipped: 0, Time elapsed: 0.319 sec
10-Mar-2014 11:46:37 Running com.carrotsearch.randomizedtesting.TestHooksWithEmptyTestSet
10-Mar-2014 11:46:37 Tests run: 1, Failures: 0, Errors: 0, Skipped: 0, Time elapsed: 0 sec
10-Mar-2014 11:46:37 Running com.carrotsearch.randomizedtesting.TestResourceDisposal
10-Mar-2014 11:46:37 Tests run: 3, Failures: 0, Errors: 0, Skipped: 0, Time elapsed: 0.025 sec
10-Mar-2014 11:46:37 Running com.carrotsearch.randomizedtesting.TestThreadNameContainsTestName
10-Mar-2014 11:46:37 Tests run: 3, Failures: 0, Errors: 0, Skipped: 0, Time elapsed: 0.008 sec
10-Mar-2014 11:46:37 Running com.carrotsearch.randomizedtesting.TestChildTestGroupThreads
10-Mar-2014 11:46:37 Tests run: 1, Failures: 0, Errors: 0, Skipped: 0, Time elapsed: 0.003 sec
10-Mar-2014 11:46:37 Running com.carrotsearch.randomizedtesting.TestSeedRepeatable
10-Mar-2014 11:46:37 Tests run: 1, Failures: 0, Errors: 0, Skipped: 0, Time elapsed: 0.008 sec
10-Mar-2014 11:46:37 Running com.carrotsearch.randomizedtesting.TestSeedParameterOptional
10-Mar-2014 11:46:37 Tests run: 1, Failures: 0, Errors: 0, Skipped: 0, Time elapsed: 0.014 sec
10-Mar-2014 11:46:37 Running com.carrotsearch.randomizedtesting.TestCustomMethodProvider
10-Mar-2014 11:46:37 Tests run: 2, Failures: 0, Errors: 0, Skipped: 0, Time elapsed: 0.012 sec
10-Mar-2014 11:46:37 Running com.carrotsearch.randomizedtesting.TestMacSysThreads
10-Mar-2014 11:46:42 Tests run: 1, Failures: 0, Errors: 0, Skipped: 0, Time elapsed: 5.047 sec
10-Mar-2014 11:46:42 Running com.carrotsearch.randomizedtesting.TestContextRandom
10-Mar-2014 11:46:42 Tests run: 3, Failures: 0, Errors: 0, Skipped: 1, Time elapsed: 0.042 sec
10-Mar-2014 11:46:42 Running com.carrotsearch.randomizedtesting.TestNightlyMode
10-Mar-2014 11:46:42 Tests run: 3, Failures: 0, Errors: 0, Skipped: 0, Time elapsed: 0.038 sec
10-Mar-2014 11:46:42 Running com.carrotsearch.randomizedtesting.TestSeedFixing
10-Mar-2014 11:46:42 Tests run: 1, Failures: 0, Errors: 0, Skipped: 0, Time elapsed: 0 sec
10-Mar-2014 11:46:42 Running com.carrotsearch.randomizedtesting.contracts.TestAnnotationInheritance
10-Mar-2014 11:46:42 Tests run: 1, Failures: 0, Errors: 0, Skipped: 0, Time elapsed: 0.006 sec
10-Mar-2014 11:46:42 Running com.carrotsearch.randomizedtesting.contracts.TestAssumptionsAtClassLevel
10-Mar-2014 11:46:42 Tests run: 1, Failures: 0, Errors: 0, Skipped: 0, Time elapsed: 0.006 sec
10-Mar-2014 11:46:42 Running com.carrotsearch.randomizedtesting.contracts.TestClassLevelIgnore
10-Mar-2014 11:46:42 Tests run: 1, Failures: 0, Errors: 0, Skipped: 0, Time elapsed: 0 sec
10-Mar-2014 11:46:42 Running com.carrotsearch.randomizedtesting.contracts.TestBeforeAfterMethodOrder
10-Mar-2014 11:46:43 Tests run: 2, Failures: 0, Errors: 0, Skipped: 0, Time elapsed: 0.044 sec
10-Mar-2014 11:46:43 Running com.carrotsearch.randomizedtesting.contracts.TestClassRules
10-Mar-2014 11:46:43 Tests run: 1, Failures: 0, Errors: 0, Skipped: 0, Time elapsed: 0.003 sec
10-Mar-2014 11:46:43 Running com.carrotsearch.randomizedtesting.timeouts.Test008SeedsAnnotation
10-Mar-2014 11:46:43 Tests run: 1, Failures: 0, Errors: 0, Skipped: 0, Time elapsed: 0.04 sec
10-Mar-2014 11:46:43 Running com.carrotsearch.randomizedtesting.timeouts.Test011RunawayThreads
10-Mar-2014 11:46:43 Tests run: 5, Failures: 0, Errors: 0, Skipped: 0, Time elapsed: 0.574 sec
10-Mar-2014 11:46:43 Running com.carrotsearch.randomizedtesting.timeouts.Test014Timeout
10-Mar-2014 11:46:43 Tests run: 1, Failures: 0, Errors: 0, Skipped: 0, Time elapsed: 0.22 sec
10-Mar-2014 11:46:43 Running com.carrotsearch.randomizedtesting.timeouts.Test001TimeoutSuite
10-Mar-2014 11:46:47 Tests run: 8, Failures: 0, Errors: 0, Skipped: 0, Time elapsed: 4.119 sec
10-Mar-2014 11:46:47 Running com.carrotsearch.randomizedtesting.timeouts.Test016ThreadLeaksCustomFilters
10-Mar-2014 11:46:47 Tests run: 1, Failures: 0, Errors: 0, Skipped: 0, Time elapsed: 0.012 sec
10-Mar-2014 11:46:47 Running com.carrotsearch.randomizedtesting.timeouts.Test002TimeoutMethod
10-Mar-2014 11:46:48 Tests run: 4, Failures: 0, Errors: 0, Skipped: 0, Time elapsed: 0.158 sec
10-Mar-2014 11:46:48 Running com.carrotsearch.randomizedtesting.timeouts.Test003ThreadLeaksMethod
10-Mar-2014 11:46:48 Tests run: 8, Failures: 0, Errors: 0, Skipped: 0, Time elapsed: 0.084 sec
10-Mar-2014 11:46:48 Running com.carrotsearch.randomizedtesting.timeouts.Test013ThreadLeaksScopeNone
10-Mar-2014 11:46:48 Tests run: 8, Failures: 0, Errors: 0, Skipped: 0, Time elapsed: 0.043 sec
10-Mar-2014 11:46:48 Running com.carrotsearch.randomizedtesting.timeouts.Test005ThreadLeaksSystemThreads
10-Mar-2014 11:46:48 Tests run: 1, Failures: 0, Errors: 0, Skipped: 0, Time elapsed: 0.316 sec
10-Mar-2014 11:46:48 Running com.carrotsearch.randomizedtesting.timeouts.Test015TimeoutOverride
10-Mar-2014 11:46:49 Tests run: 2, Failures: 0, Errors: 0, Skipped: 0, Time elapsed: 1.223 sec
10-Mar-2014 11:46:49 Running com.carrotsearch.randomizedtesting.timeouts.Test010Zombies
10-Mar-2014 11:46:50 Tests run: 8, Failures: 0, Errors: 0, Skipped: 0, Time elapsed: 0.636 sec
10-Mar-2014 11:46:50 Running com.carrotsearch.randomizedtesting.timeouts.Test007UncaughtExceptions
10-Mar-2014 11:46:50 Tests run: 2, Failures: 0, Errors: 0, Skipped: 0, Time elapsed: 0.014 sec
10-Mar-2014 11:46:50 Running com.carrotsearch.randomizedtesting.timeouts.Test004ThreadLeaksSuite
10-Mar-2014 11:46:50 Tests run: 8, Failures: 0, Errors: 0, Skipped: 0, Time elapsed: 0.052 sec
10-Mar-2014 11:46:50 Running com.carrotsearch.randomizedtesting.timeouts.Test017ThreadLeaksCustomFiltersException
10-Mar-2014 11:46:50 Tests run: 1, Failures: 0, Errors: 0, Skipped: 0, Time elapsed: 0.003 sec
10-Mar-2014 11:46:50 Running com.carrotsearch.randomizedtesting.timeouts.Test012RunawayThreadsKilledAtOnce
10-Mar-2014 11:46:50 Tests run: 1, Failures: 0, Errors: 0, Skipped: 0, Time elapsed: 0.017 sec
10-Mar-2014 11:46:50 Running com.carrotsearch.randomizedtesting.timeouts.Test019ThreadLeakGroup
10-Mar-2014 11:46:50 Tests run: 3, Failures: 0, Errors: 0, Skipped: 0, Time elapsed: 0.016 sec
10-Mar-2014 11:46:50 Running com.carrotsearch.randomizedtesting.timeouts.Test018TimeoutStacks
10-Mar-2014 11:46:51 Tests run: 1, Failures: 0, Errors: 0, Skipped: 0, Time elapsed: 1.007 sec
10-Mar-2014 11:46:51 Running com.carrotsearch.randomizedtesting.timeouts.Test006TimeoutAndThreadLeak
10-Mar-2014 11:46:55 Tests run: 8, Failures: 0, Errors: 0, Skipped: 0, Time elapsed: 4.09 sec
10-Mar-2014 11:46:55 Running com.carrotsearch.randomizedtesting.timeouts.Test009TimeoutOrNotIdenticalSequence
10-Mar-2014 11:46:55 Tests run: 1, Failures: 0, Errors: 0, Skipped: 0, Time elapsed: 0.022 sec
10-Mar-2014 11:46:55 Running com.carrotsearch.randomizedtesting.TestListenersAnnotation
10-Mar-2014 11:46:55 Tests run: 1, Failures: 0, Errors: 0, Skipped: 0, Time elapsed: 0.011 sec
10-Mar-2014 11:46:55 Running com.carrotsearch.randomizedtesting.rules.TestNoInstanceHooksOverridesRule
10-Mar-2014 11:46:55 Tests run: 4, Failures: 0, Errors: 0, Skipped: 0, Time elapsed: 0.028 sec
10-Mar-2014 11:46:55 Running com.carrotsearch.randomizedtesting.rules.TestStaticFieldsInvariantRule
10-Mar-2014 11:46:55 Tests run: 3, Failures: 0, Errors: 0, Skipped: 0, Time elapsed: 0.045 sec
10-Mar-2014 11:46:55 Running com.carrotsearch.randomizedtesting.rules.TestNoClassHooksShadowingRule
10-Mar-2014 11:46:55 Tests run: 3, Failures: 0, Errors: 0, Skipped: 0, Time elapsed: 0.021 sec
10-Mar-2014 11:46:55 Running com.carrotsearch.randomizedtesting.rules.TestSystemPropertiesInvariantRule
10-Mar-2014 11:46:55 Tests run: 4, Failures: 0, Errors: 0, Skipped: 0, Time elapsed: 0.015 sec
10-Mar-2014 11:46:55 Running com.carrotsearch.randomizedtesting.TestJUnit3MethodProvider
10-Mar-2014 11:46:55 Tests run: 3, Failures: 0, Errors: 0, Skipped: 0, Time elapsed: 0.01 sec
10-Mar-2014 11:46:55 Running com.carrotsearch.randomizedtesting.TestSeedDecorator
10-Mar-2014 11:46:55 Tests run: 1, Failures: 0, Errors: 0, Skipped: 0, Time elapsed: 0.011 sec
10-Mar-2014 11:46:55 Running com.carrotsearch.randomizedtesting.TestIterationsAnnotation
10-Mar-2014 11:46:55 Tests run: 10, Failures: 0, Errors: 0, Skipped: 0, Time elapsed: 0.01 sec
10-Mar-2014 11:46:55 Running com.carrotsearch.randomizedtesting.TestValidation
10-Mar-2014 11:46:55 Tests run: 1, Failures: 0, Errors: 0, Skipped: 0, Time elapsed: 0.005 sec
10-Mar-2014 11:46:55 Running com.carrotsearch.randomizedtesting.generators.TestRandomPicks
10-Mar-2014 11:46:55 Tests run: 4, Failures: 0, Errors: 0, Skipped: 0, Time elapsed: 0.007 sec
10-Mar-2014 11:46:55 Running com.carrotsearch.randomizedtesting.generators.TestUnicodeGenerator
10-Mar-2014 11:46:55 Tests run: 41, Failures: 0, Errors: 0, Skipped: 0, Time elapsed: 0.038 sec
10-Mar-2014 11:46:55 Running com.carrotsearch.randomizedtesting.generators.TestCodepointSetGenerator
10-Mar-2014 11:46:56 Tests run: 125, Failures: 0, Errors: 0, Skipped: 0, Time elapsed: 0.124 sec
10-Mar-2014 11:46:56 Running com.carrotsearch.randomizedtesting.generators.TestRealisticUnicodeGenerator
10-Mar-2014 11:46:56 Tests run: 41, Failures: 0, Errors: 0, Skipped: 0, Time elapsed: 0.031 sec
10-Mar-2014 11:46:56 Running com.carrotsearch.randomizedtesting.TestIgnoredRunCount
10-Mar-2014 11:46:56 Tests run: 1, Failures: 0, Errors: 0, Skipped: 0, Time elapsed: 0.002 sec
10-Mar-2014 11:46:56 Running com.carrotsearch.randomizedtesting.TestTestGroups
10-Mar-2014 11:46:56 Tests run: 4, Failures: 0, Errors: 0, Skipped: 0, Time elapsed: 0.05 sec
10-Mar-2014 11:46:56 Running com.carrotsearch.randomizedtesting.TestFormattingRandomSeeds
10-Mar-2014 11:46:56 Tests run: 1003, Failures: 0, Errors: 0, Skipped: 0, Time elapsed: 0.631 sec
10-Mar-2014 11:46:56 Running com.carrotsearch.randomizedtesting.TestUncaughtExceptionsDuplicated
10-Mar-2014 11:46:56 Tests run: 3, Failures: 0, Errors: 0, Skipped: 0, Time elapsed: 0.021 sec
10-Mar-2014 11:46:56 Running com.carrotsearch.randomizedtesting.TestHookMethodOrderWithExceptions
10-Mar-2014 11:46:56 Tests run: 20, Failures: 0, Errors: 0, Skipped: 0, Time elapsed: 0.058 sec
10-Mar-2014 11:46:56 Running com.carrotsearch.randomizedtesting.TestRandomizedTest
10-Mar-2014 11:46:57 Tests run: 19, Failures: 0, Errors: 0, Skipped: 0, Time elapsed: 0.28 sec
10-Mar-2014 11:46:57 Running com.carrotsearch.randomizedtesting.TestStackAugmentation
10-Mar-2014 11:46:57 Tests run: 3, Failures: 0, Errors: 0, Skipped: 0, Time elapsed: 0.012 sec
10-Mar-2014 11:46:57 Running com.carrotsearch.randomizedtesting.TestSeedFixingWithProperties
10-Mar-2014 11:46:57 Tests run: 2, Failures: 0, Errors: 0, Skipped: 0, Time elapsed: 0.012 sec
10-Mar-2014 11:46:57 Running com.carrotsearch.randomizedtesting.TestFilteringWarnings
10-Mar-2014 11:46:57 Tests run: 4, Failures: 0, Errors: 0, Skipped: 0, Time elapsed: 0.02 sec
10-Mar-2014 11:46:57 Running com.carrotsearch.randomizedtesting.TestOutOfScopeRandomUse
10-Mar-2014 11:46:57 Tests run: 2, Failures: 0, Errors: 0, Skipped: 0, Time elapsed: 0.011 sec
10-Mar-2014 11:46:57 Running com.carrotsearch.randomizedtesting.TestInstantiationTime
10-Mar-2014 11:46:57 Tests run: 1, Failures: 0, Errors: 0, Skipped: 0, Time elapsed: 0.003 sec
10-Mar-2014 11:46:57 Running com.carrotsearch.randomizedtesting.TestClassMethodFiltering
10-Mar-2014 11:46:57 Tests run: 5, Failures: 0, Errors: 0, Skipped: 0, Time elapsed: 0.017 sec
10-Mar-2014 11:46:57
10-Mar-2014 11:46:57 Results :
10-Mar-2014 11:46:57
10-Mar-2014 11:46:57 Tests run: 1435, Failures: 0, Errors: 0, Skipped: 1
10-Mar-2014 11:46:57
10-Mar-2014 11:46:57 [INFO]
10-Mar-2014 11:46:57 [INFO] --- maven-jar-plugin:2.3.2:jar (default-jar) @ randomizedtesting-runner ---
10-Mar-2014 11:46:57 [INFO] Building jar: /mnt/work/bamboo-home/xml-data/build-dir/RNDTEST-SOFTWARE-IBM17/randomized-runner/target/randomizedtesting-runner-2.1.0-SNAPSHOT.jar
10-Mar-2014 11:46:57 [INFO]                                                                         
10-Mar-2014 11:46:57 [INFO] ------------------------------------------------------------------------
10-Mar-2014 11:46:57 [INFO] Building RandomizedTesting JUnit4 ANT Task 2.1.0-SNAPSHOT
10-Mar-2014 11:46:57 [INFO] ------------------------------------------------------------------------
10-Mar-2014 11:46:57 [INFO]
10-Mar-2014 11:46:57 [INFO] --- maven-clean-plugin:2.4.1:clean (default-clean) @ junit4-ant ---
10-Mar-2014 11:46:57 [INFO] Deleting /mnt/work/bamboo-home/xml-data/build-dir/RNDTEST-SOFTWARE-IBM17/junit4-ant/target
10-Mar-2014 11:46:57 [INFO]
10-Mar-2014 11:46:57 [INFO] --- maven-enforcer-plugin:1.2:enforce (enforce-maven) @ junit4-ant ---
10-Mar-2014 11:46:57 [INFO]
10-Mar-2014 11:46:57 [INFO] --- maven-resources-plugin:2.5:resources (default-resources) @ junit4-ant ---
10-Mar-2014 11:46:57 [debug] execute contextualize
10-Mar-2014 11:46:57 [INFO] Using 'UTF-8' encoding to copy filtered resources.
10-Mar-2014 11:46:57 [INFO] Copying 15 resources
10-Mar-2014 11:46:57 [INFO]
10-Mar-2014 11:46:57 [INFO] --- maven-compiler-plugin:3.1:compile (default-compile) @ junit4-ant ---
10-Mar-2014 11:46:57 [INFO] Changes detected - recompiling the module!
10-Mar-2014 11:46:57 [INFO] Compiling 94 source files to /mnt/work/bamboo-home/xml-data/build-dir/RNDTEST-SOFTWARE-IBM17/junit4-ant/target/classes
10-Mar-2014 11:46:58 [INFO]
10-Mar-2014 11:46:58 [INFO] --- maven-resources-plugin:2.5:testResources (default-testResources) @ junit4-ant ---
10-Mar-2014 11:46:58 [debug] execute contextualize
10-Mar-2014 11:46:58 [INFO] Using 'UTF-8' encoding to copy filtered resources.
10-Mar-2014 11:46:58 [INFO] Copying 2 resources
10-Mar-2014 11:46:58 [INFO]
10-Mar-2014 11:46:58 [INFO] --- maven-compiler-plugin:3.1:testCompile (default-testCompile) @ junit4-ant ---
10-Mar-2014 11:46:58 [INFO] Changes detected - recompiling the module!
10-Mar-2014 11:46:58 [INFO] Compiling 97 source files to /mnt/work/bamboo-home/xml-data/build-dir/RNDTEST-SOFTWARE-IBM17/junit4-ant/target/test-classes
10-Mar-2014 11:46:58 [INFO]
10-Mar-2014 11:46:58 [INFO] --- maven-surefire-plugin:2.10:test (default-test) @ junit4-ant ---
10-Mar-2014 11:46:58 [INFO] Surefire report directory: /mnt/work/bamboo-home/xml-data/build-dir/RNDTEST-SOFTWARE-IBM17/junit4-ant/target/surefire-reports
10-Mar-2014 11:46:58
10-Mar-2014 11:46:58 -------------------------------------------------------
10-Mar-2014 11:46:58 T E S T S
10-Mar-2014 11:46:58 -------------------------------------------------------
10-Mar-2014 11:46:58 Running com.carrotsearch.ant.tasks.junit4.TestJsonByteArrayRoundtrip
10-Mar-2014 11:46:59 Tests run: 101, Failures: 0, Errors: 0, Skipped: 0, Time elapsed: 0.563 sec
10-Mar-2014 11:46:59 Running com.carrotsearch.ant.tasks.junit4.TestXmlStringsRoundtrip
10-Mar-2014 11:46:59 Tests run: 101, Failures: 0, Errors: 0, Skipped: 0, Time elapsed: 0.537 sec
10-Mar-2014 11:46:59 Running com.carrotsearch.ant.tasks.junit4.TestEventBusSanityCheck
10-Mar-2014 11:47:00 Tests run: 100, Failures: 0, Errors: 0, Skipped: 0, Time elapsed: 1.135 sec
10-Mar-2014 11:47:00
10-Mar-2014 11:47:00 Results :
10-Mar-2014 11:47:00
10-Mar-2014 11:47:00 Tests run: 302, Failures: 0, Errors: 0, Skipped: 0
10-Mar-2014 11:47:00
10-Mar-2014 11:47:00 [INFO]
10-Mar-2014 11:47:00 [INFO] --- maven-jar-plugin:2.3.2:jar (default-jar) @ junit4-ant ---
10-Mar-2014 11:47:01 [INFO] Building jar: /mnt/work/bamboo-home/xml-data/build-dir/RNDTEST-SOFTWARE-IBM17/junit4-ant/target/junit4-ant-2.1.0-SNAPSHOT.jar
10-Mar-2014 11:47:01 [INFO]
10-Mar-2014 11:47:01 [INFO] --- maven-dependency-plugin:2.3:copy-dependencies (copy-dependencies) @ junit4-ant ---
10-Mar-2014 11:47:01 [INFO] Copying junit-4.10.jar to /mnt/work/bamboo-home/xml-data/build-dir/RNDTEST-SOFTWARE-IBM17/junit4-ant/target/dependency/junit-4.10.jar
10-Mar-2014 11:47:01 [INFO] Copying randomizedtesting-runner-2.1.0-SNAPSHOT.jar to /mnt/work/bamboo-home/xml-data/build-dir/RNDTEST-SOFTWARE-IBM17/junit4-ant/target/dependency/randomizedtesting-runner-2.1.0-SNAPSHOT.jar
10-Mar-2014 11:47:01 [INFO] Copying asm-5.0_BETA.jar to /mnt/work/bamboo-home/xml-data/build-dir/RNDTEST-SOFTWARE-IBM17/junit4-ant/target/dependency/asm-5.0_BETA.jar
10-Mar-2014 11:47:01 [INFO]
10-Mar-2014 11:47:01 [INFO] >>> exec-maven-plugin:1.2.1:java (default) @ junit4-ant >>>
10-Mar-2014 11:47:01 [INFO]
10-Mar-2014 11:47:01 [INFO] --- maven-enforcer-plugin:1.2:enforce (enforce-maven) @ junit4-ant ---
10-Mar-2014 11:47:01 [INFO]
10-Mar-2014 11:47:01 [INFO] <<< exec-maven-plugin:1.2.1:java (default) @ junit4-ant <<<
10-Mar-2014 11:47:01 [INFO]
10-Mar-2014 11:47:01 [INFO] --- exec-maven-plugin:1.2.1:java (default) @ junit4-ant ---
10-Mar-2014 11:47:01 Dumping rt.jar path to: /mnt/work/bamboo-home/xml-data/build-dir/RNDTEST-SOFTWARE-IBM17/junit4-ant/target/rt.jar.pro
10-Mar-2014 11:47:01 [INFO]
10-Mar-2014 11:47:01 [INFO] --- proguard-maven-plugin:2.0.4:proguard (default) @ junit4-ant ---
10-Mar-2014 11:47:01 [INFO] execute ProGuard [-injars, '/home/bamboo/.m2/repository/com/google/guava/guava/16.0.1/guava-16.0.1.jar'(!META-INF/MANIFEST.MF,!com/google/common/eventbus/SynchronizedEventHandler.class), -injars, '/home/bamboo/.m2/repository/org/ow2/asm/asm/5.0_BETA/asm-5.0_BETA.jar'(!META-INF/MANIFEST.MF), -injars, '/home/bamboo/.m2/repository/commons-io/commons-io/2.3/commons-io-2.3.jar'(!META-INF/MANIFEST.MF), -injars, '/home/bamboo/.m2/repository/org/simpleframework/simple-xml/2.6.2/simple-xml-2.6.2.jar'(!META-INF/MANIFEST.MF), -injars, '/home/bamboo/.m2/repository/com/google/code/gson/gson/2.0/gson-2.0.jar'(!META-INF/MANIFEST.MF), -injars, '/mnt/work/bamboo-home/xml-data/build-dir/RNDTEST-SOFTWARE-IBM17/randomized-runner/target/randomizedtesting-runner-2.1.0-SNAPSHOT.jar'(!META-INF/MANIFEST.MF), -injars, '/mnt/work/bamboo-home/xml-data/build-dir/RNDTEST-SOFTWARE-IBM17/junit4-ant/target/junit4-ant-2.1.0-SNAPSHOT_proguard_base.jar', -outjars, '/mnt/work/bamboo-home/xml-data/build-dir/RNDTEST-SOFTWARE-IBM17/junit4-ant/target/junit4-ant-2.1.0-SNAPSHOT.jar', -include, '/mnt/work/bamboo-home/xml-data/build-dir/RNDTEST-SOFTWARE-IBM17/junit4-ant/src/proguard/rules.pro', -libraryjars, '/home/bamboo/.m2/repository/org/apache/ant/ant/1.8.2/ant-1.8.2.jar', -libraryjars, '/home/bamboo/.m2/repository/org/apache/ant/ant-launcher/1.8.2/ant-launcher-1.8.2.jar', -libraryjars, '/home/bamboo/.m2/repository/org/apache/ant/ant-junit/1.8.2/ant-junit-1.8.2.jar', -libraryjars, '/home/bamboo/.m2/repository/junit/junit/4.10/junit-4.10.jar', -libraryjars, '/home/bamboo/.m2/repository/stax/stax-api/1.0.1/stax-api-1.0.1.jar', -libraryjars, '/home/bamboo/.m2/repository/stax/stax/1.2.0/stax-1.2.0.jar', -libraryjars, '/home/bamboo/.m2/repository/xpp3/xpp3/1.1.3.3/xpp3-1.1.3.3.jar', -printmapping, '/mnt/work/bamboo-home/xml-data/build-dir/RNDTEST-SOFTWARE-IBM17/junit4-ant/target/proguard_map.txt', -printseeds, '/mnt/work/bamboo-home/xml-data/build-dir/RNDTEST-SOFTWARE-IBM17/junit4-ant/target/proguard_seeds.txt', -include /mnt/work/bamboo-home/xml-data/build-dir/RNDTEST-SOFTWARE-IBM17/junit4-ant/target/rt.jar.pro, -printusage /mnt/work/bamboo-home/xml-data/build-dir/RNDTEST-SOFTWARE-IBM17/junit4-ant/target/proguard_dead.txt]
10-Mar-2014 11:47:01 [INFO] proguard jar: /mnt/work/bamboo-home/xml-data/build-dir/RNDTEST-SOFTWARE-IBM17/junit4-ant/lib/proguard.jar
10-Mar-2014 11:47:01 [proguard] ProGuard, version 4.7 beta2
10-Mar-2014 11:47:01 [proguard] Reading program jar [/home/bamboo/.m2/repository/com/google/guava/guava/16.0.1/guava-16.0.1.jar] (filtered)
10-Mar-2014 11:47:03 [proguard] Reading program jar [/home/bamboo/.m2/repository/org/ow2/asm/asm/5.0_BETA/asm-5.0_BETA.jar] (filtered)
10-Mar-2014 11:47:03 [proguard] Reading program jar [/home/bamboo/.m2/repository/commons-io/commons-io/2.3/commons-io-2.3.jar] (filtered)
10-Mar-2014 11:47:03 [proguard] Reading program jar [/home/bamboo/.m2/repository/org/simpleframework/simple-xml/2.6.2/simple-xml-2.6.2.jar] (filtered)
10-Mar-2014 11:47:03 [proguard] Reading program jar [/home/bamboo/.m2/repository/com/google/code/gson/gson/2.0/gson-2.0.jar] (filtered)
10-Mar-2014 11:47:03 [proguard] Reading program jar [/mnt/work/bamboo-home/xml-data/build-dir/RNDTEST-SOFTWARE-IBM17/randomized-runner/target/randomizedtesting-runner-2.1.0-SNAPSHOT.jar] (filtered)
10-Mar-2014 11:47:03 [proguard] Reading program jar [/mnt/work/bamboo-home/xml-data/build-dir/RNDTEST-SOFTWARE-IBM17/junit4-ant/target/junit4-ant-2.1.0-SNAPSHOT_proguard_base.jar]
10-Mar-2014 11:47:03 [proguard] Reading library jar [/home/bamboo/.m2/repository/org/apache/ant/ant/1.8.2/ant-1.8.2.jar]
10-Mar-2014 11:47:03 [proguard] Reading library jar [/home/bamboo/.m2/repository/org/apache/ant/ant-launcher/1.8.2/ant-launcher-1.8.2.jar]
10-Mar-2014 11:47:03 [proguard] Reading library jar [/home/bamboo/.m2/repository/org/apache/ant/ant-junit/1.8.2/ant-junit-1.8.2.jar]
10-Mar-2014 11:47:03 [proguard] Reading library jar [/home/bamboo/.m2/repository/junit/junit/4.10/junit-4.10.jar]
10-Mar-2014 11:47:03 [proguard] Reading library jar [/home/bamboo/.m2/repository/stax/stax-api/1.0.1/stax-api-1.0.1.jar]
10-Mar-2014 11:47:04 [proguard] Reading library jar [/home/bamboo/.m2/repository/stax/stax/1.2.0/stax-1.2.0.jar]
10-Mar-2014 11:47:04 [proguard] Reading library jar [/home/bamboo/.m2/repository/xpp3/xpp3/1.1.3.3/xpp3-1.1.3.3.jar]
10-Mar-2014 11:47:04 [proguard] Reading library jar [/usr/lib/jvm/java-7-ibm/jre/lib/amd64/compressedrefs/jclSC170/vm.jar] (filtered)
10-Mar-2014 11:47:04 [proguard] Reading library jar [/usr/lib/jvm/java-7-ibm/jre/lib/jlm.jar] (filtered)
10-Mar-2014 11:47:04 [proguard] Reading library jar [/usr/lib/jvm/java-7-ibm/jre/lib/math.jar] (filtered)
10-Mar-2014 11:47:04 [proguard] Reading library jar [/usr/lib/jvm/java-7-ibm/jre/lib/rt.jar] (filtered)
10-Mar-2014 11:47:05 [proguard] Reading library jar [/usr/lib/jvm/java-7-ibm/jre/lib/xml.jar] (filtered)
10-Mar-2014 11:47:09 [proguard] Preparing output jar [/mnt/work/bamboo-home/xml-data/build-dir/RNDTEST-SOFTWARE-IBM17/junit4-ant/target/junit4-ant-2.1.0-SNAPSHOT.jar]
10-Mar-2014 11:47:09 [proguard]   Copying resources from program jar [/home/bamboo/.m2/repository/com/google/guava/guava/16.0.1/guava-16.0.1.jar] (filtered)
10-Mar-2014 11:47:10 [proguard]   Copying resources from program jar [/home/bamboo/.m2/repository/org/ow2/asm/asm/5.0_BETA/asm-5.0_BETA.jar] (filtered)
10-Mar-2014 11:47:10 [proguard]   Copying resources from program jar [/home/bamboo/.m2/repository/commons-io/commons-io/2.3/commons-io-2.3.jar] (filtered)
10-Mar-2014 11:47:10 [proguard]   Copying resources from program jar [/home/bamboo/.m2/repository/org/simpleframework/simple-xml/2.6.2/simple-xml-2.6.2.jar] (filtered)
10-Mar-2014 11:47:10 [proguard]   Copying resources from program jar [/home/bamboo/.m2/repository/com/google/code/gson/gson/2.0/gson-2.0.jar] (filtered)
10-Mar-2014 11:47:10 [proguard]   Copying resources from program jar [/mnt/work/bamboo-home/xml-data/build-dir/RNDTEST-SOFTWARE-IBM17/randomized-runner/target/randomizedtesting-runner-2.1.0-SNAPSHOT.jar] (filtered)
10-Mar-2014 11:47:10 [proguard]   Copying resources from program jar [/mnt/work/bamboo-home/xml-data/build-dir/RNDTEST-SOFTWARE-IBM17/junit4-ant/target/junit4-ant-2.1.0-SNAPSHOT_proguard_base.jar]
10-Mar-2014 11:47:10 [INFO]
10-Mar-2014 11:47:10 [INFO] --- maven-surefire-plugin:2.10:test (surefire-it) @ junit4-ant ---
10-Mar-2014 11:47:10 [INFO] Surefire report directory: /mnt/work/bamboo-home/xml-data/build-dir/RNDTEST-SOFTWARE-IBM17/junit4-ant/target/surefire-reports
10-Mar-2014 11:47:10
10-Mar-2014 11:47:10 -------------------------------------------------------
10-Mar-2014 11:47:10 T E S T S
10-Mar-2014 11:47:10 -------------------------------------------------------
10-Mar-2014 11:47:10 Running com.carrotsearch.ant.tasks.junit4.it.TestAntXmlReport
10-Mar-2014 11:47:12 Tests run: 1, Failures: 0, Errors: 0, Skipped: 0, Time elapsed: 2.187 sec
10-Mar-2014 11:47:12 Running com.carrotsearch.ant.tasks.junit4.it.TestSysPropertySet
10-Mar-2014 11:47:13 Tests run: 1, Failures: 0, Errors: 0, Skipped: 0, Time elapsed: 0.807 sec
10-Mar-2014 11:47:13 Running com.carrotsearch.ant.tasks.junit4.it.TestPickSeed
10-Mar-2014 11:47:19 Tests run: 1, Failures: 0, Errors: 0, Skipped: 0, Time elapsed: 5.536 sec
10-Mar-2014 11:47:19 Running com.carrotsearch.ant.tasks.junit4.it.TestAltJavaVendors
10-Mar-2014 11:47:19 Tests run: 1, Failures: 0, Errors: 0, Skipped: 1, Time elapsed: 0.077 sec
10-Mar-2014 11:47:19 Running com.carrotsearch.ant.tasks.junit4.it.TestShutdownHookDeadlock
10-Mar-2014 11:47:25 Tests run: 1, Failures: 0, Errors: 0, Skipped: 0, Time elapsed: 6.634 sec
10-Mar-2014 11:47:25 Running com.carrotsearch.ant.tasks.junit4.it.TestSysoutOOM
10-Mar-2014 11:47:30 Tests run: 1, Failures: 0, Errors: 0, Skipped: 0, Time elapsed: 4.367 sec
10-Mar-2014 11:47:30 Running com.carrotsearch.ant.tasks.junit4.it.TestJsonReport
10-Mar-2014 11:47:32 Tests run: 1, Failures: 0, Errors: 0, Skipped: 0, Time elapsed: 1.693 sec
10-Mar-2014 11:47:32 Running com.carrotsearch.ant.tasks.junit4.it.TestCwdConflict
10-Mar-2014 11:47:32 Tests run: 1, Failures: 0, Errors: 0, Skipped: 0, Time elapsed: 0.959 sec
10-Mar-2014 11:47:32 Running com.carrotsearch.ant.tasks.junit4.it.TestCrashesAndExceptions
10-Mar-2014 11:47:36 Tests run: 2, Failures: 0, Errors: 0, Skipped: 0, Time elapsed: 3.849 sec
10-Mar-2014 11:47:36 Running com.carrotsearch.ant.tasks.junit4.it.TestOomPermGen
10-Mar-2014 11:47:36 Tests run: 1, Failures: 0, Errors: 0, Skipped: 1, Time elapsed: 0.001 sec
10-Mar-2014 11:47:36 Running com.carrotsearch.ant.tasks.junit4.it.TestJvmLogging
10-Mar-2014 11:47:38 Tests run: 2, Failures: 0, Errors: 0, Skipped: 0, Time elapsed: 2.131 sec
10-Mar-2014 11:47:38 Running com.carrotsearch.ant.tasks.junit4.it.TestTextReport
10-Mar-2014 11:48:03 Tests run: 12, Failures: 0, Errors: 0, Skipped: 0, Time elapsed: 24.185 sec
10-Mar-2014 11:48:03 Running com.carrotsearch.ant.tasks.junit4.it.TestJUnitCompat
10-Mar-2014 11:48:03 Tests run: 3, Failures: 0, Errors: 0, Skipped: 0, Time elapsed: 0.156 sec
10-Mar-2014 11:48:03 Running com.carrotsearch.ant.tasks.junit4.it.TestUnhandledSlaveFailure
10-Mar-2014 11:48:06 Tests run: 1, Failures: 0, Errors: 0, Skipped: 0, Time elapsed: 2.967 sec
10-Mar-2014 11:48:06 Running com.carrotsearch.ant.tasks.junit4.it.TestSysProperties
10-Mar-2014 11:48:13 Tests run: 6, Failures: 0, Errors: 0, Skipped: 0, Time elapsed: 6.808 sec
10-Mar-2014 11:48:13 Running com.carrotsearch.ant.tasks.junit4.it.TestReplication
10-Mar-2014 11:48:17 Tests run: 3, Failures: 0, Errors: 0, Skipped: 0, Time elapsed: 4.116 sec
10-Mar-2014 11:48:17 Running com.carrotsearch.ant.tasks.junit4.it.TestSuiteClassesBad
10-Mar-2014 11:48:18 Tests run: 2, Failures: 0, Errors: 0, Skipped: 0, Time elapsed: 1.02 sec
10-Mar-2014 11:48:18 Running com.carrotsearch.ant.tasks.junit4.it.TestMiscJUnit4Attributes
10-Mar-2014 11:48:40 Tests run: 16, Failures: 0, Errors: 0, Skipped: 0, Time elapsed: 22.257 sec
10-Mar-2014 11:48:40 Running com.carrotsearch.ant.tasks.junit4.it.TestStatsProperties
10-Mar-2014 11:48:42 Tests run: 1, Failures: 0, Errors: 0, Skipped: 0, Time elapsed: 2.257 sec
10-Mar-2014 11:48:42 Running com.carrotsearch.ant.tasks.junit4.it.TestOomCode
10-Mar-2014 11:48:42 Tests run: 1, Failures: 0, Errors: 0, Skipped: 1, Time elapsed: 0 sec
10-Mar-2014 11:48:42 Running com.carrotsearch.ant.tasks.junit4.it.TestFiltering
10-Mar-2014 11:48:46 Tests run: 3, Failures: 0, Errors: 0, Skipped: 0, Time elapsed: 3.409 sec
10-Mar-2014 11:48:46 Running com.carrotsearch.ant.tasks.junit4.it.TestSuiteDuplicates
10-Mar-2014 11:48:47 Tests run: 1, Failures: 0, Errors: 0, Skipped: 0, Time elapsed: 0.953 sec
10-Mar-2014 11:48:47 Running com.carrotsearch.ant.tasks.junit4.it.TestChildVmSysprops
10-Mar-2014 11:48:47 Tests run: 1, Failures: 0, Errors: 0, Skipped: 0, Time elapsed: 0.675 sec
10-Mar-2014 11:48:47 Running com.carrotsearch.ant.tasks.junit4.it.TestIfNoTestsOption
10-Mar-2014 11:48:53 Tests run: 6, Failures: 0, Errors: 0, Skipped: 0, Time elapsed: 5.387 sec
10-Mar-2014 11:48:53 Running com.carrotsearch.ant.tasks.junit4.it.TestPreconditions
10-Mar-2014 11:49:01 Tests run: 4, Failures: 0, Errors: 0, Skipped: 0, Time elapsed: 7.953 sec
10-Mar-2014 11:49:01 Running com.carrotsearch.ant.tasks.junit4.it.TestSourceSuitesAsInput
10-Mar-2014 11:49:02 Tests run: 1, Failures: 0, Errors: 0, Skipped: 0, Time elapsed: 0.955 sec
10-Mar-2014 11:49:02 Running com.carrotsearch.ant.tasks.junit4.it.TestOutputCapture
10-Mar-2014 11:49:04 Tests run: 3, Failures: 0, Errors: 0, Skipped: 0, Time elapsed: 2.662 sec
10-Mar-2014 11:49:04 Running com.carrotsearch.ant.tasks.junit4.it.TestFileEncodings
10-Mar-2014 11:49:09 Tests run: 1, Failures: 0, Errors: 0, Skipped: 0, Time elapsed: 4.863 sec
10-Mar-2014 11:49:09 Running com.carrotsearch.ant.tasks.junit4.it.TestHeartbeat
10-Mar-2014 11:49:13 Tests run: 1, Failures: 0, Errors: 0, Skipped: 0, Time elapsed: 3.941 sec
10-Mar-2014 11:49:13 Running com.carrotsearch.ant.tasks.junit4.it.TestWeirdClasses
10-Mar-2014 11:49:13 Tests run: 1, Failures: 0, Errors: 0, Skipped: 0, Time elapsed: 0.101 sec
10-Mar-2014 11:49:13 Running com.carrotsearch.ant.tasks.junit4.it.TestDuplicateResourceCollections
10-Mar-2014 11:49:14 Tests run: 1, Failures: 0, Errors: 0, Skipped: 0, Time elapsed: 1.226 sec
10-Mar-2014 11:49:14
10-Mar-2014 11:49:14 Results :
10-Mar-2014 11:49:14
10-Mar-2014 11:49:14 Tests run: 81, Failures: 0, Errors: 0, Skipped: 3
10-Mar-2014 11:49:14
10-Mar-2014 11:49:14 [INFO]                                                                         
10-Mar-2014 11:49:14 [INFO] ------------------------------------------------------------------------
10-Mar-2014 11:49:14 [INFO] Building RandomizedTesting JUnit4 Maven Plugin 2.1.0-SNAPSHOT
10-Mar-2014 11:49:14 [INFO] ------------------------------------------------------------------------
10-Mar-2014 11:49:14 [INFO]
10-Mar-2014 11:49:14 [INFO] --- maven-clean-plugin:2.4.1:clean (default-clean) @ junit4-maven-plugin ---
10-Mar-2014 11:49:14 [INFO] Deleting /mnt/work/bamboo-home/xml-data/build-dir/RNDTEST-SOFTWARE-IBM17/junit4-maven-plugin/target
10-Mar-2014 11:49:14 [INFO]
10-Mar-2014 11:49:14 [INFO] --- maven-enforcer-plugin:1.2:enforce (enforce-maven) @ junit4-maven-plugin ---
10-Mar-2014 11:49:14 [INFO]
10-Mar-2014 11:49:14 [INFO] --- maven-plugin-plugin:3.2:helpmojo (generated-helpmojo) @ junit4-maven-plugin ---
10-Mar-2014 11:49:15 [INFO] Using 'UTF-8' encoding to read mojo metadata.
10-Mar-2014 11:49:15 [INFO] Applying mojo extractor for language: java
10-Mar-2014 11:49:15 [INFO] Mojo extractor for language: java found 1 mojo descriptors.
10-Mar-2014 11:49:15 [INFO]
10-Mar-2014 11:49:15 [INFO] --- maven-plugin-plugin:3.2:descriptor (default-descriptor) @ junit4-maven-plugin ---
10-Mar-2014 11:49:15 [INFO] Using 'UTF-8' encoding to read mojo metadata.
10-Mar-2014 11:49:15 [INFO] Applying mojo extractor for language: java
10-Mar-2014 11:49:15 [INFO] Mojo extractor for language: java found 2 mojo descriptors.
10-Mar-2014 11:49:15 [INFO]
10-Mar-2014 11:49:15 [INFO] --- maven-resources-plugin:2.5:resources (default-resources) @ junit4-maven-plugin ---
10-Mar-2014 11:49:15 [debug] execute contextualize
10-Mar-2014 11:49:15 [INFO] Using 'UTF-8' encoding to copy filtered resources.
10-Mar-2014 11:49:15 [INFO] skip non existing resourceDirectory /mnt/work/bamboo-home/xml-data/build-dir/RNDTEST-SOFTWARE-IBM17/junit4-maven-plugin/src/main/resources
10-Mar-2014 11:49:15 [INFO]
10-Mar-2014 11:49:15 [INFO] --- maven-compiler-plugin:3.1:compile (default-compile) @ junit4-maven-plugin ---
10-Mar-2014 11:49:15 [INFO] Changes detected - recompiling the module!
10-Mar-2014 11:49:15 [INFO] Compiling 3 source files to /mnt/work/bamboo-home/xml-data/build-dir/RNDTEST-SOFTWARE-IBM17/junit4-maven-plugin/target/classes
10-Mar-2014 11:49:15 [INFO]
10-Mar-2014 11:49:15 [INFO] --- maven-resources-plugin:2.5:testResources (default-testResources) @ junit4-maven-plugin ---
10-Mar-2014 11:49:15 [debug] execute contextualize
10-Mar-2014 11:49:15 [INFO] Using 'UTF-8' encoding to copy filtered resources.
10-Mar-2014 11:49:15 [INFO] skip non existing resourceDirectory /mnt/work/bamboo-home/xml-data/build-dir/RNDTEST-SOFTWARE-IBM17/junit4-maven-plugin/src/test/resources
10-Mar-2014 11:49:15 [INFO]
10-Mar-2014 11:49:15 [INFO] --- maven-compiler-plugin:3.1:testCompile (default-testCompile) @ junit4-maven-plugin ---
10-Mar-2014 11:49:15 [INFO] No sources to compile
10-Mar-2014 11:49:15 [INFO]
10-Mar-2014 11:49:15 [INFO] --- maven-surefire-plugin:2.10:test (default-test) @ junit4-maven-plugin ---
10-Mar-2014 11:49:15 [INFO] No tests to run.
10-Mar-2014 11:49:15 [INFO] Surefire report directory: /mnt/work/bamboo-home/xml-data/build-dir/RNDTEST-SOFTWARE-IBM17/junit4-maven-plugin/target/surefire-reports
10-Mar-2014 11:49:15
10-Mar-2014 11:49:15 -------------------------------------------------------
10-Mar-2014 11:49:15 T E S T S
10-Mar-2014 11:49:15 -------------------------------------------------------
10-Mar-2014 11:49:15
10-Mar-2014 11:49:15 Results :
10-Mar-2014 11:49:15
10-Mar-2014 11:49:15 Tests run: 0, Failures: 0, Errors: 0, Skipped: 0
10-Mar-2014 11:49:15
10-Mar-2014 11:49:15 [INFO]
10-Mar-2014 11:49:15 [INFO] --- maven-jar-plugin:2.3.2:jar (default-jar) @ junit4-maven-plugin ---
10-Mar-2014 11:49:15 [INFO] Building jar: /mnt/work/bamboo-home/xml-data/build-dir/RNDTEST-SOFTWARE-IBM17/junit4-maven-plugin/target/junit4-maven-plugin-2.1.0-SNAPSHOT.jar
10-Mar-2014 11:49:15 [INFO]
10-Mar-2014 11:49:15 [INFO] --- maven-plugin-plugin:3.2:addPluginArtifactMetadata (default-addPluginArtifactMetadata) @ junit4-maven-plugin ---
10-Mar-2014 11:49:15 [INFO]                                                                         
10-Mar-2014 11:49:15 [INFO] ------------------------------------------------------------------------
10-Mar-2014 11:49:15 [INFO] Building RandomizedTesting JUnit4 Maven Plugin Tests 2.1.0-SNAPSHOT
10-Mar-2014 11:49:15 [INFO] ------------------------------------------------------------------------
10-Mar-2014 11:49:15 [INFO]
10-Mar-2014 11:49:15 [INFO] --- maven-clean-plugin:2.4.1:clean (default-clean) @ junit4-maven-plugin-tests ---
10-Mar-2014 11:49:15 [INFO] Deleting /mnt/work/bamboo-home/xml-data/build-dir/RNDTEST-SOFTWARE-IBM17/junit4-maven-plugin-tests/target
10-Mar-2014 11:49:15 [INFO]
10-Mar-2014 11:49:15 [INFO] --- maven-enforcer-plugin:1.2:enforce (enforce-maven) @ junit4-maven-plugin-tests ---
10-Mar-2014 11:49:15 [INFO]
10-Mar-2014 11:49:15 [INFO] --- maven-resources-plugin:2.5:resources (default-resources) @ junit4-maven-plugin-tests ---
10-Mar-2014 11:49:15 [debug] execute contextualize
10-Mar-2014 11:49:15 [INFO] Using 'UTF-8' encoding to copy filtered resources.
10-Mar-2014 11:49:15 [INFO] skip non existing resourceDirectory /mnt/work/bamboo-home/xml-data/build-dir/RNDTEST-SOFTWARE-IBM17/junit4-maven-plugin-tests/src/main/resources
10-Mar-2014 11:49:15 [INFO]
10-Mar-2014 11:49:15 [INFO] --- maven-compiler-plugin:3.1:compile (default-compile) @ junit4-maven-plugin-tests ---
10-Mar-2014 11:49:15 [INFO] No sources to compile
10-Mar-2014 11:49:15 [INFO]
10-Mar-2014 11:49:15 [INFO] --- maven-resources-plugin:2.5:testResources (default-testResources) @ junit4-maven-plugin-tests ---
10-Mar-2014 11:49:15 [debug] execute contextualize
10-Mar-2014 11:49:15 [INFO] Using 'UTF-8' encoding to copy filtered resources.
10-Mar-2014 11:49:15 [INFO] skip non existing resourceDirectory /mnt/work/bamboo-home/xml-data/build-dir/RNDTEST-SOFTWARE-IBM17/junit4-maven-plugin-tests/src/test/resources
10-Mar-2014 11:49:15 [INFO]
10-Mar-2014 11:49:15 [INFO] --- maven-compiler-plugin:3.1:testCompile (default-testCompile) @ junit4-maven-plugin-tests ---
10-Mar-2014 11:49:15 [INFO] Changes detected - recompiling the module!
10-Mar-2014 11:49:15 [INFO] Compiling 1 source file to /mnt/work/bamboo-home/xml-data/build-dir/RNDTEST-SOFTWARE-IBM17/junit4-maven-plugin-tests/target/test-classes
10-Mar-2014 11:49:16 [INFO]
10-Mar-2014 11:49:16 [INFO] --- maven-surefire-plugin:2.10:test (default-test) @ junit4-maven-plugin-tests ---
10-Mar-2014 11:49:16 [INFO] Surefire report directory: /mnt/work/bamboo-home/xml-data/build-dir/RNDTEST-SOFTWARE-IBM17/junit4-maven-plugin-tests/target/surefire-reports
10-Mar-2014 11:49:16
10-Mar-2014 11:49:16 -------------------------------------------------------
10-Mar-2014 11:49:16 T E S T S
10-Mar-2014 11:49:16 -------------------------------------------------------
10-Mar-2014 11:49:16
10-Mar-2014 11:49:16 Results :
10-Mar-2014 11:49:16
10-Mar-2014 11:49:16 Tests run: 0, Failures: 0, Errors: 0, Skipped: 0
10-Mar-2014 11:49:16
10-Mar-2014 11:49:16 [INFO]
10-Mar-2014 11:49:16 [INFO] --- maven-jar-plugin:2.3.2:jar (default-jar) @ junit4-maven-plugin-tests ---
10-Mar-2014 11:49:16 [WARNING] JAR will be empty - no content was marked for inclusion!
10-Mar-2014 11:49:16 [INFO] Building jar: /mnt/work/bamboo-home/xml-data/build-dir/RNDTEST-SOFTWARE-IBM17/junit4-maven-plugin-tests/target/junit4-maven-plugin-tests-2.1.0-SNAPSHOT.jar
10-Mar-2014 11:49:16 [INFO]
10-Mar-2014 11:49:16 [INFO] --- maven-invoker-plugin:1.5:install (integration-test) @ junit4-maven-plugin-tests ---
10-Mar-2014 11:49:16 [INFO] Installing /mnt/work/bamboo-home/xml-data/build-dir/RNDTEST-SOFTWARE-IBM17/randomized-runner/pom.xml to /mnt/work/bamboo-home/xml-data/build-dir/RNDTEST-SOFTWARE-IBM17/junit4-maven-plugin-tests/target/local-repo/com/carrotsearch/randomizedtesting/randomizedtesting-runner/2.1.0-SNAPSHOT/randomizedtesting-runner-2.1.0-SNAPSHOT.pom
10-Mar-2014 11:49:16 [INFO] Installing /mnt/work/bamboo-home/xml-data/build-dir/RNDTEST-SOFTWARE-IBM17/randomized-runner/target/randomizedtesting-runner-2.1.0-SNAPSHOT.jar to /mnt/work/bamboo-home/xml-data/build-dir/RNDTEST-SOFTWARE-IBM17/junit4-maven-plugin-tests/target/local-repo/com/carrotsearch/randomizedtesting/randomizedtesting-runner/2.1.0-SNAPSHOT/randomizedtesting-runner-2.1.0-SNAPSHOT.jar
10-Mar-2014 11:49:16 [INFO] Installing /mnt/work/bamboo-home/xml-data/build-dir/RNDTEST-SOFTWARE-IBM17/pom.xml to /mnt/work/bamboo-home/xml-data/build-dir/RNDTEST-SOFTWARE-IBM17/junit4-maven-plugin-tests/target/local-repo/com/carrotsearch/randomizedtesting/randomizedtesting-parent/2.1.0-SNAPSHOT/randomizedtesting-parent-2.1.0-SNAPSHOT.pom
10-Mar-2014 11:49:16 [INFO] Installing /mnt/work/bamboo-home/xml-data/build-dir/RNDTEST-SOFTWARE-IBM17/junit4-maven-plugin/pom.xml to /mnt/work/bamboo-home/xml-data/build-dir/RNDTEST-SOFTWARE-IBM17/junit4-maven-plugin-tests/target/local-repo/com/carrotsearch/randomizedtesting/junit4-maven-plugin/2.1.0-SNAPSHOT/junit4-maven-plugin-2.1.0-SNAPSHOT.pom
10-Mar-2014 11:49:16 [INFO] Installing /mnt/work/bamboo-home/xml-data/build-dir/RNDTEST-SOFTWARE-IBM17/junit4-maven-plugin/target/junit4-maven-plugin-2.1.0-SNAPSHOT.jar to /mnt/work/bamboo-home/xml-data/build-dir/RNDTEST-SOFTWARE-IBM17/junit4-maven-plugin-tests/target/local-repo/com/carrotsearch/randomizedtesting/junit4-maven-plugin/2.1.0-SNAPSHOT/junit4-maven-plugin-2.1.0-SNAPSHOT.jar
10-Mar-2014 11:49:16 [INFO] Installing /mnt/work/bamboo-home/xml-data/build-dir/RNDTEST-SOFTWARE-IBM17/junit4-ant/pom.xml to /mnt/work/bamboo-home/xml-data/build-dir/RNDTEST-SOFTWARE-IBM17/junit4-maven-plugin-tests/target/local-repo/com/carrotsearch/randomizedtesting/junit4-ant/2.1.0-SNAPSHOT/junit4-ant-2.1.0-SNAPSHOT.pom
10-Mar-2014 11:49:16 [INFO] Installing /mnt/work/bamboo-home/xml-data/build-dir/RNDTEST-SOFTWARE-IBM17/junit4-ant/target/junit4-ant-2.1.0-SNAPSHOT.jar to /mnt/work/bamboo-home/xml-data/build-dir/RNDTEST-SOFTWARE-IBM17/junit4-maven-plugin-tests/target/local-repo/com/carrotsearch/randomizedtesting/junit4-ant/2.1.0-SNAPSHOT/junit4-ant-2.1.0-SNAPSHOT.jar
10-Mar-2014 11:49:16 [INFO] Installing /mnt/work/bamboo-home/xml-data/build-dir/RNDTEST-SOFTWARE-IBM17/junit4-maven-plugin-tests/pom.xml to /mnt/work/bamboo-home/xml-data/build-dir/RNDTEST-SOFTWARE-IBM17/junit4-maven-plugin-tests/target/local-repo/com/carrotsearch/randomizedtesting/junit4-maven-plugin-tests/2.1.0-SNAPSHOT/junit4-maven-plugin-tests-2.1.0-SNAPSHOT.pom
10-Mar-2014 11:49:16 [INFO] Installing /mnt/work/bamboo-home/xml-data/build-dir/RNDTEST-SOFTWARE-IBM17/junit4-maven-plugin-tests/target/junit4-maven-plugin-tests-2.1.0-SNAPSHOT.jar to /mnt/work/bamboo-home/xml-data/build-dir/RNDTEST-SOFTWARE-IBM17/junit4-maven-plugin-tests/target/local-repo/com/carrotsearch/randomizedtesting/junit4-maven-plugin-tests/2.1.0-SNAPSHOT/junit4-maven-plugin-tests-2.1.0-SNAPSHOT.jar
10-Mar-2014 11:49:16 [INFO]
10-Mar-2014 11:49:16 [INFO] --- maven-invoker-plugin:1.5:run (integration-test) @ junit4-maven-plugin-tests ---
10-Mar-2014 11:49:16 [INFO] Building: 01-basic-test/pom.xml
10-Mar-2014 11:49:21 [INFO] ..SUCCESS (4.8 s)
10-Mar-2014 11:49:21 [INFO] -------------------------------------------------
10-Mar-2014 11:49:21 [INFO] Build Summary:
10-Mar-2014 11:49:21 [INFO]   Passed: 1, Failed: 0, Errors: 0, Skipped: 0
10-Mar-2014 11:49:21 [INFO] -------------------------------------------------
10-Mar-2014 11:49:21 [INFO]                                                                         
10-Mar-2014 11:49:21 [INFO] ------------------------------------------------------------------------
10-Mar-2014 11:49:21 [INFO] Building RandomizedTesting Examples 2.1.0-SNAPSHOT
10-Mar-2014 11:49:21 [INFO] ------------------------------------------------------------------------
10-Mar-2014 11:49:21 [INFO]
10-Mar-2014 11:49:21 [INFO] --- maven-clean-plugin:2.4.1:clean (default-clean) @ randomizedtesting-examples ---
10-Mar-2014 11:49:21 [INFO] Deleting /mnt/work/bamboo-home/xml-data/build-dir/RNDTEST-SOFTWARE-IBM17/examples/maven/target
10-Mar-2014 11:49:21 [INFO]
10-Mar-2014 11:49:21 [INFO] --- maven-enforcer-plugin:1.2:enforce (enforce-maven) @ randomizedtesting-examples ---
10-Mar-2014 11:49:21 [INFO]
10-Mar-2014 11:49:21 [INFO] --- maven-resources-plugin:2.5:resources (default-resources) @ randomizedtesting-examples ---
10-Mar-2014 11:49:21 [debug] execute contextualize
10-Mar-2014 11:49:21 [INFO] Using 'UTF-8' encoding to copy filtered resources.
10-Mar-2014 11:49:21 [INFO] skip non existing resourceDirectory /mnt/work/bamboo-home/xml-data/build-dir/RNDTEST-SOFTWARE-IBM17/examples/maven/src/main/resources
10-Mar-2014 11:49:21 [INFO]
10-Mar-2014 11:49:21 [INFO] --- maven-compiler-plugin:3.1:compile (default-compile) @ randomizedtesting-examples ---
10-Mar-2014 11:49:21 [INFO] Changes detected - recompiling the module!
10-Mar-2014 11:49:21 [INFO] Compiling 25 source files to /mnt/work/bamboo-home/xml-data/build-dir/RNDTEST-SOFTWARE-IBM17/examples/maven/target/classes
10-Mar-2014 11:49:21 [INFO]
10-Mar-2014 11:49:21 [INFO] --- maven-resources-plugin:2.5:testResources (default-testResources) @ randomizedtesting-examples ---
10-Mar-2014 11:49:21 [debug] execute contextualize
10-Mar-2014 11:49:21 [INFO] Using 'UTF-8' encoding to copy filtered resources.
10-Mar-2014 11:49:21 [INFO] skip non existing resourceDirectory /mnt/work/bamboo-home/xml-data/build-dir/RNDTEST-SOFTWARE-IBM17/examples/maven/src/test/resources
10-Mar-2014 11:49:21 [INFO]
10-Mar-2014 11:49:21 [INFO] --- maven-compiler-plugin:3.1:testCompile (default-testCompile) @ randomizedtesting-examples ---
10-Mar-2014 11:49:21 [INFO] No sources to compile
10-Mar-2014 11:49:21 [INFO]
10-Mar-2014 11:49:21 [INFO] --- maven-surefire-plugin:2.10:test (default-test) @ randomizedtesting-examples ---
10-Mar-2014 11:49:21 [INFO] Tests are skipped.
10-Mar-2014 11:49:21 [INFO]
10-Mar-2014 11:49:21 [INFO] --- junit4-maven-plugin:2.1.0-SNAPSHOT:junit4 (junit4-tests) @ randomizedtesting-examples ---
10-Mar-2014 11:49:22 [INFO] <JUnit4> says hi! Master seed: B063C508D3DB87C7
10-Mar-2014 11:49:22 [INFO] Your default console's encoding may not display certain unicode glyphs: US-ASCII
10-Mar-2014 11:49:22 Executing 25 suites with 1 JVM.
10-Mar-2014 11:49:22
10-Mar-2014 11:49:22 Started J0 PID(8877@n19h65).
10-Mar-2014 11:49:23 IGNOR/A 0.01s | Test012TestGroups.usesDisplay
10-Mar-2014 11:49:23 OK      0.00s | Test006RepeatingTests.halfAndHalf {#0 seed=[B063C508D3DB87C7:8706B5DF818532BB]}
10-Mar-2014 11:49:23 OK      0.00s | Test006RepeatingTests.halfAndHalf {#1 seed=[B063C508D3DB87C7:33500923B547F997]}
10-Mar-2014 11:49:23 FAILURE 0.01s | Test006RepeatingTests.halfAndHalf {#2 seed=[B063C508D3DB87C7:BDB99FFFE483B15C]} <<<
10-Mar-2014 11:49:23 FAILURE 0.01s | Test006RepeatingTests.halfAndHalf {#3 seed=[B063C508D3DB87C7:8C57341A887DEA75]} <<<
10-Mar-2014 11:49:23 FAILURE 0.01s | Test006RepeatingTests.halfAndHalf {#4 seed=[B063C508D3DB87C7:C096B1B729752ACE]} <<<
10-Mar-2014 11:49:23 OK      0.00s | Test006RepeatingTests.halfAndHalf {#5 seed=[B063C508D3DB87C7:516C62E854C967CE]}
10-Mar-2014 11:49:23 FAILURE 0.01s | Test006RepeatingTests.halfAndHalf {#6 seed=[B063C508D3DB87C7:6FB2066E46F977C8]} <<<
10-Mar-2014 11:49:23 OK      0.00s | Test006RepeatingTests.halfAndHalf {#7 seed=[B063C508D3DB87C7:F3019C1465EDE366]}
10-Mar-2014 11:49:23 OK      0.00s | Test006RepeatingTests.halfAndHalf {#8 seed=[B063C508D3DB87C7:C1AD797A1226F43C]}
10-Mar-2014 11:49:23 FAILURE 0.01s | Test006RepeatingTests.halfAndHalf {#9 seed=[B063C508D3DB87C7:16262FC07671C36E]} <<<
10-Mar-2014 11:49:23 FAILURE 0.01s | Test006RepeatingTests.repeatFailure {#0 seed=[B063C508D3DB87C7:F00DDEAD]} <<<
10-Mar-2014 11:49:23 FAILURE 0.01s | Test006RepeatingTests.repeatFailure {#1 seed=[B063C508D3DB87C7:F00DDEAD]} <<<
10-Mar-2014 11:49:23 FAILURE 0.01s | Test006RepeatingTests.repeatFailure {#2 seed=[B063C508D3DB87C7:F00DDEAD]} <<<
10-Mar-2014 11:49:23 FAILURE 0.01s | Test006RepeatingTests.repeatFailure {#3 seed=[B063C508D3DB87C7:F00DDEAD]} <<<
10-Mar-2014 11:49:23 FAILURE 0.01s | Test006RepeatingTests.repeatFailure {#4 seed=[B063C508D3DB87C7:F00DDEAD]} <<<
10-Mar-2014 11:49:23 IGNOR/A 0.00s | Test011NightlyTests.nightlyOnly
10-Mar-2014 11:49:23 OK      0.00s | Test011NightlyTests.scaling
10-Mar-2014 11:49:23 IGNOR/A 0.01s | Test011NightlyTests.nightlyOnlyWithAssume
10-Mar-2014 11:49:23 ERROR   0.00s | Test007BeforeClassError (suite) <<<
10-Mar-2014 11:49:23 ERROR   0.01s | Test003MultipleFailures.testCase <<<
10-Mar-2014 11:49:23 ERROR   0.00s | Test003MultipleFailures (suite) <<<
10-Mar-2014 11:49:24 ERROR   0.04s | Test009ThreadLeaks.leftOverThread <<<
10-Mar-2014 11:49:24 OK      1.00s | Test009ThreadLeaks.noLeakHere
10-Mar-2014 11:49:24 OK      0.00s | Test004MoreRandomness$OrderRandomized.method1
10-Mar-2014 11:49:24 OK      0.00s | Test004MoreRandomness$OrderRandomized.method3
10-Mar-2014 11:49:24 OK      0.00s | Test004MoreRandomness$OrderRandomized.method2
10-Mar-2014 11:49:24 OK      0.00s | Test004MoreRandomness$OrderRandomizedButFixed.method1
10-Mar-2014 11:49:24 OK      0.00s | Test004MoreRandomness$OrderRandomizedButFixed.method3
10-Mar-2014 11:49:24 OK      0.00s | Test004MoreRandomness$OrderRandomizedButFixed.method2
10-Mar-2014 11:49:24 OK      0.00s | Test004MoreRandomness$OrderRegression.regression {#0 seed=[B063C508D3DB87C7:DEADBEEF]}
10-Mar-2014 11:49:24 OK      0.00s | Test004MoreRandomness$OrderRegression.regression {#1 seed=[B063C508D3DB87C7:93E99A0E2B939437]}
10-Mar-2014 11:49:24 FAILURE 0.01s | Test005RecoveringRandomSeed.failure <<<
10-Mar-2014 11:49:24 OK      0.00s | Test005RecoveringRandomSeed.printContext
10-Mar-2014 11:49:24 FAILURE 0.01s | Test014Listeners.failure <<<
10-Mar-2014 11:49:24 OK      0.00s | Test002ExtendingRandomizedTest.getContextByHand
10-Mar-2014 11:49:24 OK      0.00s | Test002ExtendingRandomizedTest.getContextFromSuper
10-Mar-2014 11:49:25 ERROR   0.52s | Test008Timeouts.standardAnnotation <<<
10-Mar-2014 11:49:25 ERROR   0.51s | Test008Timeouts.timeoutAnnotation <<<
10-Mar-2014 11:49:25 ERROR   0.00s | Test007BeforeClassErrorRR (suite) <<<
10-Mar-2014 11:49:25 ERROR   0.00s | Test003UsingRandomness.expectNoException <<<
10-Mar-2014 11:49:25 OK      0.00s | Test003UsingRandomness.randomizedTesting
10-Mar-2014 11:49:25 OK      0.00s | Test003UsingRandomness.fixedTesting
10-Mar-2014 11:49:26 OK      0.03s | Test010Lingering.executorLeak {#0 seed=[B063C508D3DB87C7:ED712BFA0D4F582E]}
10-Mar-2014 11:49:26 OK      0.02s | Test010Lingering.executorLeak {#1 seed=[B063C508D3DB87C7:59279706398D9302]}
10-Mar-2014 11:49:26 OK      0.02s | Test010Lingering.executorLeak {#2 seed=[B063C508D3DB87C7:D7CE01DA6849DBC9]}
10-Mar-2014 11:49:26 OK      0.02s | Test010Lingering.executorLeak {#3 seed=[B063C508D3DB87C7:E620AA3F04B780E0]}
10-Mar-2014 11:49:26 OK      0.02s | Test010Lingering.executorLeak {#4 seed=[B063C508D3DB87C7:AAE12F92A5BF405B]}
10-Mar-2014 11:49:26 OK      0.03s | Test010Lingering.executorLeak {#5 seed=[B063C508D3DB87C7:3B1BFCCDD8030D5B]}
10-Mar-2014 11:49:26 OK      0.03s | Test010Lingering.executorLeak {#6 seed=[B063C508D3DB87C7:5C5984BCA331D5D]}
10-Mar-2014 11:49:26 OK      0.02s | Test010Lingering.executorLeak {#7 seed=[B063C508D3DB87C7:99760231E92789F3]}
10-Mar-2014 11:49:26 OK      0.03s | Test010Lingering.executorLeak {#8 seed=[B063C508D3DB87C7:ABDAE75F9EEC9EA9]}
10-Mar-2014 11:49:26 OK      0.02s | Test010Lingering.executorLeak {#9 seed=[B063C508D3DB87C7:7C51B1E5FABBA9FB]}
10-Mar-2014 11:49:26 OK      1.00s | Test010Lingering.lingerForLeftOverThread
10-Mar-2014 11:49:26 ERROR   0.00s | Test002SuiteFailure (suite) <<<
10-Mar-2014 11:49:26 OK      0.00s | Test001SimpleUseCase.success
10-Mar-2014 11:49:26 OK      0.00s | Test004SuiteOfNested$Subclass1.passed
10-Mar-2014 11:49:26 IGNOR/A 0.00s | Test004SuiteOfNested$Subclass1.ignored_assumption
10-Mar-2014 11:49:26 FAILURE 0.00s | Test004SuiteOfNested$Subclass1.failure <<<
10-Mar-2014 11:49:26 ERROR   0.00s | Test004SuiteOfNested$Subclass1.error <<<
10-Mar-2014 11:49:26 OK      0.00s | Test004SuiteOfNested$Subclass2.passed
10-Mar-2014 11:49:26 IGNOR/A 0.00s | Test004SuiteOfNested$Subclass2.ignored_assumption
10-Mar-2014 11:49:26 FAILURE 0.00s | Test004SuiteOfNested$Subclass2.failure <<<
10-Mar-2014 11:49:26 ERROR   0.00s | Test004SuiteOfNested$Subclass2.error <<<
10-Mar-2014 11:49:26 OK      0.00s | Test004SuiteOfNested$Subclass3.passed
10-Mar-2014 11:49:26 IGNOR/A 0.00s | Test004SuiteOfNested$Subclass3.ignored_assumption
10-Mar-2014 11:49:26 FAILURE 0.00s | Test004SuiteOfNested$Subclass3.failure <<<
10-Mar-2014 11:49:26 ERROR   0.00s | Test004SuiteOfNested$Subclass3.error <<<
10-Mar-2014 11:49:26 OK      0.00s | Test007ParameterizedTests.paramsWithRepeatAndSeeds {#0 value=1 string=abc seed=[B063C508D3DB87C7:DEADBEEF]}
10-Mar-2014 11:49:26 OK      0.00s | Test007ParameterizedTests.paramsWithRepeatAndSeeds {#1 value=1 string=abc seed=[B063C508D3DB87C7:DEADBEEF]}
10-Mar-2014 11:49:26 OK      0.00s | Test007ParameterizedTests.paramsWithRepeatAndSeeds {#2 value=1 string=abc seed=[B063C508D3DB87C7:CAFEBABE]}
10-Mar-2014 11:49:26 OK      0.00s | Test007ParameterizedTests.paramsWithRepeatAndSeeds {#3 value=1 string=abc seed=[B063C508D3DB87C7:CAFEBABE]}
10-Mar-2014 11:49:26 OK      0.00s | Test007ParameterizedTests.simpleArgumentsConsumer {value=1 string=abc}
10-Mar-2014 11:49:26 OK      0.00s | Test007ParameterizedTests.paramsWithRepeatAndSeeds {#0 value=2 string=def seed=[B063C508D3DB87C7:DEADBEEF]}
10-Mar-2014 11:49:26 OK      0.00s | Test007ParameterizedTests.paramsWithRepeatAndSeeds {#1 value=2 string=def seed=[B063C508D3DB87C7:DEADBEEF]}
10-Mar-2014 11:49:26 OK      0.00s | Test007ParameterizedTests.paramsWithRepeatAndSeeds {#2 value=2 string=def seed=[B063C508D3DB87C7:CAFEBABE]}
10-Mar-2014 11:49:26 OK      0.00s | Test007ParameterizedTests.paramsWithRepeatAndSeeds {#3 value=2 string=def seed=[B063C508D3DB87C7:CAFEBABE]}
10-Mar-2014 11:49:26 OK      0.00s | Test007ParameterizedTests.simpleArgumentsConsumer {value=2 string=def}
10-Mar-2014 11:49:27 ERROR   0.00s | Test015CustomMethodProviders.initializationError <<<
10-Mar-2014 11:49:27 OK      0.00s | Test001AllStatuses.passed
10-Mar-2014 11:49:27 IGNOR/A 0.00s | Test001AllStatuses.ignored_assumption
10-Mar-2014 11:49:27 FAILURE 0.00s | Test001AllStatuses.failure <<<
10-Mar-2014 11:49:27 ERROR   0.00s | Test001AllStatuses.error <<<
10-Mar-2014 11:49:27 OK      0.00s | Test005WithOutput.stdout
10-Mar-2014 11:49:27 OK      0.00s | Test005WithOutput.stdout_eol
10-Mar-2014 11:49:27 OK      0.00s | Test005WithOutput.stderr
10-Mar-2014 11:49:27 OK      0.00s | Test005WithOutput.stderr_eol
10-Mar-2014 11:49:27 OK      0.00s | Test005WithOutput.stderr_stdout_interwoven
10-Mar-2014 11:49:27 OK      0.01s | Test005WithOutput.longline
10-Mar-2014 11:49:28 ERROR   0.00s | Test006BeforeClassFailure (suite) <<<
10-Mar-2014 11:49:28 ERROR   0.00s | Test006BeforeClassFailureRR (suite) <<<
10-Mar-2014 11:49:28
10-Mar-2014 11:49:28 Tests with failures (first 3 out of 32):
10-Mar-2014 11:49:28   - com.carrotsearch.examples.randomizedrunner.Test006RepeatingTests.halfAndHalf {#2 seed=[B063C508D3DB87C7:BDB99FFFE483B15C]}
10-Mar-2014 11:49:28   - com.carrotsearch.examples.randomizedrunner.Test006RepeatingTests.halfAndHalf {#3 seed=[B063C508D3DB87C7:8C57341A887DEA75]}
10-Mar-2014 11:49:28   - com.carrotsearch.examples.randomizedrunner.Test006RepeatingTests.halfAndHalf {#4 seed=[B063C508D3DB87C7:C096B1B729752ACE]}
10-Mar-2014 11:49:28
10-Mar-2014 11:49:28
10-Mar-2014 11:49:28 [INFO] JVM J0:     0.30 ..     6.31 =     6.01s
10-Mar-2014 11:49:28 [INFO] Execution time total: 6.32 sec.
10-Mar-2014 11:49:28 [INFO] Tests summary: 25 suites, 90 tests, 7 suite-level errors, 10 errors, 16 failures, 12 ignored (7 assumptions)
10-Mar-2014 11:49:28 [INFO]
10-Mar-2014 11:49:28 [INFO] --- maven-jar-plugin:2.3.2:jar (default-jar) @ randomizedtesting-examples ---
10-Mar-2014 11:49:28 [INFO] Building jar: /mnt/work/bamboo-home/xml-data/build-dir/RNDTEST-SOFTWARE-IBM17/examples/maven/target/randomizedtesting-examples-2.1.0-SNAPSHOT.jar
10-Mar-2014 11:49:28 [INFO]                                                                         
10-Mar-2014 11:49:28 [INFO] ------------------------------------------------------------------------
10-Mar-2014 11:49:28 [INFO] Building RandomizedTesting ANT Examples 2.1.0-SNAPSHOT
10-Mar-2014 11:49:28 [INFO] ------------------------------------------------------------------------
10-Mar-2014 11:49:28 [INFO]
10-Mar-2014 11:49:28 [INFO] --- maven-clean-plugin:2.4.1:clean (default-clean) @ randomizedtesting-examples-ant ---
10-Mar-2014 11:49:28 [INFO] Deleting /mnt/work/bamboo-home/xml-data/build-dir/RNDTEST-SOFTWARE-IBM17/examples/ant/target
10-Mar-2014 11:49:28 [INFO]
10-Mar-2014 11:49:28 [INFO] --- maven-enforcer-plugin:1.2:enforce (enforce-maven) @ randomizedtesting-examples-ant ---
10-Mar-2014 11:49:28 [INFO]
10-Mar-2014 11:49:28 [INFO] --- maven-resources-plugin:2.5:resources (default-resources) @ randomizedtesting-examples-ant ---
10-Mar-2014 11:49:28 [debug] execute contextualize
10-Mar-2014 11:49:28 [INFO] Using 'UTF-8' encoding to copy filtered resources.
10-Mar-2014 11:49:28 [INFO] skip non existing resourceDirectory /mnt/work/bamboo-home/xml-data/build-dir/RNDTEST-SOFTWARE-IBM17/examples/ant/src/main/resources
10-Mar-2014 11:49:28 [INFO]
10-Mar-2014 11:49:28 [INFO] --- maven-compiler-plugin:3.1:compile (default-compile) @ randomizedtesting-examples-ant ---
10-Mar-2014 11:49:28 [INFO] No sources to compile
10-Mar-2014 11:49:28 [INFO]
10-Mar-2014 11:49:28 [INFO] --- maven-resources-plugin:2.5:testResources (default-testResources) @ randomizedtesting-examples-ant ---
10-Mar-2014 11:49:28 [debug] execute contextualize
10-Mar-2014 11:49:28 [INFO] Using 'UTF-8' encoding to copy filtered resources.
10-Mar-2014 11:49:28 [INFO] skip non existing resourceDirectory /mnt/work/bamboo-home/xml-data/build-dir/RNDTEST-SOFTWARE-IBM17/examples/ant/src/test/resources
10-Mar-2014 11:49:28 [INFO]
10-Mar-2014 11:49:28 [INFO] --- maven-compiler-plugin:3.1:testCompile (default-testCompile) @ randomizedtesting-examples-ant ---
10-Mar-2014 11:49:28 [INFO] No sources to compile
10-Mar-2014 11:49:28 [INFO]
10-Mar-2014 11:49:28 [INFO] --- maven-surefire-plugin:2.10:test (default-test) @ randomizedtesting-examples-ant ---
10-Mar-2014 11:49:28 [INFO] No tests to run.
10-Mar-2014 11:49:28 [INFO] Surefire report directory: /mnt/work/bamboo-home/xml-data/build-dir/RNDTEST-SOFTWARE-IBM17/examples/ant/target/surefire-reports
10-Mar-2014 11:49:28
10-Mar-2014 11:49:28 -------------------------------------------------------
10-Mar-2014 11:49:28 T E S T S
10-Mar-2014 11:49:28 -------------------------------------------------------
10-Mar-2014 11:49:28
10-Mar-2014 11:49:28 Results :
10-Mar-2014 11:49:28
10-Mar-2014 11:49:28 Tests run: 0, Failures: 0, Errors: 0, Skipped: 0
10-Mar-2014 11:49:28
10-Mar-2014 11:49:28 [INFO]
10-Mar-2014 11:49:28 [INFO] --- maven-jar-plugin:2.3.2:jar (default-jar) @ randomizedtesting-examples-ant ---
10-Mar-2014 11:49:28 [WARNING] JAR will be empty - no content was marked for inclusion!
10-Mar-2014 11:49:28 [INFO] Building jar: /mnt/work/bamboo-home/xml-data/build-dir/RNDTEST-SOFTWARE-IBM17/examples/ant/target/randomizedtesting-examples-ant-2.1.0-SNAPSHOT.jar
10-Mar-2014 11:49:28 [INFO]
10-Mar-2014 11:49:28 [INFO] --- maven-dependency-plugin:2.3:copy-dependencies (copy-dependencies) @ randomizedtesting-examples-ant ---
10-Mar-2014 11:49:28 [INFO] Copying junit-4.10.jar to /mnt/work/bamboo-home/xml-data/build-dir/RNDTEST-SOFTWARE-IBM17/examples/ant/target/lib/junit-4.10.jar
10-Mar-2014 11:49:28 [INFO] Copying randomizedtesting-examples-2.1.0-SNAPSHOT.jar to /mnt/work/bamboo-home/xml-data/build-dir/RNDTEST-SOFTWARE-IBM17/examples/ant/target/lib/randomizedtesting-examples-2.1.0-SNAPSHOT.jar
10-Mar-2014 11:49:28 [INFO] Copying junit4-ant-2.1.0-SNAPSHOT.jar to /mnt/work/bamboo-home/xml-data/build-dir/RNDTEST-SOFTWARE-IBM17/examples/ant/target/lib/junit4-ant-2.1.0-SNAPSHOT.jar
10-Mar-2014 11:49:28 [INFO] Copying randomizedtesting-runner-2.1.0-SNAPSHOT.jar to /mnt/work/bamboo-home/xml-data/build-dir/RNDTEST-SOFTWARE-IBM17/examples/ant/target/lib/randomizedtesting-runner-2.1.0-SNAPSHOT.jar
10-Mar-2014 11:49:28 [INFO]
10-Mar-2014 11:49:28 [INFO] --- maven-antrun-plugin:1.7:run (ant-run-tests) @ randomizedtesting-examples-ant ---
10-Mar-2014 11:49:28 [INFO] Executing tasks
10-Mar-2014 11:49:28
10-Mar-2014 11:49:28 main:
10-Mar-2014 11:49:28 Trying to override old definition of task javac
10-Mar-2014 11:49:28
10-Mar-2014 11:49:28 classpath.resolve:
10-Mar-2014 11:49:28
10-Mar-2014 11:49:28 compile:
10-Mar-2014 11:49:28     [mkdir] Created dir: /mnt/work/bamboo-home/xml-data/build-dir/RNDTEST-SOFTWARE-IBM17/examples/ant/target/classes
10-Mar-2014 11:49:28     [javac] Compiling 25 source files to /mnt/work/bamboo-home/xml-data/build-dir/RNDTEST-SOFTWARE-IBM17/examples/ant/target/classes
10-Mar-2014 11:49:29 warning: [options] bootstrap class path not set in conjunction with -source 1.6
10-Mar-2014 11:49:29 1 warning
10-Mar-2014 11:49:29
10-Mar-2014 11:49:29 test:
10-Mar-2014 11:49:29 [junit4:junit4] <JUnit4> says g'day! Master seed: 88AFFD9C60FE7CB1
10-Mar-2014 11:49:36 [junit4:junit4] JVM J0:     0.31 ..     6.38 =     6.08s
10-Mar-2014 11:49:36 [junit4:junit4] Execution time total: 6.41 sec.
10-Mar-2014 11:49:36 [junitreport] Processing /mnt/work/bamboo-home/xml-data/build-dir/RNDTEST-SOFTWARE-IBM17/examples/ant/target/test-report-xml/TESTS-TestSuites.xml to /home/bamboo/bamboo-software/temp/RNDTEST-SOFTWARE-IBM17/null1759179864
10-Mar-2014 11:49:36 [junitreport] Loading stylesheet jar:file:/home/bamboo/.m2/repository/org/apache/ant/ant-junit/1.8.2/ant-junit-1.8.2.jar!/org/apache/tools/ant/taskdefs/optional/junit/xsl/junit-frames.xsl
10-Mar-2014 11:49:37 [junitreport] Transform time: 1365ms
10-Mar-2014 11:49:37 [junitreport] Deleting: /home/bamboo/bamboo-software/temp/RNDTEST-SOFTWARE-IBM17/null1759179864
10-Mar-2014 11:49:37      [echo]
10-Mar-2014 11:49:37      [echo]
10-Mar-2014 11:49:37      [echo] Done. See reports under target/.
10-Mar-2014 11:49:37      [echo]
10-Mar-2014 11:49:37      [echo]         
10-Mar-2014 11:49:37 [INFO] Executed tasks
10-Mar-2014 11:49:37 [INFO]                                                                         
10-Mar-2014 11:49:37 [INFO] ------------------------------------------------------------------------
10-Mar-2014 11:49:37 [INFO] Building RandomizedTesting Packaging 2.1.0-SNAPSHOT
10-Mar-2014 11:49:37 [INFO] ------------------------------------------------------------------------
10-Mar-2014 11:49:37 [INFO]
10-Mar-2014 11:49:37 [INFO] --- maven-clean-plugin:2.4.1:clean (default-clean) @ randomizedtesting-packaging ---
10-Mar-2014 11:49:37 [INFO] Deleting /mnt/work/bamboo-home/xml-data/build-dir/RNDTEST-SOFTWARE-IBM17/packaging/target
10-Mar-2014 11:49:37 [INFO]
10-Mar-2014 11:49:37 [INFO] --- maven-enforcer-plugin:1.2:enforce (enforce-maven) @ randomizedtesting-packaging ---
10-Mar-2014 11:49:37 [INFO]
10-Mar-2014 11:49:37 [INFO] --- maven-resources-plugin:2.5:resources (default-resources) @ randomizedtesting-packaging ---
10-Mar-2014 11:49:37 [debug] execute contextualize
10-Mar-2014 11:49:37 [INFO] Using 'UTF-8' encoding to copy filtered resources.
10-Mar-2014 11:49:37 [INFO] skip non existing resourceDirectory /mnt/work/bamboo-home/xml-data/build-dir/RNDTEST-SOFTWARE-IBM17/packaging/src/main/resources
10-Mar-2014 11:49:37 [INFO]
10-Mar-2014 11:49:37 [INFO] --- maven-compiler-plugin:3.1:compile (default-compile) @ randomizedtesting-packaging ---
10-Mar-2014 11:49:37 [INFO] No sources to compile
10-Mar-2014 11:49:37 [INFO]
10-Mar-2014 11:49:37 [INFO] --- maven-resources-plugin:2.5:testResources (default-testResources) @ randomizedtesting-packaging ---
10-Mar-2014 11:49:37 [debug] execute contextualize
10-Mar-2014 11:49:37 [INFO] Using 'UTF-8' encoding to copy filtered resources.
10-Mar-2014 11:49:37 [INFO] skip non existing resourceDirectory /mnt/work/bamboo-home/xml-data/build-dir/RNDTEST-SOFTWARE-IBM17/packaging/src/test/resources
10-Mar-2014 11:49:37 [INFO]
10-Mar-2014 11:49:37 [INFO] --- maven-compiler-plugin:3.1:testCompile (default-testCompile) @ randomizedtesting-packaging ---
10-Mar-2014 11:49:37 [INFO] No sources to compile
10-Mar-2014 11:49:37 [INFO]
10-Mar-2014 11:49:37 [INFO] --- maven-surefire-plugin:2.10:test (default-test) @ randomizedtesting-packaging ---
10-Mar-2014 11:49:37 [INFO] No tests to run.
10-Mar-2014 11:49:37 [INFO] Surefire report directory: /mnt/work/bamboo-home/xml-data/build-dir/RNDTEST-SOFTWARE-IBM17/packaging/target/surefire-reports
10-Mar-2014 11:49:37
10-Mar-2014 11:49:37 -------------------------------------------------------
10-Mar-2014 11:49:37 T E S T S
10-Mar-2014 11:49:37 -------------------------------------------------------
10-Mar-2014 11:49:38
10-Mar-2014 11:49:38 Results :
10-Mar-2014 11:49:38
10-Mar-2014 11:49:38 Tests run: 0, Failures: 0, Errors: 0, Skipped: 0
10-Mar-2014 11:49:38
10-Mar-2014 11:49:38 [INFO]
10-Mar-2014 11:49:38 [INFO] --- maven-jar-plugin:2.3.2:jar (default-jar) @ randomizedtesting-packaging ---
10-Mar-2014 11:49:38 [WARNING] JAR will be empty - no content was marked for inclusion!
10-Mar-2014 11:49:38 [INFO] Building jar: /mnt/work/bamboo-home/xml-data/build-dir/RNDTEST-SOFTWARE-IBM17/packaging/target/randomizedtesting-packaging-2.1.0-SNAPSHOT.jar
10-Mar-2014 11:49:38 [INFO] ------------------------------------------------------------------------
10-Mar-2014 11:49:38 [INFO] Reactor Summary:
10-Mar-2014 11:49:38 [INFO]
10-Mar-2014 11:49:38 [INFO] RandomizedTesting Parent POM ...................... SUCCESS [0.376s]
10-Mar-2014 11:49:38 [INFO] RandomizedTesting Randomized Runner ............... SUCCESS [42.861s]
10-Mar-2014 11:49:38 [INFO] RandomizedTesting JUnit4 ANT Task ................. SUCCESS [2:17.454s]
10-Mar-2014 11:49:38 [INFO] RandomizedTesting JUnit4 Maven Plugin ............. SUCCESS [0.983s]
10-Mar-2014 11:49:38 [INFO] RandomizedTesting JUnit4 Maven Plugin Tests ....... SUCCESS [5.656s]
10-Mar-2014 11:49:38 [INFO] RandomizedTesting Examples ........................ SUCCESS [7.046s]
10-Mar-2014 11:49:38 [INFO] RandomizedTesting ANT Examples .................... SUCCESS [9.265s]
10-Mar-2014 11:49:38 [INFO] RandomizedTesting Packaging ....................... SUCCESS [0.215s]
10-Mar-2014 11:49:38 [INFO] ------------------------------------------------------------------------
10-Mar-2014 11:49:38 [INFO] BUILD SUCCESS
10-Mar-2014 11:49:38 [INFO] ------------------------------------------------------------------------
10-Mar-2014 11:49:38 [INFO] Total time: 3:24.069s
10-Mar-2014 11:49:38 [INFO] Finished at: Mon Mar 10 11:49:38 CET 2014
10-Mar-2014 11:49:38 [INFO] Final Memory: 47M/80M
10-Mar-2014 11:49:38 [INFO] ------------------------------------------------------------------------
10-Mar-2014 11:49:38 Parsing test results...
10-Mar-2014 11:49:38 Finished task 'Maven 3.x'
10-Mar-2014 11:49:38 Running post build plugin 'NCover Results Collector'
10-Mar-2014 11:49:38 Running post build plugin 'Clover Results Collector'
10-Mar-2014 11:49:38 Running post build plugin 'Artifact Copier'
10-Mar-2014 11:49:38 Finalising the build...
10-Mar-2014 11:49:38 Stopping timer.
10-Mar-2014 11:49:38 Build RNDTEST-SOFTWARE-IBM17-20 completed.
10-Mar-2014 11:49:38 Running on server: post build plugin 'NCover Results Collector'
10-Mar-2014 11:49:38 Running on server: post build plugin 'Clover Delta Calculator'
10-Mar-2014 11:49:38 Running on server: post build plugin 'Build Hanging Detection Configuration'
10-Mar-2014 11:49:38 Running on server: post build plugin 'Maven Dependencies Postprocessor'
10-Mar-2014 11:49:38 All post build plugins have finished
10-Mar-2014 11:49:38 Generating build results summary...
10-Mar-2014 11:49:38 Saving build results to disk...
10-Mar-2014 11:49:38 Indexing build results...
10-Mar-2014 11:49:39 Finished building RNDTEST-SOFTWARE-IBM17-20.