Build #164

Build: #164 failed

Job: JDK 11 J9 failed

Stages & jobs

  1. Compile and test

  2. Package

Build log

The build generated 65,060 lines of output.The output is too long and has been truncated to the last 1,000 lines. Download or view full build log

23-Jan-2017 10:50:12 Finding class com.carrotsearch.ant.tasks.junit4.dependencies.com.google.common.base.Ticker
23-Jan-2017 10:50:12 Loaded from /mnt/work/bamboo-home/xml-data/build-dir/RNDTEST-SOFTWARE-IBM17/junit4-ant/target/junit4-ant-2.4.2-SNAPSHOT.jar com/carrotsearch/ant/tasks/junit4/dependencies/com/google/common/base/Ticker.class
23-Jan-2017 10:50:12 Class com.carrotsearch.ant.tasks.junit4.dependencies.com.google.common.base.Ticker loaded from ant loader (parentFirst)
23-Jan-2017 10:50:12 Finding class com.carrotsearch.ant.tasks.junit4.dependencies.com.google.common.cache.CacheBuilder$3
23-Jan-2017 10:50:12 Loaded from /mnt/work/bamboo-home/xml-data/build-dir/RNDTEST-SOFTWARE-IBM17/junit4-ant/target/junit4-ant-2.4.2-SNAPSHOT.jar com/carrotsearch/ant/tasks/junit4/dependencies/com/google/common/cache/CacheBuilder$3.class
23-Jan-2017 10:50:12 Class com.carrotsearch.ant.tasks.junit4.dependencies.com.google.common.cache.CacheBuilder$3 loaded from ant loader (parentFirst)
23-Jan-2017 10:50:12 Finding class com.carrotsearch.ant.tasks.junit4.dependencies.com.google.common.cache.CacheBuilder$1
23-Jan-2017 10:50:12 Loaded from /mnt/work/bamboo-home/xml-data/build-dir/RNDTEST-SOFTWARE-IBM17/junit4-ant/target/junit4-ant-2.4.2-SNAPSHOT.jar com/carrotsearch/ant/tasks/junit4/dependencies/com/google/common/cache/CacheBuilder$1.class
23-Jan-2017 10:50:12 Finding class com.carrotsearch.ant.tasks.junit4.dependencies.com.google.common.cache.AbstractCache$StatsCounter
23-Jan-2017 10:50:12 Loaded from /mnt/work/bamboo-home/xml-data/build-dir/RNDTEST-SOFTWARE-IBM17/junit4-ant/target/junit4-ant-2.4.2-SNAPSHOT.jar com/carrotsearch/ant/tasks/junit4/dependencies/com/google/common/cache/AbstractCache$StatsCounter.class
23-Jan-2017 10:50:12 Class com.carrotsearch.ant.tasks.junit4.dependencies.com.google.common.cache.AbstractCache$StatsCounter loaded from ant loader (parentFirst)
23-Jan-2017 10:50:12 Class com.carrotsearch.ant.tasks.junit4.dependencies.com.google.common.cache.CacheBuilder$1 loaded from ant loader (parentFirst)
23-Jan-2017 10:50:12 Finding class com.carrotsearch.ant.tasks.junit4.dependencies.com.google.common.base.Suppliers
23-Jan-2017 10:50:12 Loaded from /mnt/work/bamboo-home/xml-data/build-dir/RNDTEST-SOFTWARE-IBM17/junit4-ant/target/junit4-ant-2.4.2-SNAPSHOT.jar com/carrotsearch/ant/tasks/junit4/dependencies/com/google/common/base/Suppliers.class
23-Jan-2017 10:50:12 Class com.carrotsearch.ant.tasks.junit4.dependencies.com.google.common.base.Suppliers loaded from ant loader (parentFirst)
23-Jan-2017 10:50:12 Finding class com.carrotsearch.ant.tasks.junit4.dependencies.com.google.common.base.Suppliers$SupplierOfInstance
23-Jan-2017 10:50:12 Loaded from /mnt/work/bamboo-home/xml-data/build-dir/RNDTEST-SOFTWARE-IBM17/junit4-ant/target/junit4-ant-2.4.2-SNAPSHOT.jar com/carrotsearch/ant/tasks/junit4/dependencies/com/google/common/base/Suppliers$SupplierOfInstance.class
23-Jan-2017 10:50:12 Class com.carrotsearch.ant.tasks.junit4.dependencies.com.google.common.base.Suppliers$SupplierOfInstance loaded from ant loader (parentFirst)
23-Jan-2017 10:50:12 Finding class com.carrotsearch.ant.tasks.junit4.dependencies.com.google.common.cache.CacheStats
23-Jan-2017 10:50:12 Loaded from /mnt/work/bamboo-home/xml-data/build-dir/RNDTEST-SOFTWARE-IBM17/junit4-ant/target/junit4-ant-2.4.2-SNAPSHOT.jar com/carrotsearch/ant/tasks/junit4/dependencies/com/google/common/cache/CacheStats.class
23-Jan-2017 10:50:12 Class com.carrotsearch.ant.tasks.junit4.dependencies.com.google.common.cache.CacheStats loaded from ant loader (parentFirst)
23-Jan-2017 10:50:12 Finding class com.carrotsearch.ant.tasks.junit4.dependencies.com.google.common.cache.CacheBuilder$2
23-Jan-2017 10:50:12 Loaded from /mnt/work/bamboo-home/xml-data/build-dir/RNDTEST-SOFTWARE-IBM17/junit4-ant/target/junit4-ant-2.4.2-SNAPSHOT.jar com/carrotsearch/ant/tasks/junit4/dependencies/com/google/common/cache/CacheBuilder$2.class
23-Jan-2017 10:50:12 Class com.carrotsearch.ant.tasks.junit4.dependencies.com.google.common.cache.CacheBuilder$2 loaded from ant loader (parentFirst)
23-Jan-2017 10:50:12 Finding class com.carrotsearch.ant.tasks.junit4.dependencies.com.google.common.base.Ticker$1
23-Jan-2017 10:50:12 Loaded from /mnt/work/bamboo-home/xml-data/build-dir/RNDTEST-SOFTWARE-IBM17/junit4-ant/target/junit4-ant-2.4.2-SNAPSHOT.jar com/carrotsearch/ant/tasks/junit4/dependencies/com/google/common/base/Ticker$1.class
23-Jan-2017 10:50:12 Class com.carrotsearch.ant.tasks.junit4.dependencies.com.google.common.base.Ticker$1 loaded from ant loader (parentFirst)
23-Jan-2017 10:50:12 Finding class com.carrotsearch.ant.tasks.junit4.dependencies.com.google.common.cache.LocalCache$Strength
23-Jan-2017 10:50:12 Loaded from /mnt/work/bamboo-home/xml-data/build-dir/RNDTEST-SOFTWARE-IBM17/junit4-ant/target/junit4-ant-2.4.2-SNAPSHOT.jar com/carrotsearch/ant/tasks/junit4/dependencies/com/google/common/cache/LocalCache$Strength.class
23-Jan-2017 10:50:12 Class com.carrotsearch.ant.tasks.junit4.dependencies.com.google.common.cache.LocalCache$Strength loaded from ant loader (parentFirst)
23-Jan-2017 10:50:12 Finding class com.carrotsearch.ant.tasks.junit4.dependencies.com.google.common.cache.LocalCache$Strength$1
23-Jan-2017 10:50:12 Loaded from /mnt/work/bamboo-home/xml-data/build-dir/RNDTEST-SOFTWARE-IBM17/junit4-ant/target/junit4-ant-2.4.2-SNAPSHOT.jar com/carrotsearch/ant/tasks/junit4/dependencies/com/google/common/cache/LocalCache$Strength$1.class
23-Jan-2017 10:50:12 Class com.carrotsearch.ant.tasks.junit4.dependencies.com.google.common.cache.LocalCache$Strength$1 loaded from ant loader (parentFirst)
23-Jan-2017 10:50:12 Finding class com.carrotsearch.ant.tasks.junit4.dependencies.com.google.common.cache.LocalCache$Strength$2
23-Jan-2017 10:50:12 Loaded from /mnt/work/bamboo-home/xml-data/build-dir/RNDTEST-SOFTWARE-IBM17/junit4-ant/target/junit4-ant-2.4.2-SNAPSHOT.jar com/carrotsearch/ant/tasks/junit4/dependencies/com/google/common/cache/LocalCache$Strength$2.class
23-Jan-2017 10:50:12 Class com.carrotsearch.ant.tasks.junit4.dependencies.com.google.common.cache.LocalCache$Strength$2 loaded from ant loader (parentFirst)
23-Jan-2017 10:50:12 Finding class com.carrotsearch.ant.tasks.junit4.dependencies.com.google.common.cache.LocalCache$Strength$3
23-Jan-2017 10:50:12 Loaded from /mnt/work/bamboo-home/xml-data/build-dir/RNDTEST-SOFTWARE-IBM17/junit4-ant/target/junit4-ant-2.4.2-SNAPSHOT.jar com/carrotsearch/ant/tasks/junit4/dependencies/com/google/common/cache/LocalCache$Strength$3.class
23-Jan-2017 10:50:12 Class com.carrotsearch.ant.tasks.junit4.dependencies.com.google.common.cache.LocalCache$Strength$3 loaded from ant loader (parentFirst)
23-Jan-2017 10:50:12 Finding class com.carrotsearch.ant.tasks.junit4.dependencies.com.google.common.cache.LocalCache$StrongValueReference
23-Jan-2017 10:50:12 Loaded from /mnt/work/bamboo-home/xml-data/build-dir/RNDTEST-SOFTWARE-IBM17/junit4-ant/target/junit4-ant-2.4.2-SNAPSHOT.jar com/carrotsearch/ant/tasks/junit4/dependencies/com/google/common/cache/LocalCache$StrongValueReference.class
23-Jan-2017 10:50:12 Finding class com.carrotsearch.ant.tasks.junit4.dependencies.com.google.common.cache.LocalCache$ValueReference
23-Jan-2017 10:50:12 Loaded from /mnt/work/bamboo-home/xml-data/build-dir/RNDTEST-SOFTWARE-IBM17/junit4-ant/target/junit4-ant-2.4.2-SNAPSHOT.jar com/carrotsearch/ant/tasks/junit4/dependencies/com/google/common/cache/LocalCache$ValueReference.class
23-Jan-2017 10:50:12 Class com.carrotsearch.ant.tasks.junit4.dependencies.com.google.common.cache.LocalCache$ValueReference loaded from ant loader (parentFirst)
23-Jan-2017 10:50:12 Class com.carrotsearch.ant.tasks.junit4.dependencies.com.google.common.cache.LocalCache$StrongValueReference loaded from ant loader (parentFirst)
23-Jan-2017 10:50:12 Finding class com.carrotsearch.ant.tasks.junit4.dependencies.com.google.common.cache.LocalCache$WeightedStrongValueReference
23-Jan-2017 10:50:12 Loaded from /mnt/work/bamboo-home/xml-data/build-dir/RNDTEST-SOFTWARE-IBM17/junit4-ant/target/junit4-ant-2.4.2-SNAPSHOT.jar com/carrotsearch/ant/tasks/junit4/dependencies/com/google/common/cache/LocalCache$WeightedStrongValueReference.class
23-Jan-2017 10:50:12 Class com.carrotsearch.ant.tasks.junit4.dependencies.com.google.common.cache.LocalCache$WeightedStrongValueReference loaded from ant loader (parentFirst)
23-Jan-2017 10:50:12 Finding class com.carrotsearch.ant.tasks.junit4.dependencies.com.google.common.cache.LocalCache$SoftValueReference
23-Jan-2017 10:50:12 Loaded from /mnt/work/bamboo-home/xml-data/build-dir/RNDTEST-SOFTWARE-IBM17/junit4-ant/target/junit4-ant-2.4.2-SNAPSHOT.jar com/carrotsearch/ant/tasks/junit4/dependencies/com/google/common/cache/LocalCache$SoftValueReference.class
23-Jan-2017 10:50:12 Class java.lang.ref.SoftReference loaded from parent loader (parentFirst)
23-Jan-2017 10:50:12 Class com.carrotsearch.ant.tasks.junit4.dependencies.com.google.common.cache.LocalCache$SoftValueReference loaded from ant loader (parentFirst)
23-Jan-2017 10:50:12 Finding class com.carrotsearch.ant.tasks.junit4.dependencies.com.google.common.cache.LocalCache$WeightedSoftValueReference
23-Jan-2017 10:50:12 Loaded from /mnt/work/bamboo-home/xml-data/build-dir/RNDTEST-SOFTWARE-IBM17/junit4-ant/target/junit4-ant-2.4.2-SNAPSHOT.jar com/carrotsearch/ant/tasks/junit4/dependencies/com/google/common/cache/LocalCache$WeightedSoftValueReference.class
23-Jan-2017 10:50:12 Class com.carrotsearch.ant.tasks.junit4.dependencies.com.google.common.cache.LocalCache$WeightedSoftValueReference loaded from ant loader (parentFirst)
23-Jan-2017 10:50:12 Finding class com.carrotsearch.ant.tasks.junit4.dependencies.com.google.common.cache.LocalCache$WeakValueReference
23-Jan-2017 10:50:12 Loaded from /mnt/work/bamboo-home/xml-data/build-dir/RNDTEST-SOFTWARE-IBM17/junit4-ant/target/junit4-ant-2.4.2-SNAPSHOT.jar com/carrotsearch/ant/tasks/junit4/dependencies/com/google/common/cache/LocalCache$WeakValueReference.class
23-Jan-2017 10:50:12 Class java.lang.ref.WeakReference loaded from parent loader (parentFirst)
23-Jan-2017 10:50:12 Class com.carrotsearch.ant.tasks.junit4.dependencies.com.google.common.cache.LocalCache$WeakValueReference loaded from ant loader (parentFirst)
23-Jan-2017 10:50:12 Finding class com.carrotsearch.ant.tasks.junit4.dependencies.com.google.common.cache.LocalCache$WeightedWeakValueReference
23-Jan-2017 10:50:12 Loaded from /mnt/work/bamboo-home/xml-data/build-dir/RNDTEST-SOFTWARE-IBM17/junit4-ant/target/junit4-ant-2.4.2-SNAPSHOT.jar com/carrotsearch/ant/tasks/junit4/dependencies/com/google/common/cache/LocalCache$WeightedWeakValueReference.class
23-Jan-2017 10:50:12 Class com.carrotsearch.ant.tasks.junit4.dependencies.com.google.common.cache.LocalCache$WeightedWeakValueReference loaded from ant loader (parentFirst)
23-Jan-2017 10:50:12 Finding class com.carrotsearch.ant.tasks.junit4.dependencies.com.google.common.cache.LocalCache$LocalLoadingCache
23-Jan-2017 10:50:12 Loaded from /mnt/work/bamboo-home/xml-data/build-dir/RNDTEST-SOFTWARE-IBM17/junit4-ant/target/junit4-ant-2.4.2-SNAPSHOT.jar com/carrotsearch/ant/tasks/junit4/dependencies/com/google/common/cache/LocalCache$LocalLoadingCache.class
23-Jan-2017 10:50:12 Finding class com.carrotsearch.ant.tasks.junit4.dependencies.com.google.common.cache.LocalCache$LocalManualCache
23-Jan-2017 10:50:12 Loaded from /mnt/work/bamboo-home/xml-data/build-dir/RNDTEST-SOFTWARE-IBM17/junit4-ant/target/junit4-ant-2.4.2-SNAPSHOT.jar com/carrotsearch/ant/tasks/junit4/dependencies/com/google/common/cache/LocalCache$LocalManualCache.class
23-Jan-2017 10:50:12 Class com.carrotsearch.ant.tasks.junit4.dependencies.com.google.common.cache.LocalCache$LocalManualCache loaded from ant loader (parentFirst)
23-Jan-2017 10:50:12 Class com.carrotsearch.ant.tasks.junit4.dependencies.com.google.common.cache.LocalCache$LocalLoadingCache loaded from ant loader (parentFirst)
23-Jan-2017 10:50:12 Finding class com.carrotsearch.ant.tasks.junit4.dependencies.com.google.common.cache.LocalCache
23-Jan-2017 10:50:12 Loaded from /mnt/work/bamboo-home/xml-data/build-dir/RNDTEST-SOFTWARE-IBM17/junit4-ant/target/junit4-ant-2.4.2-SNAPSHOT.jar com/carrotsearch/ant/tasks/junit4/dependencies/com/google/common/cache/LocalCache.class
23-Jan-2017 10:50:12 Class java.util.AbstractMap loaded from parent loader (parentFirst)
23-Jan-2017 10:50:12 Class java.util.concurrent.ConcurrentMap loaded from parent loader (parentFirst)
23-Jan-2017 10:50:12 Class com.carrotsearch.ant.tasks.junit4.dependencies.com.google.common.cache.LocalCache loaded from ant loader (parentFirst)
23-Jan-2017 10:50:12 Finding class com.carrotsearch.ant.tasks.junit4.dependencies.com.google.common.cache.LocalCache$ReferenceEntry
23-Jan-2017 10:50:12 Loaded from /mnt/work/bamboo-home/xml-data/build-dir/RNDTEST-SOFTWARE-IBM17/junit4-ant/target/junit4-ant-2.4.2-SNAPSHOT.jar com/carrotsearch/ant/tasks/junit4/dependencies/com/google/common/cache/LocalCache$ReferenceEntry.class
23-Jan-2017 10:50:12 Class com.carrotsearch.ant.tasks.junit4.dependencies.com.google.common.cache.LocalCache$ReferenceEntry loaded from ant loader (parentFirst)
23-Jan-2017 10:50:12 Finding class com.carrotsearch.ant.tasks.junit4.dependencies.com.google.common.cache.LocalCache$1
23-Jan-2017 10:50:12 Loaded from /mnt/work/bamboo-home/xml-data/build-dir/RNDTEST-SOFTWARE-IBM17/junit4-ant/target/junit4-ant-2.4.2-SNAPSHOT.jar com/carrotsearch/ant/tasks/junit4/dependencies/com/google/common/cache/LocalCache$1.class
23-Jan-2017 10:50:12 Class com.carrotsearch.ant.tasks.junit4.dependencies.com.google.common.cache.LocalCache$1 loaded from ant loader (parentFirst)
23-Jan-2017 10:50:12 Finding class com.carrotsearch.ant.tasks.junit4.dependencies.com.google.common.cache.LocalCache$2
23-Jan-2017 10:50:12 Loaded from /mnt/work/bamboo-home/xml-data/build-dir/RNDTEST-SOFTWARE-IBM17/junit4-ant/target/junit4-ant-2.4.2-SNAPSHOT.jar com/carrotsearch/ant/tasks/junit4/dependencies/com/google/common/cache/LocalCache$2.class
23-Jan-2017 10:50:12 Class java.util.AbstractQueue loaded from parent loader (parentFirst)
23-Jan-2017 10:50:12 Class com.carrotsearch.ant.tasks.junit4.dependencies.com.google.common.cache.LocalCache$2 loaded from ant loader (parentFirst)
23-Jan-2017 10:50:12 Class java.lang.Math loaded from parent loader (parentFirst)
23-Jan-2017 10:50:12 Finding class com.carrotsearch.ant.tasks.junit4.dependencies.com.google.common.base.Equivalence
23-Jan-2017 10:50:12 Loaded from /mnt/work/bamboo-home/xml-data/build-dir/RNDTEST-SOFTWARE-IBM17/junit4-ant/target/junit4-ant-2.4.2-SNAPSHOT.jar com/carrotsearch/ant/tasks/junit4/dependencies/com/google/common/base/Equivalence.class
23-Jan-2017 10:50:12 Class com.carrotsearch.ant.tasks.junit4.dependencies.com.google.common.base.Equivalence loaded from ant loader (parentFirst)
23-Jan-2017 10:50:12 Finding class com.carrotsearch.ant.tasks.junit4.dependencies.com.google.common.base.Equivalence$Equals
23-Jan-2017 10:50:12 Loaded from /mnt/work/bamboo-home/xml-data/build-dir/RNDTEST-SOFTWARE-IBM17/junit4-ant/target/junit4-ant-2.4.2-SNAPSHOT.jar com/carrotsearch/ant/tasks/junit4/dependencies/com/google/common/base/Equivalence$Equals.class
23-Jan-2017 10:50:12 Class com.carrotsearch.ant.tasks.junit4.dependencies.com.google.common.base.Equivalence$Equals loaded from ant loader (parentFirst)
23-Jan-2017 10:50:12 Finding class com.carrotsearch.ant.tasks.junit4.dependencies.com.google.common.base.Equivalence$Identity
23-Jan-2017 10:50:12 Loaded from /mnt/work/bamboo-home/xml-data/build-dir/RNDTEST-SOFTWARE-IBM17/junit4-ant/target/junit4-ant-2.4.2-SNAPSHOT.jar com/carrotsearch/ant/tasks/junit4/dependencies/com/google/common/base/Equivalence$Identity.class
23-Jan-2017 10:50:12 Class com.carrotsearch.ant.tasks.junit4.dependencies.com.google.common.base.Equivalence$Identity loaded from ant loader (parentFirst)
23-Jan-2017 10:50:12 Finding class com.carrotsearch.ant.tasks.junit4.dependencies.com.google.common.cache.CacheBuilder$OneWeigher
23-Jan-2017 10:50:12 Loaded from /mnt/work/bamboo-home/xml-data/build-dir/RNDTEST-SOFTWARE-IBM17/junit4-ant/target/junit4-ant-2.4.2-SNAPSHOT.jar com/carrotsearch/ant/tasks/junit4/dependencies/com/google/common/cache/CacheBuilder$OneWeigher.class
23-Jan-2017 10:50:12 Finding class com.carrotsearch.ant.tasks.junit4.dependencies.com.google.common.cache.Weigher
23-Jan-2017 10:50:12 Loaded from /mnt/work/bamboo-home/xml-data/build-dir/RNDTEST-SOFTWARE-IBM17/junit4-ant/target/junit4-ant-2.4.2-SNAPSHOT.jar com/carrotsearch/ant/tasks/junit4/dependencies/com/google/common/cache/Weigher.class
23-Jan-2017 10:50:12 Class com.carrotsearch.ant.tasks.junit4.dependencies.com.google.common.cache.Weigher loaded from ant loader (parentFirst)
23-Jan-2017 10:50:12 Class com.carrotsearch.ant.tasks.junit4.dependencies.com.google.common.cache.CacheBuilder$OneWeigher loaded from ant loader (parentFirst)
23-Jan-2017 10:50:12 Finding class com.carrotsearch.ant.tasks.junit4.dependencies.com.google.common.cache.CacheBuilder$NullListener
23-Jan-2017 10:50:12 Loaded from /mnt/work/bamboo-home/xml-data/build-dir/RNDTEST-SOFTWARE-IBM17/junit4-ant/target/junit4-ant-2.4.2-SNAPSHOT.jar com/carrotsearch/ant/tasks/junit4/dependencies/com/google/common/cache/CacheBuilder$NullListener.class
23-Jan-2017 10:50:12 Finding class com.carrotsearch.ant.tasks.junit4.dependencies.com.google.common.cache.RemovalListener
23-Jan-2017 10:50:12 Loaded from /mnt/work/bamboo-home/xml-data/build-dir/RNDTEST-SOFTWARE-IBM17/junit4-ant/target/junit4-ant-2.4.2-SNAPSHOT.jar com/carrotsearch/ant/tasks/junit4/dependencies/com/google/common/cache/RemovalListener.class
23-Jan-2017 10:50:12 Class com.carrotsearch.ant.tasks.junit4.dependencies.com.google.common.cache.RemovalListener loaded from ant loader (parentFirst)
23-Jan-2017 10:50:12 Class com.carrotsearch.ant.tasks.junit4.dependencies.com.google.common.cache.CacheBuilder$NullListener loaded from ant loader (parentFirst)
23-Jan-2017 10:50:12 Finding class com.carrotsearch.ant.tasks.junit4.dependencies.com.google.common.cache.LocalCache$EntryFactory
23-Jan-2017 10:50:12 Loaded from /mnt/work/bamboo-home/xml-data/build-dir/RNDTEST-SOFTWARE-IBM17/junit4-ant/target/junit4-ant-2.4.2-SNAPSHOT.jar com/carrotsearch/ant/tasks/junit4/dependencies/com/google/common/cache/LocalCache$EntryFactory.class
23-Jan-2017 10:50:12 Class com.carrotsearch.ant.tasks.junit4.dependencies.com.google.common.cache.LocalCache$EntryFactory loaded from ant loader (parentFirst)
23-Jan-2017 10:50:12 Finding class com.carrotsearch.ant.tasks.junit4.dependencies.com.google.common.cache.LocalCache$EntryFactory$1
23-Jan-2017 10:50:12 Loaded from /mnt/work/bamboo-home/xml-data/build-dir/RNDTEST-SOFTWARE-IBM17/junit4-ant/target/junit4-ant-2.4.2-SNAPSHOT.jar com/carrotsearch/ant/tasks/junit4/dependencies/com/google/common/cache/LocalCache$EntryFactory$1.class
23-Jan-2017 10:50:12 Class com.carrotsearch.ant.tasks.junit4.dependencies.com.google.common.cache.LocalCache$EntryFactory$1 loaded from ant loader (parentFirst)
23-Jan-2017 10:50:12 Finding class com.carrotsearch.ant.tasks.junit4.dependencies.com.google.common.cache.LocalCache$EntryFactory$2
23-Jan-2017 10:50:12 Loaded from /mnt/work/bamboo-home/xml-data/build-dir/RNDTEST-SOFTWARE-IBM17/junit4-ant/target/junit4-ant-2.4.2-SNAPSHOT.jar com/carrotsearch/ant/tasks/junit4/dependencies/com/google/common/cache/LocalCache$EntryFactory$2.class
23-Jan-2017 10:50:12 Class com.carrotsearch.ant.tasks.junit4.dependencies.com.google.common.cache.LocalCache$EntryFactory$2 loaded from ant loader (parentFirst)
23-Jan-2017 10:50:12 Finding class com.carrotsearch.ant.tasks.junit4.dependencies.com.google.common.cache.LocalCache$EntryFactory$3
23-Jan-2017 10:50:12 Loaded from /mnt/work/bamboo-home/xml-data/build-dir/RNDTEST-SOFTWARE-IBM17/junit4-ant/target/junit4-ant-2.4.2-SNAPSHOT.jar com/carrotsearch/ant/tasks/junit4/dependencies/com/google/common/cache/LocalCache$EntryFactory$3.class
23-Jan-2017 10:50:12 Class com.carrotsearch.ant.tasks.junit4.dependencies.com.google.common.cache.LocalCache$EntryFactory$3 loaded from ant loader (parentFirst)
23-Jan-2017 10:50:12 Finding class com.carrotsearch.ant.tasks.junit4.dependencies.com.google.common.cache.LocalCache$EntryFactory$4
23-Jan-2017 10:50:12 Loaded from /mnt/work/bamboo-home/xml-data/build-dir/RNDTEST-SOFTWARE-IBM17/junit4-ant/target/junit4-ant-2.4.2-SNAPSHOT.jar com/carrotsearch/ant/tasks/junit4/dependencies/com/google/common/cache/LocalCache$EntryFactory$4.class
23-Jan-2017 10:50:12 Class com.carrotsearch.ant.tasks.junit4.dependencies.com.google.common.cache.LocalCache$EntryFactory$4 loaded from ant loader (parentFirst)
23-Jan-2017 10:50:12 Finding class com.carrotsearch.ant.tasks.junit4.dependencies.com.google.common.cache.LocalCache$EntryFactory$5
23-Jan-2017 10:50:12 Loaded from /mnt/work/bamboo-home/xml-data/build-dir/RNDTEST-SOFTWARE-IBM17/junit4-ant/target/junit4-ant-2.4.2-SNAPSHOT.jar com/carrotsearch/ant/tasks/junit4/dependencies/com/google/common/cache/LocalCache$EntryFactory$5.class
23-Jan-2017 10:50:12 Class com.carrotsearch.ant.tasks.junit4.dependencies.com.google.common.cache.LocalCache$EntryFactory$5 loaded from ant loader (parentFirst)
23-Jan-2017 10:50:12 Finding class com.carrotsearch.ant.tasks.junit4.dependencies.com.google.common.cache.LocalCache$EntryFactory$6
23-Jan-2017 10:50:12 Loaded from /mnt/work/bamboo-home/xml-data/build-dir/RNDTEST-SOFTWARE-IBM17/junit4-ant/target/junit4-ant-2.4.2-SNAPSHOT.jar com/carrotsearch/ant/tasks/junit4/dependencies/com/google/common/cache/LocalCache$EntryFactory$6.class
23-Jan-2017 10:50:12 Class com.carrotsearch.ant.tasks.junit4.dependencies.com.google.common.cache.LocalCache$EntryFactory$6 loaded from ant loader (parentFirst)
23-Jan-2017 10:50:12 Finding class com.carrotsearch.ant.tasks.junit4.dependencies.com.google.common.cache.LocalCache$EntryFactory$7
23-Jan-2017 10:50:12 Loaded from /mnt/work/bamboo-home/xml-data/build-dir/RNDTEST-SOFTWARE-IBM17/junit4-ant/target/junit4-ant-2.4.2-SNAPSHOT.jar com/carrotsearch/ant/tasks/junit4/dependencies/com/google/common/cache/LocalCache$EntryFactory$7.class
23-Jan-2017 10:50:12 Class com.carrotsearch.ant.tasks.junit4.dependencies.com.google.common.cache.LocalCache$EntryFactory$7 loaded from ant loader (parentFirst)
23-Jan-2017 10:50:12 Finding class com.carrotsearch.ant.tasks.junit4.dependencies.com.google.common.cache.LocalCache$EntryFactory$8
23-Jan-2017 10:50:12 Loaded from /mnt/work/bamboo-home/xml-data/build-dir/RNDTEST-SOFTWARE-IBM17/junit4-ant/target/junit4-ant-2.4.2-SNAPSHOT.jar com/carrotsearch/ant/tasks/junit4/dependencies/com/google/common/cache/LocalCache$EntryFactory$8.class
23-Jan-2017 10:50:12 Class com.carrotsearch.ant.tasks.junit4.dependencies.com.google.common.cache.LocalCache$EntryFactory$8 loaded from ant loader (parentFirst)
23-Jan-2017 10:50:12 Finding class com.carrotsearch.ant.tasks.junit4.dependencies.com.google.common.cache.LocalCache$Segment
23-Jan-2017 10:50:12 Loaded from /mnt/work/bamboo-home/xml-data/build-dir/RNDTEST-SOFTWARE-IBM17/junit4-ant/target/junit4-ant-2.4.2-SNAPSHOT.jar com/carrotsearch/ant/tasks/junit4/dependencies/com/google/common/cache/LocalCache$Segment.class
23-Jan-2017 10:50:12 Class java.util.concurrent.locks.ReentrantLock loaded from parent loader (parentFirst)
23-Jan-2017 10:50:12 Class com.carrotsearch.ant.tasks.junit4.dependencies.com.google.common.cache.LocalCache$Segment loaded from ant loader (parentFirst)
23-Jan-2017 10:50:12 Finding class com.carrotsearch.ant.tasks.junit4.dependencies.com.google.common.util.concurrent.ExecutionError
23-Jan-2017 10:50:12 Loaded from /mnt/work/bamboo-home/xml-data/build-dir/RNDTEST-SOFTWARE-IBM17/junit4-ant/target/junit4-ant-2.4.2-SNAPSHOT.jar com/carrotsearch/ant/tasks/junit4/dependencies/com/google/common/util/concurrent/ExecutionError.class
23-Jan-2017 10:50:12 Class java.lang.Error loaded from parent loader (parentFirst)
23-Jan-2017 10:50:12 Class com.carrotsearch.ant.tasks.junit4.dependencies.com.google.common.util.concurrent.ExecutionError loaded from ant loader (parentFirst)
23-Jan-2017 10:50:12 Finding class com.carrotsearch.ant.tasks.junit4.dependencies.com.google.common.cache.CacheLoader$InvalidCacheLoadException
23-Jan-2017 10:50:12 Loaded from /mnt/work/bamboo-home/xml-data/build-dir/RNDTEST-SOFTWARE-IBM17/junit4-ant/target/junit4-ant-2.4.2-SNAPSHOT.jar com/carrotsearch/ant/tasks/junit4/dependencies/com/google/common/cache/CacheLoader$InvalidCacheLoadException.class
23-Jan-2017 10:50:12 Class com.carrotsearch.ant.tasks.junit4.dependencies.com.google.common.cache.CacheLoader$InvalidCacheLoadException loaded from ant loader (parentFirst)
23-Jan-2017 10:50:12 Class java.lang.Runnable loaded from parent loader (parentFirst)
23-Jan-2017 10:50:12 Class java.util.concurrent.Future loaded from parent loader (parentFirst)
23-Jan-2017 10:50:12 Class java.util.concurrent.atomic.AtomicReferenceArray loaded from parent loader (parentFirst)
23-Jan-2017 10:50:12 Class java.lang.ref.ReferenceQueue loaded from parent loader (parentFirst)
23-Jan-2017 10:50:12 Finding class com.carrotsearch.ant.tasks.junit4.dependencies.com.google.common.collect.Maps
23-Jan-2017 10:50:12 Loaded from /mnt/work/bamboo-home/xml-data/build-dir/RNDTEST-SOFTWARE-IBM17/junit4-ant/target/junit4-ant-2.4.2-SNAPSHOT.jar com/carrotsearch/ant/tasks/junit4/dependencies/com/google/common/collect/Maps.class
23-Jan-2017 10:50:12 Class com.carrotsearch.ant.tasks.junit4.dependencies.com.google.common.collect.Maps loaded from ant loader (parentFirst)
23-Jan-2017 10:50:12 Class java.util.Map$Entry loaded from parent loader (parentFirst)
23-Jan-2017 10:50:12 Finding class com.carrotsearch.ant.tasks.junit4.dependencies.com.google.common.collect.UnmodifiableIterator
23-Jan-2017 10:50:12 Loaded from /mnt/work/bamboo-home/xml-data/build-dir/RNDTEST-SOFTWARE-IBM17/junit4-ant/target/junit4-ant-2.4.2-SNAPSHOT.jar com/carrotsearch/ant/tasks/junit4/dependencies/com/google/common/collect/UnmodifiableIterator.class
23-Jan-2017 10:50:12 Class com.carrotsearch.ant.tasks.junit4.dependencies.com.google.common.collect.UnmodifiableIterator loaded from ant loader (parentFirst)
23-Jan-2017 10:50:12 Finding class com.carrotsearch.ant.tasks.junit4.dependencies.com.google.common.collect.Maps$6
23-Jan-2017 10:50:12 Loaded from /mnt/work/bamboo-home/xml-data/build-dir/RNDTEST-SOFTWARE-IBM17/junit4-ant/target/junit4-ant-2.4.2-SNAPSHOT.jar com/carrotsearch/ant/tasks/junit4/dependencies/com/google/common/collect/Maps$6.class
23-Jan-2017 10:50:12 Class com.carrotsearch.ant.tasks.junit4.dependencies.com.google.common.collect.Maps$6 loaded from ant loader (parentFirst)
23-Jan-2017 10:50:12 Class java.lang.ClassCastException loaded from parent loader (parentFirst)
23-Jan-2017 10:50:12 Finding class com.carrotsearch.ant.tasks.junit4.dependencies.com.google.common.collect.Collections2
23-Jan-2017 10:50:12 Loaded from /mnt/work/bamboo-home/xml-data/build-dir/RNDTEST-SOFTWARE-IBM17/junit4-ant/target/junit4-ant-2.4.2-SNAPSHOT.jar com/carrotsearch/ant/tasks/junit4/dependencies/com/google/common/collect/Collections2.class
23-Jan-2017 10:50:12 Class com.carrotsearch.ant.tasks.junit4.dependencies.com.google.common.collect.Collections2 loaded from ant loader (parentFirst)
23-Jan-2017 10:50:12 Finding class com.carrotsearch.ant.tasks.junit4.dependencies.com.google.common.base.Joiner
23-Jan-2017 10:50:12 Loaded from /mnt/work/bamboo-home/xml-data/build-dir/RNDTEST-SOFTWARE-IBM17/junit4-ant/target/junit4-ant-2.4.2-SNAPSHOT.jar com/carrotsearch/ant/tasks/junit4/dependencies/com/google/common/base/Joiner.class
23-Jan-2017 10:50:12 Class com.carrotsearch.ant.tasks.junit4.dependencies.com.google.common.base.Joiner loaded from ant loader (parentFirst)
23-Jan-2017 10:50:12 Finding class com.carrotsearch.ant.tasks.junit4.dependencies.com.google.common.base.Joiner$1
23-Jan-2017 10:50:12 Loaded from /mnt/work/bamboo-home/xml-data/build-dir/RNDTEST-SOFTWARE-IBM17/junit4-ant/target/junit4-ant-2.4.2-SNAPSHOT.jar com/carrotsearch/ant/tasks/junit4/dependencies/com/google/common/base/Joiner$1.class
23-Jan-2017 10:50:12 Class com.carrotsearch.ant.tasks.junit4.dependencies.com.google.common.base.Joiner$1 loaded from ant loader (parentFirst)
23-Jan-2017 10:50:12 Class java.lang.UnsupportedOperationException loaded from parent loader (parentFirst)
23-Jan-2017 10:50:12 Finding class com.carrotsearch.ant.tasks.junit4.dependencies.com.google.common.base.Joiner$MapJoiner
23-Jan-2017 10:50:12 Loaded from /mnt/work/bamboo-home/xml-data/build-dir/RNDTEST-SOFTWARE-IBM17/junit4-ant/target/junit4-ant-2.4.2-SNAPSHOT.jar com/carrotsearch/ant/tasks/junit4/dependencies/com/google/common/base/Joiner$MapJoiner.class
23-Jan-2017 10:50:12 Class com.carrotsearch.ant.tasks.junit4.dependencies.com.google.common.base.Joiner$MapJoiner loaded from ant loader (parentFirst)
23-Jan-2017 10:50:12 Finding class com.carrotsearch.ant.tasks.junit4.dependencies.com.google.common.collect.MapMaker
23-Jan-2017 10:50:12 Loaded from /mnt/work/bamboo-home/xml-data/build-dir/RNDTEST-SOFTWARE-IBM17/junit4-ant/target/junit4-ant-2.4.2-SNAPSHOT.jar com/carrotsearch/ant/tasks/junit4/dependencies/com/google/common/collect/MapMaker.class
23-Jan-2017 10:50:12 Finding class com.carrotsearch.ant.tasks.junit4.dependencies.com.google.common.collect.GenericMapMaker
23-Jan-2017 10:50:12 Loaded from /mnt/work/bamboo-home/xml-data/build-dir/RNDTEST-SOFTWARE-IBM17/junit4-ant/target/junit4-ant-2.4.2-SNAPSHOT.jar com/carrotsearch/ant/tasks/junit4/dependencies/com/google/common/collect/GenericMapMaker.class
23-Jan-2017 10:50:12 Class com.carrotsearch.ant.tasks.junit4.dependencies.com.google.common.collect.GenericMapMaker loaded from ant loader (parentFirst)
23-Jan-2017 10:50:12 Class com.carrotsearch.ant.tasks.junit4.dependencies.com.google.common.collect.MapMaker loaded from ant loader (parentFirst)
23-Jan-2017 10:50:12 Finding class com.carrotsearch.ant.tasks.junit4.dependencies.com.google.common.collect.MapMakerInternalMap
23-Jan-2017 10:50:12 Loaded from /mnt/work/bamboo-home/xml-data/build-dir/RNDTEST-SOFTWARE-IBM17/junit4-ant/target/junit4-ant-2.4.2-SNAPSHOT.jar com/carrotsearch/ant/tasks/junit4/dependencies/com/google/common/collect/MapMakerInternalMap.class
23-Jan-2017 10:50:12 Class com.carrotsearch.ant.tasks.junit4.dependencies.com.google.common.collect.MapMakerInternalMap loaded from ant loader (parentFirst)
23-Jan-2017 10:50:12 Finding class com.carrotsearch.ant.tasks.junit4.dependencies.com.google.common.collect.MapMaker$NullConcurrentMap
23-Jan-2017 10:50:12 Loaded from /mnt/work/bamboo-home/xml-data/build-dir/RNDTEST-SOFTWARE-IBM17/junit4-ant/target/junit4-ant-2.4.2-SNAPSHOT.jar com/carrotsearch/ant/tasks/junit4/dependencies/com/google/common/collect/MapMaker$NullConcurrentMap.class
23-Jan-2017 10:50:12 Class com.carrotsearch.ant.tasks.junit4.dependencies.com.google.common.collect.MapMaker$NullConcurrentMap loaded from ant loader (parentFirst)
23-Jan-2017 10:50:12 Class java.util.concurrent.ConcurrentHashMap loaded from parent loader (parentFirst)
23-Jan-2017 10:50:12 Finding class com.carrotsearch.ant.tasks.junit4.TestsSummaryEventListener
23-Jan-2017 10:50:12 Loaded from /mnt/work/bamboo-home/xml-data/build-dir/RNDTEST-SOFTWARE-IBM17/junit4-ant/target/junit4-ant-2.4.2-SNAPSHOT.jar com/carrotsearch/ant/tasks/junit4/TestsSummaryEventListener.class
23-Jan-2017 10:50:12 Class com.carrotsearch.ant.tasks.junit4.TestsSummaryEventListener loaded from ant loader (parentFirst)
23-Jan-2017 10:50:12 Finding class com.carrotsearch.ant.tasks.junit4.dependencies.com.google.common.collect.HashMultimap
23-Jan-2017 10:50:12 Loaded from /mnt/work/bamboo-home/xml-data/build-dir/RNDTEST-SOFTWARE-IBM17/junit4-ant/target/junit4-ant-2.4.2-SNAPSHOT.jar com/carrotsearch/ant/tasks/junit4/dependencies/com/google/common/collect/HashMultimap.class
23-Jan-2017 10:50:12 Finding class com.carrotsearch.ant.tasks.junit4.dependencies.com.google.common.collect.AbstractSetMultimap
23-Jan-2017 10:50:12 Loaded from /mnt/work/bamboo-home/xml-data/build-dir/RNDTEST-SOFTWARE-IBM17/junit4-ant/target/junit4-ant-2.4.2-SNAPSHOT.jar com/carrotsearch/ant/tasks/junit4/dependencies/com/google/common/collect/AbstractSetMultimap.class
23-Jan-2017 10:50:12 Finding class com.carrotsearch.ant.tasks.junit4.dependencies.com.google.common.collect.AbstractMapBasedMultimap
23-Jan-2017 10:50:12 Loaded from /mnt/work/bamboo-home/xml-data/build-dir/RNDTEST-SOFTWARE-IBM17/junit4-ant/target/junit4-ant-2.4.2-SNAPSHOT.jar com/carrotsearch/ant/tasks/junit4/dependencies/com/google/common/collect/AbstractMapBasedMultimap.class
23-Jan-2017 10:50:12 Finding class com.carrotsearch.ant.tasks.junit4.dependencies.com.google.common.collect.AbstractMultimap
23-Jan-2017 10:50:12 Loaded from /mnt/work/bamboo-home/xml-data/build-dir/RNDTEST-SOFTWARE-IBM17/junit4-ant/target/junit4-ant-2.4.2-SNAPSHOT.jar com/carrotsearch/ant/tasks/junit4/dependencies/com/google/common/collect/AbstractMultimap.class
23-Jan-2017 10:50:12 Class com.carrotsearch.ant.tasks.junit4.dependencies.com.google.common.collect.AbstractMultimap loaded from ant loader (parentFirst)
23-Jan-2017 10:50:12 Class com.carrotsearch.ant.tasks.junit4.dependencies.com.google.common.collect.AbstractMapBasedMultimap loaded from ant loader (parentFirst)
23-Jan-2017 10:50:12 Finding class com.carrotsearch.ant.tasks.junit4.dependencies.com.google.common.collect.SetMultimap
23-Jan-2017 10:50:12 Loaded from /mnt/work/bamboo-home/xml-data/build-dir/RNDTEST-SOFTWARE-IBM17/junit4-ant/target/junit4-ant-2.4.2-SNAPSHOT.jar com/carrotsearch/ant/tasks/junit4/dependencies/com/google/common/collect/SetMultimap.class
23-Jan-2017 10:50:12 Class com.carrotsearch.ant.tasks.junit4.dependencies.com.google.common.collect.SetMultimap loaded from ant loader (parentFirst)
23-Jan-2017 10:50:12 Class com.carrotsearch.ant.tasks.junit4.dependencies.com.google.common.collect.AbstractSetMultimap loaded from ant loader (parentFirst)
23-Jan-2017 10:50:12 Class com.carrotsearch.ant.tasks.junit4.dependencies.com.google.common.collect.HashMultimap loaded from ant loader (parentFirst)
23-Jan-2017 10:50:12 Finding class com.carrotsearch.ant.tasks.junit4.dependencies.com.google.common.collect.AbstractMapBasedMultimap$WrappedList
23-Jan-2017 10:50:12 Loaded from /mnt/work/bamboo-home/xml-data/build-dir/RNDTEST-SOFTWARE-IBM17/junit4-ant/target/junit4-ant-2.4.2-SNAPSHOT.jar com/carrotsearch/ant/tasks/junit4/dependencies/com/google/common/collect/AbstractMapBasedMultimap$WrappedList.class
23-Jan-2017 10:50:12 Finding class com.carrotsearch.ant.tasks.junit4.dependencies.com.google.common.collect.AbstractMapBasedMultimap$WrappedCollection
23-Jan-2017 10:50:12 Loaded from /mnt/work/bamboo-home/xml-data/build-dir/RNDTEST-SOFTWARE-IBM17/junit4-ant/target/junit4-ant-2.4.2-SNAPSHOT.jar com/carrotsearch/ant/tasks/junit4/dependencies/com/google/common/collect/AbstractMapBasedMultimap$WrappedCollection.class
23-Jan-2017 10:50:12 Class java.util.AbstractCollection loaded from parent loader (parentFirst)
23-Jan-2017 10:50:12 Class com.carrotsearch.ant.tasks.junit4.dependencies.com.google.common.collect.AbstractMapBasedMultimap$WrappedCollection loaded from ant loader (parentFirst)
23-Jan-2017 10:50:12 Class com.carrotsearch.ant.tasks.junit4.dependencies.com.google.common.collect.AbstractMapBasedMultimap$WrappedList loaded from ant loader (parentFirst)
23-Jan-2017 10:50:12 Finding class com.carrotsearch.ant.tasks.junit4.dependencies.com.google.common.collect.AbstractMapBasedMultimap$RandomAccessWrappedList
23-Jan-2017 10:50:12 Loaded from /mnt/work/bamboo-home/xml-data/build-dir/RNDTEST-SOFTWARE-IBM17/junit4-ant/target/junit4-ant-2.4.2-SNAPSHOT.jar com/carrotsearch/ant/tasks/junit4/dependencies/com/google/common/collect/AbstractMapBasedMultimap$RandomAccessWrappedList.class
23-Jan-2017 10:50:12 Class java.util.RandomAccess loaded from parent loader (parentFirst)
23-Jan-2017 10:50:12 Class com.carrotsearch.ant.tasks.junit4.dependencies.com.google.common.collect.AbstractMapBasedMultimap$RandomAccessWrappedList loaded from ant loader (parentFirst)
23-Jan-2017 10:50:12 Finding class com.carrotsearch.ant.tasks.junit4.dependencies.com.google.common.collect.AbstractMapBasedMultimap$KeySet
23-Jan-2017 10:50:12 Loaded from /mnt/work/bamboo-home/xml-data/build-dir/RNDTEST-SOFTWARE-IBM17/junit4-ant/target/junit4-ant-2.4.2-SNAPSHOT.jar com/carrotsearch/ant/tasks/junit4/dependencies/com/google/common/collect/AbstractMapBasedMultimap$KeySet.class
23-Jan-2017 10:50:12 Finding class com.carrotsearch.ant.tasks.junit4.dependencies.com.google.common.collect.Maps$KeySet
23-Jan-2017 10:50:12 Loaded from /mnt/work/bamboo-home/xml-data/build-dir/RNDTEST-SOFTWARE-IBM17/junit4-ant/target/junit4-ant-2.4.2-SNAPSHOT.jar com/carrotsearch/ant/tasks/junit4/dependencies/com/google/common/collect/Maps$KeySet.class
23-Jan-2017 10:50:12 Finding class com.carrotsearch.ant.tasks.junit4.dependencies.com.google.common.collect.Sets$ImprovedAbstractSet
23-Jan-2017 10:50:12 Loaded from /mnt/work/bamboo-home/xml-data/build-dir/RNDTEST-SOFTWARE-IBM17/junit4-ant/target/junit4-ant-2.4.2-SNAPSHOT.jar com/carrotsearch/ant/tasks/junit4/dependencies/com/google/common/collect/Sets$ImprovedAbstractSet.class
23-Jan-2017 10:50:12 Class java.util.AbstractSet loaded from parent loader (parentFirst)
23-Jan-2017 10:50:12 Class com.carrotsearch.ant.tasks.junit4.dependencies.com.google.common.collect.Sets$ImprovedAbstractSet loaded from ant loader (parentFirst)
23-Jan-2017 10:50:12 Class com.carrotsearch.ant.tasks.junit4.dependencies.com.google.common.collect.Maps$KeySet loaded from ant loader (parentFirst)
23-Jan-2017 10:50:12 Class com.carrotsearch.ant.tasks.junit4.dependencies.com.google.common.collect.AbstractMapBasedMultimap$KeySet loaded from ant loader (parentFirst)
23-Jan-2017 10:50:12 Finding class com.carrotsearch.ant.tasks.junit4.dependencies.com.google.common.collect.AbstractMapBasedMultimap$SortedKeySet
23-Jan-2017 10:50:12 Loaded from /mnt/work/bamboo-home/xml-data/build-dir/RNDTEST-SOFTWARE-IBM17/junit4-ant/target/junit4-ant-2.4.2-SNAPSHOT.jar com/carrotsearch/ant/tasks/junit4/dependencies/com/google/common/collect/AbstractMapBasedMultimap$SortedKeySet.class
23-Jan-2017 10:50:12 Class java.util.SortedSet loaded from parent loader (parentFirst)
23-Jan-2017 10:50:12 Class com.carrotsearch.ant.tasks.junit4.dependencies.com.google.common.collect.AbstractMapBasedMultimap$SortedKeySet loaded from ant loader (parentFirst)
23-Jan-2017 10:50:12 Finding class com.carrotsearch.ant.tasks.junit4.dependencies.com.google.common.collect.AbstractMapBasedMultimap$AsMap
23-Jan-2017 10:50:12 Loaded from /mnt/work/bamboo-home/xml-data/build-dir/RNDTEST-SOFTWARE-IBM17/junit4-ant/target/junit4-ant-2.4.2-SNAPSHOT.jar com/carrotsearch/ant/tasks/junit4/dependencies/com/google/common/collect/AbstractMapBasedMultimap$AsMap.class
23-Jan-2017 10:50:12 Finding class com.carrotsearch.ant.tasks.junit4.dependencies.com.google.common.collect.Maps$ViewCachingAbstractMap
23-Jan-2017 10:50:12 Loaded from /mnt/work/bamboo-home/xml-data/build-dir/RNDTEST-SOFTWARE-IBM17/junit4-ant/target/junit4-ant-2.4.2-SNAPSHOT.jar com/carrotsearch/ant/tasks/junit4/dependencies/com/google/common/collect/Maps$ViewCachingAbstractMap.class
23-Jan-2017 10:50:12 Class com.carrotsearch.ant.tasks.junit4.dependencies.com.google.common.collect.Maps$ViewCachingAbstractMap loaded from ant loader (parentFirst)
23-Jan-2017 10:50:12 Class com.carrotsearch.ant.tasks.junit4.dependencies.com.google.common.collect.AbstractMapBasedMultimap$AsMap loaded from ant loader (parentFirst)
23-Jan-2017 10:50:12 Finding class com.carrotsearch.ant.tasks.junit4.dependencies.com.google.common.collect.AbstractMapBasedMultimap$SortedAsMap
23-Jan-2017 10:50:12 Loaded from /mnt/work/bamboo-home/xml-data/build-dir/RNDTEST-SOFTWARE-IBM17/junit4-ant/target/junit4-ant-2.4.2-SNAPSHOT.jar com/carrotsearch/ant/tasks/junit4/dependencies/com/google/common/collect/AbstractMapBasedMultimap$SortedAsMap.class
23-Jan-2017 10:50:12 Class java.util.SortedMap loaded from parent loader (parentFirst)
23-Jan-2017 10:50:12 Class com.carrotsearch.ant.tasks.junit4.dependencies.com.google.common.collect.AbstractMapBasedMultimap$SortedAsMap loaded from ant loader (parentFirst)
23-Jan-2017 10:50:12 Class java.util.HashMap loaded from parent loader (parentFirst)
23-Jan-2017 10:50:12 Finding class com.carrotsearch.ant.tasks.junit4.dependencies.com.google.common.cache.LocalCache$LoadingValueReference
23-Jan-2017 10:50:12 Loaded from /mnt/work/bamboo-home/xml-data/build-dir/RNDTEST-SOFTWARE-IBM17/junit4-ant/target/junit4-ant-2.4.2-SNAPSHOT.jar com/carrotsearch/ant/tasks/junit4/dependencies/com/google/common/cache/LocalCache$LoadingValueReference.class
23-Jan-2017 10:50:12 Class com.carrotsearch.ant.tasks.junit4.dependencies.com.google.common.cache.LocalCache$LoadingValueReference loaded from ant loader (parentFirst)
23-Jan-2017 10:50:12 Finding class com.carrotsearch.ant.tasks.junit4.dependencies.com.google.common.util.concurrent.ListenableFuture
23-Jan-2017 10:50:12 Loaded from /mnt/work/bamboo-home/xml-data/build-dir/RNDTEST-SOFTWARE-IBM17/junit4-ant/target/junit4-ant-2.4.2-SNAPSHOT.jar com/carrotsearch/ant/tasks/junit4/dependencies/com/google/common/util/concurrent/ListenableFuture.class
23-Jan-2017 10:50:12 Class com.carrotsearch.ant.tasks.junit4.dependencies.com.google.common.util.concurrent.ListenableFuture loaded from ant loader (parentFirst)
23-Jan-2017 10:50:12 Finding class com.carrotsearch.ant.tasks.junit4.dependencies.com.google.common.util.concurrent.SettableFuture
23-Jan-2017 10:50:12 Loaded from /mnt/work/bamboo-home/xml-data/build-dir/RNDTEST-SOFTWARE-IBM17/junit4-ant/target/junit4-ant-2.4.2-SNAPSHOT.jar com/carrotsearch/ant/tasks/junit4/dependencies/com/google/common/util/concurrent/SettableFuture.class
23-Jan-2017 10:50:12 Finding class com.carrotsearch.ant.tasks.junit4.dependencies.com.google.common.util.concurrent.AbstractFuture$TrustedFuture
23-Jan-2017 10:50:12 Loaded from /mnt/work/bamboo-home/xml-data/build-dir/RNDTEST-SOFTWARE-IBM17/junit4-ant/target/junit4-ant-2.4.2-SNAPSHOT.jar com/carrotsearch/ant/tasks/junit4/dependencies/com/google/common/util/concurrent/AbstractFuture$TrustedFuture.class
23-Jan-2017 10:50:12 Finding class com.carrotsearch.ant.tasks.junit4.dependencies.com.google.common.util.concurrent.AbstractFuture
23-Jan-2017 10:50:12 Loaded from /mnt/work/bamboo-home/xml-data/build-dir/RNDTEST-SOFTWARE-IBM17/junit4-ant/target/junit4-ant-2.4.2-SNAPSHOT.jar com/carrotsearch/ant/tasks/junit4/dependencies/com/google/common/util/concurrent/AbstractFuture.class
23-Jan-2017 10:50:12 Class com.carrotsearch.ant.tasks.junit4.dependencies.com.google.common.util.concurrent.AbstractFuture loaded from ant loader (parentFirst)
23-Jan-2017 10:50:12 Class com.carrotsearch.ant.tasks.junit4.dependencies.com.google.common.util.concurrent.AbstractFuture$TrustedFuture loaded from ant loader (parentFirst)
23-Jan-2017 10:50:12 Class com.carrotsearch.ant.tasks.junit4.dependencies.com.google.common.util.concurrent.SettableFuture loaded from ant loader (parentFirst)
23-Jan-2017 10:50:12 Class java.util.concurrent.TimeoutException loaded from parent loader (parentFirst)
23-Jan-2017 10:50:12 Class java.util.concurrent.CancellationException loaded from parent loader (parentFirst)
23-Jan-2017 10:50:12 Finding class com.carrotsearch.ant.tasks.junit4.dependencies.com.google.common.util.concurrent.AbstractFuture$AtomicHelper
23-Jan-2017 10:50:12 Loaded from /mnt/work/bamboo-home/xml-data/build-dir/RNDTEST-SOFTWARE-IBM17/junit4-ant/target/junit4-ant-2.4.2-SNAPSHOT.jar com/carrotsearch/ant/tasks/junit4/dependencies/com/google/common/util/concurrent/AbstractFuture$AtomicHelper.class
23-Jan-2017 10:50:12 Class com.carrotsearch.ant.tasks.junit4.dependencies.com.google.common.util.concurrent.AbstractFuture$AtomicHelper loaded from ant loader (parentFirst)
23-Jan-2017 10:50:12 Finding class com.carrotsearch.ant.tasks.junit4.dependencies.com.google.common.util.concurrent.AbstractFuture$UnsafeAtomicHelper
23-Jan-2017 10:50:12 Loaded from /mnt/work/bamboo-home/xml-data/build-dir/RNDTEST-SOFTWARE-IBM17/junit4-ant/target/junit4-ant-2.4.2-SNAPSHOT.jar com/carrotsearch/ant/tasks/junit4/dependencies/com/google/common/util/concurrent/AbstractFuture$UnsafeAtomicHelper.class
23-Jan-2017 10:50:12 Class com.carrotsearch.ant.tasks.junit4.dependencies.com.google.common.util.concurrent.AbstractFuture$UnsafeAtomicHelper loaded from ant loader (parentFirst)
23-Jan-2017 10:50:12 Finding class com.carrotsearch.ant.tasks.junit4.dependencies.com.google.common.util.concurrent.AbstractFuture$SafeAtomicHelper
23-Jan-2017 10:50:12 Loaded from /mnt/work/bamboo-home/xml-data/build-dir/RNDTEST-SOFTWARE-IBM17/junit4-ant/target/junit4-ant-2.4.2-SNAPSHOT.jar com/carrotsearch/ant/tasks/junit4/dependencies/com/google/common/util/concurrent/AbstractFuture$SafeAtomicHelper.class
23-Jan-2017 10:50:12 Class com.carrotsearch.ant.tasks.junit4.dependencies.com.google.common.util.concurrent.AbstractFuture$SafeAtomicHelper loaded from ant loader (parentFirst)
23-Jan-2017 10:50:12 Finding class com.carrotsearch.ant.tasks.junit4.dependencies.com.google.common.util.concurrent.AbstractFuture$SynchronizedHelper
23-Jan-2017 10:50:12 Loaded from /mnt/work/bamboo-home/xml-data/build-dir/RNDTEST-SOFTWARE-IBM17/junit4-ant/target/junit4-ant-2.4.2-SNAPSHOT.jar com/carrotsearch/ant/tasks/junit4/dependencies/com/google/common/util/concurrent/AbstractFuture$SynchronizedHelper.class
23-Jan-2017 10:50:12 Class com.carrotsearch.ant.tasks.junit4.dependencies.com.google.common.util.concurrent.AbstractFuture$SynchronizedHelper loaded from ant loader (parentFirst)
23-Jan-2017 10:50:12 Class java.security.PrivilegedExceptionAction loaded from parent loader (parentFirst)
23-Jan-2017 10:50:12 Class java.lang.SecurityException loaded from parent loader (parentFirst)
23-Jan-2017 10:50:12 Class java.security.PrivilegedActionException loaded from parent loader (parentFirst)
23-Jan-2017 10:50:12 Class sun.misc.Unsafe loaded from parent loader (parentFirst)
23-Jan-2017 10:50:12 Finding class com.carrotsearch.ant.tasks.junit4.dependencies.com.google.common.util.concurrent.AbstractFuture$UnsafeAtomicHelper$1
23-Jan-2017 10:50:12 Loaded from /mnt/work/bamboo-home/xml-data/build-dir/RNDTEST-SOFTWARE-IBM17/junit4-ant/target/junit4-ant-2.4.2-SNAPSHOT.jar com/carrotsearch/ant/tasks/junit4/dependencies/com/google/common/util/concurrent/AbstractFuture$UnsafeAtomicHelper$1.class
23-Jan-2017 10:50:12 Class com.carrotsearch.ant.tasks.junit4.dependencies.com.google.common.util.concurrent.AbstractFuture$UnsafeAtomicHelper$1 loaded from ant loader (parentFirst)
23-Jan-2017 10:50:12 Class java.lang.NoSuchFieldError loaded from parent loader (parentFirst)
23-Jan-2017 10:50:12 Class java.security.AccessController loaded from parent loader (parentFirst)
23-Jan-2017 10:50:12 Class java.lang.reflect.Field loaded from parent loader (parentFirst)
23-Jan-2017 10:50:12 Finding class com.carrotsearch.ant.tasks.junit4.dependencies.com.google.common.util.concurrent.AbstractFuture$Waiter
23-Jan-2017 10:50:12 Loaded from /mnt/work/bamboo-home/xml-data/build-dir/RNDTEST-SOFTWARE-IBM17/junit4-ant/target/junit4-ant-2.4.2-SNAPSHOT.jar com/carrotsearch/ant/tasks/junit4/dependencies/com/google/common/util/concurrent/AbstractFuture$Waiter.class
23-Jan-2017 10:50:12 Class com.carrotsearch.ant.tasks.junit4.dependencies.com.google.common.util.concurrent.AbstractFuture$Waiter loaded from ant loader (parentFirst)
23-Jan-2017 10:50:12 Finding class com.carrotsearch.ant.tasks.junit4.dependencies.com.google.common.util.concurrent.AbstractFuture$Listener
23-Jan-2017 10:50:12 Loaded from /mnt/work/bamboo-home/xml-data/build-dir/RNDTEST-SOFTWARE-IBM17/junit4-ant/target/junit4-ant-2.4.2-SNAPSHOT.jar com/carrotsearch/ant/tasks/junit4/dependencies/com/google/common/util/concurrent/AbstractFuture$Listener.class
23-Jan-2017 10:50:12 Class com.carrotsearch.ant.tasks.junit4.dependencies.com.google.common.util.concurrent.AbstractFuture$Listener loaded from ant loader (parentFirst)
23-Jan-2017 10:50:12 Class java.util.concurrent.locks.LockSupport loaded from parent loader (parentFirst)
23-Jan-2017 10:50:12 Finding class com.carrotsearch.ant.tasks.junit4.dependencies.com.google.common.base.Stopwatch
23-Jan-2017 10:50:12 Loaded from /mnt/work/bamboo-home/xml-data/build-dir/RNDTEST-SOFTWARE-IBM17/junit4-ant/target/junit4-ant-2.4.2-SNAPSHOT.jar com/carrotsearch/ant/tasks/junit4/dependencies/com/google/common/base/Stopwatch.class
23-Jan-2017 10:50:12 Class com.carrotsearch.ant.tasks.junit4.dependencies.com.google.common.base.Stopwatch loaded from ant loader (parentFirst)
23-Jan-2017 10:50:12 Finding class com.carrotsearch.ant.tasks.junit4.dependencies.com.google.common.cache.LocalCache$WeakEntry
23-Jan-2017 10:50:12 Loaded from /mnt/work/bamboo-home/xml-data/build-dir/RNDTEST-SOFTWARE-IBM17/junit4-ant/target/junit4-ant-2.4.2-SNAPSHOT.jar com/carrotsearch/ant/tasks/junit4/dependencies/com/google/common/cache/LocalCache$WeakEntry.class
23-Jan-2017 10:50:12 Class com.carrotsearch.ant.tasks.junit4.dependencies.com.google.common.cache.LocalCache$WeakEntry loaded from ant loader (parentFirst)
23-Jan-2017 10:50:12 Finding class com.carrotsearch.ant.tasks.junit4.dependencies.com.google.common.cache.RemovalNotification
23-Jan-2017 10:50:12 Loaded from /mnt/work/bamboo-home/xml-data/build-dir/RNDTEST-SOFTWARE-IBM17/junit4-ant/target/junit4-ant-2.4.2-SNAPSHOT.jar com/carrotsearch/ant/tasks/junit4/dependencies/com/google/common/cache/RemovalNotification.class
23-Jan-2017 10:50:12 Class com.carrotsearch.ant.tasks.junit4.dependencies.com.google.common.cache.RemovalNotification loaded from ant loader (parentFirst)
23-Jan-2017 10:50:12 Finding class com.carrotsearch.ant.tasks.junit4.dependencies.com.google.common.base.Platform
23-Jan-2017 10:50:12 Loaded from /mnt/work/bamboo-home/xml-data/build-dir/RNDTEST-SOFTWARE-IBM17/junit4-ant/target/junit4-ant-2.4.2-SNAPSHOT.jar com/carrotsearch/ant/tasks/junit4/dependencies/com/google/common/base/Platform.class
23-Jan-2017 10:50:12 Class com.carrotsearch.ant.tasks.junit4.dependencies.com.google.common.base.Platform loaded from ant loader (parentFirst)
23-Jan-2017 10:50:12 Finding class com.carrotsearch.ant.tasks.junit4.dependencies.com.google.common.reflect.TypeToken
23-Jan-2017 10:50:12 Loaded from /mnt/work/bamboo-home/xml-data/build-dir/RNDTEST-SOFTWARE-IBM17/junit4-ant/target/junit4-ant-2.4.2-SNAPSHOT.jar com/carrotsearch/ant/tasks/junit4/dependencies/com/google/common/reflect/TypeToken.class
23-Jan-2017 10:50:12 Finding class com.carrotsearch.ant.tasks.junit4.dependencies.com.google.common.reflect.TypeCapture
23-Jan-2017 10:50:12 Loaded from /mnt/work/bamboo-home/xml-data/build-dir/RNDTEST-SOFTWARE-IBM17/junit4-ant/target/junit4-ant-2.4.2-SNAPSHOT.jar com/carrotsearch/ant/tasks/junit4/dependencies/com/google/common/reflect/TypeCapture.class
23-Jan-2017 10:50:12 Class com.carrotsearch.ant.tasks.junit4.dependencies.com.google.common.reflect.TypeCapture loaded from ant loader (parentFirst)
23-Jan-2017 10:50:12 Class com.carrotsearch.ant.tasks.junit4.dependencies.com.google.common.reflect.TypeToken loaded from ant loader (parentFirst)
23-Jan-2017 10:50:12 Class java.lang.reflect.Type loaded from parent loader (parentFirst)
23-Jan-2017 10:50:12 Finding class com.carrotsearch.ant.tasks.junit4.dependencies.com.google.common.reflect.TypeToken$SimpleTypeToken
23-Jan-2017 10:50:12 Loaded from /mnt/work/bamboo-home/xml-data/build-dir/RNDTEST-SOFTWARE-IBM17/junit4-ant/target/junit4-ant-2.4.2-SNAPSHOT.jar com/carrotsearch/ant/tasks/junit4/dependencies/com/google/common/reflect/TypeToken$SimpleTypeToken.class
23-Jan-2017 10:50:12 Class com.carrotsearch.ant.tasks.junit4.dependencies.com.google.common.reflect.TypeToken$SimpleTypeToken loaded from ant loader (parentFirst)
23-Jan-2017 10:50:12 Finding class com.carrotsearch.ant.tasks.junit4.dependencies.com.google.common.reflect.TypeToken$TypeSet
23-Jan-2017 10:50:12 Loaded from /mnt/work/bamboo-home/xml-data/build-dir/RNDTEST-SOFTWARE-IBM17/junit4-ant/target/junit4-ant-2.4.2-SNAPSHOT.jar com/carrotsearch/ant/tasks/junit4/dependencies/com/google/common/reflect/TypeToken$TypeSet.class
23-Jan-2017 10:50:12 Finding class com.carrotsearch.ant.tasks.junit4.dependencies.com.google.common.collect.ForwardingSet
23-Jan-2017 10:50:12 Loaded from /mnt/work/bamboo-home/xml-data/build-dir/RNDTEST-SOFTWARE-IBM17/junit4-ant/target/junit4-ant-2.4.2-SNAPSHOT.jar com/carrotsearch/ant/tasks/junit4/dependencies/com/google/common/collect/ForwardingSet.class
23-Jan-2017 10:50:12 Finding class com.carrotsearch.ant.tasks.junit4.dependencies.com.google.common.collect.ForwardingCollection
23-Jan-2017 10:50:12 Loaded from /mnt/work/bamboo-home/xml-data/build-dir/RNDTEST-SOFTWARE-IBM17/junit4-ant/target/junit4-ant-2.4.2-SNAPSHOT.jar com/carrotsearch/ant/tasks/junit4/dependencies/com/google/common/collect/ForwardingCollection.class
23-Jan-2017 10:50:12 Finding class com.carrotsearch.ant.tasks.junit4.dependencies.com.google.common.collect.ForwardingObject
23-Jan-2017 10:50:12 Loaded from /mnt/work/bamboo-home/xml-data/build-dir/RNDTEST-SOFTWARE-IBM17/junit4-ant/target/junit4-ant-2.4.2-SNAPSHOT.jar com/carrotsearch/ant/tasks/junit4/dependencies/com/google/common/collect/ForwardingObject.class
23-Jan-2017 10:50:12 Class com.carrotsearch.ant.tasks.junit4.dependencies.com.google.common.collect.ForwardingObject loaded from ant loader (parentFirst)
23-Jan-2017 10:50:12 Class com.carrotsearch.ant.tasks.junit4.dependencies.com.google.common.collect.ForwardingCollection loaded from ant loader (parentFirst)
23-Jan-2017 10:50:12 Class com.carrotsearch.ant.tasks.junit4.dependencies.com.google.common.collect.ForwardingSet loaded from ant loader (parentFirst)
23-Jan-2017 10:50:12 Class com.carrotsearch.ant.tasks.junit4.dependencies.com.google.common.reflect.TypeToken$TypeSet loaded from ant loader (parentFirst)
23-Jan-2017 10:50:12 Finding class com.carrotsearch.ant.tasks.junit4.dependencies.com.google.common.base.Predicate
23-Jan-2017 10:50:12 Loaded from /mnt/work/bamboo-home/xml-data/build-dir/RNDTEST-SOFTWARE-IBM17/junit4-ant/target/junit4-ant-2.4.2-SNAPSHOT.jar com/carrotsearch/ant/tasks/junit4/dependencies/com/google/common/base/Predicate.class
23-Jan-2017 10:50:12 Class com.carrotsearch.ant.tasks.junit4.dependencies.com.google.common.base.Predicate loaded from ant loader (parentFirst)
23-Jan-2017 10:50:12 Finding class com.carrotsearch.ant.tasks.junit4.dependencies.com.google.common.reflect.TypeToken$TypeCollector
23-Jan-2017 10:50:12 Loaded from /mnt/work/bamboo-home/xml-data/build-dir/RNDTEST-SOFTWARE-IBM17/junit4-ant/target/junit4-ant-2.4.2-SNAPSHOT.jar com/carrotsearch/ant/tasks/junit4/dependencies/com/google/common/reflect/TypeToken$TypeCollector.class
23-Jan-2017 10:50:12 Class com.carrotsearch.ant.tasks.junit4.dependencies.com.google.common.reflect.TypeToken$TypeCollector loaded from ant loader (parentFirst)
23-Jan-2017 10:50:12 Finding class com.carrotsearch.ant.tasks.junit4.dependencies.com.google.common.collect.Ordering
23-Jan-2017 10:50:12 Loaded from /mnt/work/bamboo-home/xml-data/build-dir/RNDTEST-SOFTWARE-IBM17/junit4-ant/target/junit4-ant-2.4.2-SNAPSHOT.jar com/carrotsearch/ant/tasks/junit4/dependencies/com/google/common/collect/Ordering.class
23-Jan-2017 10:50:12 Class com.carrotsearch.ant.tasks.junit4.dependencies.com.google.common.collect.Ordering loaded from ant loader (parentFirst)
23-Jan-2017 10:50:12 Finding class com.carrotsearch.ant.tasks.junit4.dependencies.com.google.common.reflect.TypeToken$TypeCollector$4
23-Jan-2017 10:50:12 Loaded from /mnt/work/bamboo-home/xml-data/build-dir/RNDTEST-SOFTWARE-IBM17/junit4-ant/target/junit4-ant-2.4.2-SNAPSHOT.jar com/carrotsearch/ant/tasks/junit4/dependencies/com/google/common/reflect/TypeToken$TypeCollector$4.class
23-Jan-2017 10:50:12 Class com.carrotsearch.ant.tasks.junit4.dependencies.com.google.common.reflect.TypeToken$TypeCollector$4 loaded from ant loader (parentFirst)
23-Jan-2017 10:50:12 Finding class com.carrotsearch.ant.tasks.junit4.dependencies.com.google.common.reflect.TypeToken$TypeCollector$1
23-Jan-2017 10:50:12 Loaded from /mnt/work/bamboo-home/xml-data/build-dir/RNDTEST-SOFTWARE-IBM17/junit4-ant/target/junit4-ant-2.4.2-SNAPSHOT.jar com/carrotsearch/ant/tasks/junit4/dependencies/com/google/common/reflect/TypeToken$TypeCollector$1.class
23-Jan-2017 10:50:12 Class com.carrotsearch.ant.tasks.junit4.dependencies.com.google.common.reflect.TypeToken$TypeCollector$1 loaded from ant loader (parentFirst)
23-Jan-2017 10:50:12 Finding class com.carrotsearch.ant.tasks.junit4.dependencies.com.google.common.reflect.TypeToken$TypeCollector$2
23-Jan-2017 10:50:12 Loaded from /mnt/work/bamboo-home/xml-data/build-dir/RNDTEST-SOFTWARE-IBM17/junit4-ant/target/junit4-ant-2.4.2-SNAPSHOT.jar com/carrotsearch/ant/tasks/junit4/dependencies/com/google/common/reflect/TypeToken$TypeCollector$2.class
23-Jan-2017 10:50:12 Class com.carrotsearch.ant.tasks.junit4.dependencies.com.google.common.reflect.TypeToken$TypeCollector$2 loaded from ant loader (parentFirst)
23-Jan-2017 10:50:12 Finding class com.carrotsearch.ant.tasks.junit4.dependencies.com.google.common.collect.ImmutableSet
23-Jan-2017 10:50:12 Loaded from /mnt/work/bamboo-home/xml-data/build-dir/RNDTEST-SOFTWARE-IBM17/junit4-ant/target/junit4-ant-2.4.2-SNAPSHOT.jar com/carrotsearch/ant/tasks/junit4/dependencies/com/google/common/collect/ImmutableSet.class
23-Jan-2017 10:50:12 Finding class com.carrotsearch.ant.tasks.junit4.dependencies.com.google.common.collect.ImmutableCollection
23-Jan-2017 10:50:12 Loaded from /mnt/work/bamboo-home/xml-data/build-dir/RNDTEST-SOFTWARE-IBM17/junit4-ant/target/junit4-ant-2.4.2-SNAPSHOT.jar com/carrotsearch/ant/tasks/junit4/dependencies/com/google/common/collect/ImmutableCollection.class
23-Jan-2017 10:50:12 Class com.carrotsearch.ant.tasks.junit4.dependencies.com.google.common.collect.ImmutableCollection loaded from ant loader (parentFirst)
23-Jan-2017 10:50:12 Class com.carrotsearch.ant.tasks.junit4.dependencies.com.google.common.collect.ImmutableSet loaded from ant loader (parentFirst)
23-Jan-2017 10:50:12 Finding class com.carrotsearch.ant.tasks.junit4.dependencies.com.google.common.collect.ImmutableList
23-Jan-2017 10:50:12 Loaded from /mnt/work/bamboo-home/xml-data/build-dir/RNDTEST-SOFTWARE-IBM17/junit4-ant/target/junit4-ant-2.4.2-SNAPSHOT.jar com/carrotsearch/ant/tasks/junit4/dependencies/com/google/common/collect/ImmutableList.class
23-Jan-2017 10:50:12 Class com.carrotsearch.ant.tasks.junit4.dependencies.com.google.common.collect.ImmutableList loaded from ant loader (parentFirst)
23-Jan-2017 10:50:12 Finding class com.carrotsearch.ant.tasks.junit4.dependencies.com.google.common.collect.RegularImmutableAsList
23-Jan-2017 10:50:12 Loaded from /mnt/work/bamboo-home/xml-data/build-dir/RNDTEST-SOFTWARE-IBM17/junit4-ant/target/junit4-ant-2.4.2-SNAPSHOT.jar com/carrotsearch/ant/tasks/junit4/dependencies/com/google/common/collect/RegularImmutableAsList.class
23-Jan-2017 10:50:12 Finding class com.carrotsearch.ant.tasks.junit4.dependencies.com.google.common.collect.ImmutableAsList
23-Jan-2017 10:50:12 Loaded from /mnt/work/bamboo-home/xml-data/build-dir/RNDTEST-SOFTWARE-IBM17/junit4-ant/target/junit4-ant-2.4.2-SNAPSHOT.jar com/carrotsearch/ant/tasks/junit4/dependencies/com/google/common/collect/ImmutableAsList.class
23-Jan-2017 10:50:12 Class com.carrotsearch.ant.tasks.junit4.dependencies.com.google.common.collect.ImmutableAsList loaded from ant loader (parentFirst)
23-Jan-2017 10:50:12 Class com.carrotsearch.ant.tasks.junit4.dependencies.com.google.common.collect.RegularImmutableAsList loaded from ant loader (parentFirst)
23-Jan-2017 10:50:12 Finding class com.carrotsearch.ant.tasks.junit4.dependencies.com.google.common.collect.RegularImmutableSet
23-Jan-2017 10:50:12 Loaded from /mnt/work/bamboo-home/xml-data/build-dir/RNDTEST-SOFTWARE-IBM17/junit4-ant/target/junit4-ant-2.4.2-SNAPSHOT.jar com/carrotsearch/ant/tasks/junit4/dependencies/com/google/common/collect/RegularImmutableSet.class
23-Jan-2017 10:50:12 Class com.carrotsearch.ant.tasks.junit4.dependencies.com.google.common.collect.RegularImmutableSet loaded from ant loader (parentFirst)
23-Jan-2017 10:50:12 Finding class com.carrotsearch.ant.tasks.junit4.dependencies.com.google.common.collect.SingletonImmutableSet
23-Jan-2017 10:50:12 Loaded from /mnt/work/bamboo-home/xml-data/build-dir/RNDTEST-SOFTWARE-IBM17/junit4-ant/target/junit4-ant-2.4.2-SNAPSHOT.jar com/carrotsearch/ant/tasks/junit4/dependencies/com/google/common/collect/SingletonImmutableSet.class
23-Jan-2017 10:50:12 Class com.carrotsearch.ant.tasks.junit4.dependencies.com.google.common.collect.SingletonImmutableSet loaded from ant loader (parentFirst)
23-Jan-2017 10:50:12 Finding class com.carrotsearch.ant.tasks.junit4.dependencies.com.google.common.collect.ImmutableSet$Builder
23-Jan-2017 10:50:12 Loaded from /mnt/work/bamboo-home/xml-data/build-dir/RNDTEST-SOFTWARE-IBM17/junit4-ant/target/junit4-ant-2.4.2-SNAPSHOT.jar com/carrotsearch/ant/tasks/junit4/dependencies/com/google/common/collect/ImmutableSet$Builder.class
23-Jan-2017 10:50:12 Finding class com.carrotsearch.ant.tasks.junit4.dependencies.com.google.common.collect.ImmutableCollection$ArrayBasedBuilder
23-Jan-2017 10:50:12 Loaded from /mnt/work/bamboo-home/xml-data/build-dir/RNDTEST-SOFTWARE-IBM17/junit4-ant/target/junit4-ant-2.4.2-SNAPSHOT.jar com/carrotsearch/ant/tasks/junit4/dependencies/com/google/common/collect/ImmutableCollection$ArrayBasedBuilder.class
23-Jan-2017 10:50:12 Finding class com.carrotsearch.ant.tasks.junit4.dependencies.com.google.common.collect.ImmutableCollection$Builder
23-Jan-2017 10:50:12 Loaded from /mnt/work/bamboo-home/xml-data/build-dir/RNDTEST-SOFTWARE-IBM17/junit4-ant/target/junit4-ant-2.4.2-SNAPSHOT.jar com/carrotsearch/ant/tasks/junit4/dependencies/com/google/common/collect/ImmutableCollection$Builder.class
23-Jan-2017 10:50:12 Class com.carrotsearch.ant.tasks.junit4.dependencies.com.google.common.collect.ImmutableCollection$Builder loaded from ant loader (parentFirst)
23-Jan-2017 10:50:12 Class com.carrotsearch.ant.tasks.junit4.dependencies.com.google.common.collect.ImmutableCollection$ArrayBasedBuilder loaded from ant loader (parentFirst)
23-Jan-2017 10:50:12 Class com.carrotsearch.ant.tasks.junit4.dependencies.com.google.common.collect.ImmutableSet$Builder loaded from ant loader (parentFirst)
23-Jan-2017 10:50:12 Finding class com.carrotsearch.ant.tasks.junit4.dependencies.com.google.common.collect.CollectPreconditions
23-Jan-2017 10:50:12 Loaded from /mnt/work/bamboo-home/xml-data/build-dir/RNDTEST-SOFTWARE-IBM17/junit4-ant/target/junit4-ant-2.4.2-SNAPSHOT.jar com/carrotsearch/ant/tasks/junit4/dependencies/com/google/common/collect/CollectPreconditions.class
23-Jan-2017 10:50:12 Class com.carrotsearch.ant.tasks.junit4.dependencies.com.google.common.collect.CollectPreconditions loaded from ant loader (parentFirst)
23-Jan-2017 10:50:12 Finding class com.carrotsearch.ant.tasks.junit4.dependencies.com.google.common.reflect.TypeToken$5
23-Jan-2017 10:50:12 Loaded from /mnt/work/bamboo-home/xml-data/build-dir/RNDTEST-SOFTWARE-IBM17/junit4-ant/target/junit4-ant-2.4.2-SNAPSHOT.jar com/carrotsearch/ant/tasks/junit4/dependencies/com/google/common/reflect/TypeToken$5.class
23-Jan-2017 10:50:12 Finding class com.carrotsearch.ant.tasks.junit4.dependencies.com.google.common.reflect.TypeVisitor
23-Jan-2017 10:50:12 Loaded from /mnt/work/bamboo-home/xml-data/build-dir/RNDTEST-SOFTWARE-IBM17/junit4-ant/target/junit4-ant-2.4.2-SNAPSHOT.jar com/carrotsearch/ant/tasks/junit4/dependencies/com/google/common/reflect/TypeVisitor.class
23-Jan-2017 10:50:12 Class com.carrotsearch.ant.tasks.junit4.dependencies.com.google.common.reflect.TypeVisitor loaded from ant loader (parentFirst)
23-Jan-2017 10:50:12 Class com.carrotsearch.ant.tasks.junit4.dependencies.com.google.common.reflect.TypeToken$5 loaded from ant loader (parentFirst)
23-Jan-2017 10:50:12 Finding class com.carrotsearch.ant.tasks.junit4.dependencies.com.google.common.collect.Sets
23-Jan-2017 10:50:12 Loaded from /mnt/work/bamboo-home/xml-data/build-dir/RNDTEST-SOFTWARE-IBM17/junit4-ant/target/junit4-ant-2.4.2-SNAPSHOT.jar com/carrotsearch/ant/tasks/junit4/dependencies/com/google/common/collect/Sets.class
23-Jan-2017 10:50:12 Class com.carrotsearch.ant.tasks.junit4.dependencies.com.google.common.collect.Sets loaded from ant loader (parentFirst)
23-Jan-2017 10:50:12 Class java.lang.reflect.TypeVariable loaded from parent loader (parentFirst)
23-Jan-2017 10:50:12 Class java.lang.reflect.WildcardType loaded from parent loader (parentFirst)
23-Jan-2017 10:50:12 Class java.lang.reflect.ParameterizedType loaded from parent loader (parentFirst)
23-Jan-2017 10:50:12 Finding class com.carrotsearch.ant.tasks.junit4.dependencies.com.google.common.collect.Iterators
23-Jan-2017 10:50:12 Loaded from /mnt/work/bamboo-home/xml-data/build-dir/RNDTEST-SOFTWARE-IBM17/junit4-ant/target/junit4-ant-2.4.2-SNAPSHOT.jar com/carrotsearch/ant/tasks/junit4/dependencies/com/google/common/collect/Iterators.class
23-Jan-2017 10:50:12 Class com.carrotsearch.ant.tasks.junit4.dependencies.com.google.common.collect.Iterators loaded from ant loader (parentFirst)
23-Jan-2017 10:50:12 Finding class com.carrotsearch.ant.tasks.junit4.dependencies.com.google.common.collect.UnmodifiableListIterator
23-Jan-2017 10:50:12 Loaded from /mnt/work/bamboo-home/xml-data/build-dir/RNDTEST-SOFTWARE-IBM17/junit4-ant/target/junit4-ant-2.4.2-SNAPSHOT.jar com/carrotsearch/ant/tasks/junit4/dependencies/com/google/common/collect/UnmodifiableListIterator.class
23-Jan-2017 10:50:12 Class java.util.ListIterator loaded from parent loader (parentFirst)
23-Jan-2017 10:50:12 Class com.carrotsearch.ant.tasks.junit4.dependencies.com.google.common.collect.UnmodifiableListIterator loaded from ant loader (parentFirst)
23-Jan-2017 10:50:12 Finding class com.carrotsearch.ant.tasks.junit4.dependencies.com.google.common.collect.Iterators$3
23-Jan-2017 10:50:12 Loaded from /mnt/work/bamboo-home/xml-data/build-dir/RNDTEST-SOFTWARE-IBM17/junit4-ant/target/junit4-ant-2.4.2-SNAPSHOT.jar com/carrotsearch/ant/tasks/junit4/dependencies/com/google/common/collect/Iterators$3.class
23-Jan-2017 10:50:12 Class com.carrotsearch.ant.tasks.junit4.dependencies.com.google.common.collect.Iterators$3 loaded from ant loader (parentFirst)
23-Jan-2017 10:50:12 Finding class com.carrotsearch.ant.tasks.junit4.dependencies.com.google.common.collect.Iterators$7
23-Jan-2017 10:50:12 Loaded from /mnt/work/bamboo-home/xml-data/build-dir/RNDTEST-SOFTWARE-IBM17/junit4-ant/target/junit4-ant-2.4.2-SNAPSHOT.jar com/carrotsearch/ant/tasks/junit4/dependencies/com/google/common/collect/Iterators$7.class
23-Jan-2017 10:50:12 Finding class com.carrotsearch.ant.tasks.junit4.dependencies.com.google.common.collect.AbstractIterator
23-Jan-2017 10:50:12 Loaded from /mnt/work/bamboo-home/xml-data/build-dir/RNDTEST-SOFTWARE-IBM17/junit4-ant/target/junit4-ant-2.4.2-SNAPSHOT.jar com/carrotsearch/ant/tasks/junit4/dependencies/com/google/common/collect/AbstractIterator.class
23-Jan-2017 10:50:12 Class com.carrotsearch.ant.tasks.junit4.dependencies.com.google.common.collect.AbstractIterator loaded from ant loader (parentFirst)
23-Jan-2017 10:50:12 Class com.carrotsearch.ant.tasks.junit4.dependencies.com.google.common.collect.Iterators$7 loaded from ant loader (parentFirst)
23-Jan-2017 10:50:12 Finding class com.carrotsearch.ant.tasks.junit4.dependencies.com.google.common.collect.Iterators$11
23-Jan-2017 10:50:12 Loaded from /mnt/work/bamboo-home/xml-data/build-dir/RNDTEST-SOFTWARE-IBM17/junit4-ant/target/junit4-ant-2.4.2-SNAPSHOT.jar com/carrotsearch/ant/tasks/junit4/dependencies/com/google/common/collect/Iterators$11.class
23-Jan-2017 10:50:12 Finding class com.carrotsearch.ant.tasks.junit4.dependencies.com.google.common.collect.AbstractIndexedListIterator
23-Jan-2017 10:50:12 Loaded from /mnt/work/bamboo-home/xml-data/build-dir/RNDTEST-SOFTWARE-IBM17/junit4-ant/target/junit4-ant-2.4.2-SNAPSHOT.jar com/carrotsearch/ant/tasks/junit4/dependencies/com/google/common/collect/AbstractIndexedListIterator.class
23-Jan-2017 10:50:12 Class com.carrotsearch.ant.tasks.junit4.dependencies.com.google.common.collect.AbstractIndexedListIterator loaded from ant loader (parentFirst)
23-Jan-2017 10:50:12 Class com.carrotsearch.ant.tasks.junit4.dependencies.com.google.common.collect.Iterators$11 loaded from ant loader (parentFirst)
23-Jan-2017 10:50:12 Finding class com.carrotsearch.ant.tasks.junit4.dependencies.com.google.common.collect.Iterators$12
23-Jan-2017 10:50:12 Loaded from /mnt/work/bamboo-home/xml-data/build-dir/RNDTEST-SOFTWARE-IBM17/junit4-ant/target/junit4-ant-2.4.2-SNAPSHOT.jar com/carrotsearch/ant/tasks/junit4/dependencies/com/google/common/collect/Iterators$12.class
23-Jan-2017 10:50:12 Class com.carrotsearch.ant.tasks.junit4.dependencies.com.google.common.collect.Iterators$12 loaded from ant loader (parentFirst)
23-Jan-2017 10:50:12 Finding class com.carrotsearch.ant.tasks.junit4.dependencies.com.google.common.collect.PeekingIterator
23-Jan-2017 10:50:12 Loaded from /mnt/work/bamboo-home/xml-data/build-dir/RNDTEST-SOFTWARE-IBM17/junit4-ant/target/junit4-ant-2.4.2-SNAPSHOT.jar com/carrotsearch/ant/tasks/junit4/dependencies/com/google/common/collect/PeekingIterator.class
23-Jan-2017 10:50:12 Class com.carrotsearch.ant.tasks.junit4.dependencies.com.google.common.collect.PeekingIterator loaded from ant loader (parentFirst)
23-Jan-2017 10:50:12 Finding class com.carrotsearch.ant.tasks.junit4.dependencies.com.google.common.collect.Iterators$1
23-Jan-2017 10:50:12 Loaded from /mnt/work/bamboo-home/xml-data/build-dir/RNDTEST-SOFTWARE-IBM17/junit4-ant/target/junit4-ant-2.4.2-SNAPSHOT.jar com/carrotsearch/ant/tasks/junit4/dependencies/com/google/common/collect/Iterators$1.class
23-Jan-2017 10:50:12 Class com.carrotsearch.ant.tasks.junit4.dependencies.com.google.common.collect.Iterators$1 loaded from ant loader (parentFirst)
23-Jan-2017 10:50:12 Class java.util.NoSuchElementException loaded from parent loader (parentFirst)
23-Jan-2017 10:50:12 Finding class com.carrotsearch.ant.tasks.junit4.dependencies.com.google.common.collect.Iterators$2
23-Jan-2017 10:50:12 Loaded from /mnt/work/bamboo-home/xml-data/build-dir/RNDTEST-SOFTWARE-IBM17/junit4-ant/target/junit4-ant-2.4.2-SNAPSHOT.jar com/carrotsearch/ant/tasks/junit4/dependencies/com/google/common/collect/Iterators$2.class
23-Jan-2017 10:50:12 Class com.carrotsearch.ant.tasks.junit4.dependencies.com.google.common.collect.Iterators$2 loaded from ant loader (parentFirst)
23-Jan-2017 10:50:12 Class java.lang.Integer loaded from parent loader (parentFirst)
23-Jan-2017 10:50:12 Finding class com.carrotsearch.ant.tasks.junit4.dependencies.com.google.common.collect.NaturalOrdering
23-Jan-2017 10:50:12 Loaded from /mnt/work/bamboo-home/xml-data/build-dir/RNDTEST-SOFTWARE-IBM17/junit4-ant/target/junit4-ant-2.4.2-SNAPSHOT.jar com/carrotsearch/ant/tasks/junit4/dependencies/com/google/common/collect/NaturalOrdering.class
23-Jan-2017 10:50:12 Class com.carrotsearch.ant.tasks.junit4.dependencies.com.google.common.collect.NaturalOrdering loaded from ant loader (parentFirst)
23-Jan-2017 10:50:12 Finding class com.carrotsearch.ant.tasks.junit4.dependencies.com.google.common.collect.ComparatorOrdering
23-Jan-2017 10:50:12 Loaded from /mnt/work/bamboo-home/xml-data/build-dir/RNDTEST-SOFTWARE-IBM17/junit4-ant/target/junit4-ant-2.4.2-SNAPSHOT.jar com/carrotsearch/ant/tasks/junit4/dependencies/com/google/common/collect/ComparatorOrdering.class
23-Jan-2017 10:50:12 Class com.carrotsearch.ant.tasks.junit4.dependencies.com.google.common.collect.ComparatorOrdering loaded from ant loader (parentFirst)
23-Jan-2017 10:50:12 Finding class com.carrotsearch.ant.tasks.junit4.dependencies.com.google.common.collect.ReverseOrdering
23-Jan-2017 10:50:12 Loaded from /mnt/work/bamboo-home/xml-data/build-dir/RNDTEST-SOFTWARE-IBM17/junit4-ant/target/junit4-ant-2.4.2-SNAPSHOT.jar com/carrotsearch/ant/tasks/junit4/dependencies/com/google/common/collect/ReverseOrdering.class
23-Jan-2017 10:50:12 Class com.carrotsearch.ant.tasks.junit4.dependencies.com.google.common.collect.ReverseOrdering loaded from ant loader (parentFirst)
23-Jan-2017 10:50:12 Finding class com.carrotsearch.ant.tasks.junit4.dependencies.com.google.common.collect.ByFunctionOrdering
23-Jan-2017 10:50:12 Loaded from /mnt/work/bamboo-home/xml-data/build-dir/RNDTEST-SOFTWARE-IBM17/junit4-ant/target/junit4-ant-2.4.2-SNAPSHOT.jar com/carrotsearch/ant/tasks/junit4/dependencies/com/google/common/collect/ByFunctionOrdering.class
23-Jan-2017 10:50:12 Class com.carrotsearch.ant.tasks.junit4.dependencies.com.google.common.collect.ByFunctionOrdering loaded from ant loader (parentFirst)
23-Jan-2017 10:50:12 Finding class com.carrotsearch.ant.tasks.junit4.dependencies.com.google.common.collect.ReverseNaturalOrdering
23-Jan-2017 10:50:12 Loaded from /mnt/work/bamboo-home/xml-data/build-dir/RNDTEST-SOFTWARE-IBM17/junit4-ant/target/junit4-ant-2.4.2-SNAPSHOT.jar com/carrotsearch/ant/tasks/junit4/dependencies/com/google/common/collect/ReverseNaturalOrdering.class
23-Jan-2017 10:50:12 Class com.carrotsearch.ant.tasks.junit4.dependencies.com.google.common.collect.ReverseNaturalOrdering loaded from ant loader (parentFirst)
23-Jan-2017 10:50:12 Finding class com.carrotsearch.ant.tasks.junit4.dependencies.com.google.common.collect.Iterables
23-Jan-2017 10:50:12 Loaded from /mnt/work/bamboo-home/xml-data/build-dir/RNDTEST-SOFTWARE-IBM17/junit4-ant/target/junit4-ant-2.4.2-SNAPSHOT.jar com/carrotsearch/ant/tasks/junit4/dependencies/com/google/common/collect/Iterables.class
23-Jan-2017 10:50:12 Class com.carrotsearch.ant.tasks.junit4.dependencies.com.google.common.collect.Iterables loaded from ant loader (parentFirst)
23-Jan-2017 10:50:12 Class java.lang.Comparable loaded from parent loader (parentFirst)
23-Jan-2017 10:50:12 Finding class com.carrotsearch.ant.tasks.junit4.dependencies.com.google.common.collect.SingletonImmutableList
23-Jan-2017 10:50:12 Loaded from /mnt/work/bamboo-home/xml-data/build-dir/RNDTEST-SOFTWARE-IBM17/junit4-ant/target/junit4-ant-2.4.2-SNAPSHOT.jar com/carrotsearch/ant/tasks/junit4/dependencies/com/google/common/collect/SingletonImmutableList.class
23-Jan-2017 10:50:12 Class com.carrotsearch.ant.tasks.junit4.dependencies.com.google.common.collect.SingletonImmutableList loaded from ant loader (parentFirst)
23-Jan-2017 10:50:12 Finding class com.carrotsearch.ant.tasks.junit4.dependencies.com.google.common.collect.RegularImmutableList
23-Jan-2017 10:50:12 Loaded from /mnt/work/bamboo-home/xml-data/build-dir/RNDTEST-SOFTWARE-IBM17/junit4-ant/target/junit4-ant-2.4.2-SNAPSHOT.jar com/carrotsearch/ant/tasks/junit4/dependencies/com/google/common/collect/RegularImmutableList.class
23-Jan-2017 10:50:12 Class com.carrotsearch.ant.tasks.junit4.dependencies.com.google.common.collect.RegularImmutableList loaded from ant loader (parentFirst)
23-Jan-2017 10:50:12 Finding class com.carrotsearch.ant.tasks.junit4.dependencies.com.google.common.collect.ImmutableList$1
23-Jan-2017 10:50:12 Loaded from /mnt/work/bamboo-home/xml-data/build-dir/RNDTEST-SOFTWARE-IBM17/junit4-ant/target/junit4-ant-2.4.2-SNAPSHOT.jar com/carrotsearch/ant/tasks/junit4/dependencies/com/google/common/collect/ImmutableList$1.class
23-Jan-2017 10:50:12 Class com.carrotsearch.ant.tasks.junit4.dependencies.com.google.common.collect.ImmutableList$1 loaded from ant loader (parentFirst)
23-Jan-2017 10:50:12 Finding class com.carrotsearch.ant.tasks.junit4.dependencies.com.google.common.collect.ImmutableList$SubList
23-Jan-2017 10:50:12 Loaded from /mnt/work/bamboo-home/xml-data/build-dir/RNDTEST-SOFTWARE-IBM17/junit4-ant/target/junit4-ant-2.4.2-SNAPSHOT.jar com/carrotsearch/ant/tasks/junit4/dependencies/com/google/common/collect/ImmutableList$SubList.class
23-Jan-2017 10:50:12 Class com.carrotsearch.ant.tasks.junit4.dependencies.com.google.common.collect.ImmutableList$SubList loaded from ant loader (parentFirst)
23-Jan-2017 10:50:12 Finding class com.carrotsearch.ant.tasks.junit4.dependencies.com.google.common.collect.ImmutableList$ReverseImmutableList
23-Jan-2017 10:50:12 Loaded from /mnt/work/bamboo-home/xml-data/build-dir/RNDTEST-SOFTWARE-IBM17/junit4-ant/target/junit4-ant-2.4.2-SNAPSHOT.jar com/carrotsearch/ant/tasks/junit4/dependencies/com/google/common/collect/ImmutableList$ReverseImmutableList.class
23-Jan-2017 10:50:12 Class com.carrotsearch.ant.tasks.junit4.dependencies.com.google.common.collect.ImmutableList$ReverseImmutableList loaded from ant loader (parentFirst)
23-Jan-2017 10:50:12 Finding class com.carrotsearch.ant.tasks.junit4.dependencies.com.google.common.collect.ObjectArrays
23-Jan-2017 10:50:12 Loaded from /mnt/work/bamboo-home/xml-data/build-dir/RNDTEST-SOFTWARE-IBM17/junit4-ant/target/junit4-ant-2.4.2-SNAPSHOT.jar com/carrotsearch/ant/tasks/junit4/dependencies/com/google/common/collect/ObjectArrays.class
23-Jan-2017 10:50:12 Class com.carrotsearch.ant.tasks.junit4.dependencies.com.google.common.collect.ObjectArrays loaded from ant loader (parentFirst)
23-Jan-2017 10:50:12 Finding class com.carrotsearch.ant.tasks.junit4.dependencies.com.google.common.collect.Hashing
23-Jan-2017 10:50:12 Loaded from /mnt/work/bamboo-home/xml-data/build-dir/RNDTEST-SOFTWARE-IBM17/junit4-ant/target/junit4-ant-2.4.2-SNAPSHOT.jar com/carrotsearch/ant/tasks/junit4/dependencies/com/google/common/collect/Hashing.class
23-Jan-2017 10:50:12 Class com.carrotsearch.ant.tasks.junit4.dependencies.com.google.common.collect.Hashing loaded from ant loader (parentFirst)
23-Jan-2017 10:50:12 Finding class com.carrotsearch.ant.tasks.junit4.TestsSummary
23-Jan-2017 10:50:12 Loaded from /mnt/work/bamboo-home/xml-data/build-dir/RNDTEST-SOFTWARE-IBM17/junit4-ant/target/junit4-ant-2.4.2-SNAPSHOT.jar com/carrotsearch/ant/tasks/junit4/TestsSummary.class
23-Jan-2017 10:50:12 Class com.carrotsearch.ant.tasks.junit4.TestsSummary loaded from ant loader (parentFirst)
23-Jan-2017 10:50:12 Finding class com.carrotsearch.ant.tasks.junit4.dependencies.com.google.common.eventbus.Subscribe
23-Jan-2017 10:50:12 Loaded from /mnt/work/bamboo-home/xml-data/build-dir/RNDTEST-SOFTWARE-IBM17/junit4-ant/target/junit4-ant-2.4.2-SNAPSHOT.jar com/carrotsearch/ant/tasks/junit4/dependencies/com/google/common/eventbus/Subscribe.class
23-Jan-2017 10:50:12 Class java.lang.annotation.Annotation loaded from parent loader (parentFirst)
23-Jan-2017 10:50:12 Class com.carrotsearch.ant.tasks.junit4.dependencies.com.google.common.eventbus.Subscribe loaded from ant loader (parentFirst)
23-Jan-2017 10:50:12 Class java.lang.reflect.Method loaded from parent loader (parentFirst)
23-Jan-2017 10:50:12 Class java.lang.annotation.Retention loaded from parent loader (parentFirst)
23-Jan-2017 10:50:12 Class java.lang.annotation.RetentionPolicy loaded from parent loader (parentFirst)
23-Jan-2017 10:50:12 Class java.lang.annotation.Target loaded from parent loader (parentFirst)
23-Jan-2017 10:50:12 Class java.lang.reflect.Proxy loaded from parent loader (parentFirst)
23-Jan-2017 10:50:12 Class java.lang.reflect.UndeclaredThrowableException loaded from parent loader (parentFirst)
23-Jan-2017 10:50:12 Class java.lang.NoSuchMethodException loaded from parent loader (parentFirst)
23-Jan-2017 10:50:12 Class java.lang.NoSuchMethodError loaded from parent loader (parentFirst)
23-Jan-2017 10:50:12 Class java.lang.NoClassDefFoundError loaded from parent loader (parentFirst)
23-Jan-2017 10:50:12 Class java.lang.reflect.InvocationHandler loaded from parent loader (parentFirst)
23-Jan-2017 10:50:12 Finding class com.carrotsearch.ant.tasks.junit4.dependencies.com.google.common.eventbus.SubscriberRegistry$MethodIdentifier
23-Jan-2017 10:50:12 Loaded from /mnt/work/bamboo-home/xml-data/build-dir/RNDTEST-SOFTWARE-IBM17/junit4-ant/target/junit4-ant-2.4.2-SNAPSHOT.jar com/carrotsearch/ant/tasks/junit4/dependencies/com/google/common/eventbus/SubscriberRegistry$MethodIdentifier.class
23-Jan-2017 10:50:12 Class com.carrotsearch.ant.tasks.junit4.dependencies.com.google.common.eventbus.SubscriberRegistry$MethodIdentifier loaded from ant loader (parentFirst)
23-Jan-2017 10:50:12 Finding class com.carrotsearch.ant.tasks.junit4.dependencies.com.google.common.base.Objects
23-Jan-2017 10:50:12 Loaded from /mnt/work/bamboo-home/xml-data/build-dir/RNDTEST-SOFTWARE-IBM17/junit4-ant/target/junit4-ant-2.4.2-SNAPSHOT.jar com/carrotsearch/ant/tasks/junit4/dependencies/com/google/common/base/Objects.class
23-Jan-2017 10:50:12 Class com.carrotsearch.ant.tasks.junit4.dependencies.com.google.common.base.Objects loaded from ant loader (parentFirst)
23-Jan-2017 10:50:12 Finding class com.carrotsearch.ant.tasks.junit4.dependencies.com.google.common.util.concurrent.Uninterruptibles
23-Jan-2017 10:50:12 Loaded from /mnt/work/bamboo-home/xml-data/build-dir/RNDTEST-SOFTWARE-IBM17/junit4-ant/target/junit4-ant-2.4.2-SNAPSHOT.jar com/carrotsearch/ant/tasks/junit4/dependencies/com/google/common/util/concurrent/Uninterruptibles.class
23-Jan-2017 10:50:12 Class com.carrotsearch.ant.tasks.junit4.dependencies.com.google.common.util.concurrent.Uninterruptibles loaded from ant loader (parentFirst)
23-Jan-2017 10:50:12 Finding class com.carrotsearch.ant.tasks.junit4.dependencies.com.google.common.util.concurrent.AbstractFuture$SetFuture
23-Jan-2017 10:50:12 Loaded from /mnt/work/bamboo-home/xml-data/build-dir/RNDTEST-SOFTWARE-IBM17/junit4-ant/target/junit4-ant-2.4.2-SNAPSHOT.jar com/carrotsearch/ant/tasks/junit4/dependencies/com/google/common/util/concurrent/AbstractFuture$SetFuture.class
23-Jan-2017 10:50:12 Class com.carrotsearch.ant.tasks.junit4.dependencies.com.google.common.util.concurrent.AbstractFuture$SetFuture loaded from ant loader (parentFirst)
23-Jan-2017 10:50:12 Finding class com.carrotsearch.ant.tasks.junit4.dependencies.com.google.common.util.concurrent.AbstractFuture$Cancellation
23-Jan-2017 10:50:12 Loaded from /mnt/work/bamboo-home/xml-data/build-dir/RNDTEST-SOFTWARE-IBM17/junit4-ant/target/junit4-ant-2.4.2-SNAPSHOT.jar com/carrotsearch/ant/tasks/junit4/dependencies/com/google/common/util/concurrent/AbstractFuture$Cancellation.class
23-Jan-2017 10:50:12 Class com.carrotsearch.ant.tasks.junit4.dependencies.com.google.common.util.concurrent.AbstractFuture$Cancellation loaded from ant loader (parentFirst)
23-Jan-2017 10:50:12 Finding class com.carrotsearch.ant.tasks.junit4.dependencies.com.google.common.util.concurrent.AbstractFuture$Failure
23-Jan-2017 10:50:12 Loaded from /mnt/work/bamboo-home/xml-data/build-dir/RNDTEST-SOFTWARE-IBM17/junit4-ant/target/junit4-ant-2.4.2-SNAPSHOT.jar com/carrotsearch/ant/tasks/junit4/dependencies/com/google/common/util/concurrent/AbstractFuture$Failure.class
23-Jan-2017 10:50:12 Class com.carrotsearch.ant.tasks.junit4.dependencies.com.google.common.util.concurrent.AbstractFuture$Failure loaded from ant loader (parentFirst)
23-Jan-2017 10:50:12 Class java.util.concurrent.TimeUnit loaded from parent loader (parentFirst)
23-Jan-2017 10:50:12 Finding class com.carrotsearch.ant.tasks.junit4.dependencies.com.google.common.eventbus.Subscriber
23-Jan-2017 10:50:12 Loaded from /mnt/work/bamboo-home/xml-data/build-dir/RNDTEST-SOFTWARE-IBM17/junit4-ant/target/junit4-ant-2.4.2-SNAPSHOT.jar com/carrotsearch/ant/tasks/junit4/dependencies/com/google/common/eventbus/Subscriber.class
23-Jan-2017 10:50:12 Class com.carrotsearch.ant.tasks.junit4.dependencies.com.google.common.eventbus.Subscriber loaded from ant loader (parentFirst)
23-Jan-2017 10:50:12 Finding class com.carrotsearch.ant.tasks.junit4.dependencies.com.google.common.eventbus.Subscriber$SynchronizedSubscriber
23-Jan-2017 10:50:12 Loaded from /mnt/work/bamboo-home/xml-data/build-dir/RNDTEST-SOFTWARE-IBM17/junit4-ant/target/junit4-ant-2.4.2-SNAPSHOT.jar com/carrotsearch/ant/tasks/junit4/dependencies/com/google/common/eventbus/Subscriber$SynchronizedSubscriber.class
23-Jan-2017 10:50:12 Class com.carrotsearch.ant.tasks.junit4.dependencies.com.google.common.eventbus.Subscriber$SynchronizedSubscriber loaded from ant loader (parentFirst)
23-Jan-2017 10:50:12 Class java.lang.IllegalAccessException loaded from parent loader (parentFirst)
23-Jan-2017 10:50:12 Finding class com.carrotsearch.ant.tasks.junit4.dependencies.com.google.common.eventbus.AllowConcurrentEvents
23-Jan-2017 10:50:12 Loaded from /mnt/work/bamboo-home/xml-data/build-dir/RNDTEST-SOFTWARE-IBM17/junit4-ant/target/junit4-ant-2.4.2-SNAPSHOT.jar com/carrotsearch/ant/tasks/junit4/dependencies/com/google/common/eventbus/AllowConcurrentEvents.class
23-Jan-2017 10:50:12 Class com.carrotsearch.ant.tasks.junit4.dependencies.com.google.common.eventbus.AllowConcurrentEvents loaded from ant loader (parentFirst)
23-Jan-2017 10:50:12 Finding class com.carrotsearch.ant.tasks.junit4.dependencies.com.google.common.collect.AbstractMapBasedMultimap$AsMap$AsMapEntries
23-Jan-2017 10:50:12 Loaded from /mnt/work/bamboo-home/xml-data/build-dir/RNDTEST-SOFTWARE-IBM17/junit4-ant/target/junit4-ant-2.4.2-SNAPSHOT.jar com/carrotsearch/ant/tasks/junit4/dependencies/com/google/common/collect/AbstractMapBasedMultimap$AsMap$AsMapEntries.class
23-Jan-2017 10:50:12 Finding class com.carrotsearch.ant.tasks.junit4.dependencies.com.google.common.collect.Maps$EntrySet
23-Jan-2017 10:50:12 Loaded from /mnt/work/bamboo-home/xml-data/build-dir/RNDTEST-SOFTWARE-IBM17/junit4-ant/target/junit4-ant-2.4.2-SNAPSHOT.jar com/carrotsearch/ant/tasks/junit4/dependencies/com/google/common/collect/Maps$EntrySet.class
23-Jan-2017 10:50:12 Class com.carrotsearch.ant.tasks.junit4.dependencies.com.google.common.collect.Maps$EntrySet loaded from ant loader (parentFirst)
23-Jan-2017 10:50:12 Class com.carrotsearch.ant.tasks.junit4.dependencies.com.google.common.collect.AbstractMapBasedMultimap$AsMap$AsMapEntries loaded from ant loader (parentFirst)
23-Jan-2017 10:50:12 Finding class com.carrotsearch.ant.tasks.junit4.dependencies.com.google.common.collect.AbstractMapBasedMultimap$AsMap$AsMapIterator
23-Jan-2017 10:50:12 Loaded from /mnt/work/bamboo-home/xml-data/build-dir/RNDTEST-SOFTWARE-IBM17/junit4-ant/target/junit4-ant-2.4.2-SNAPSHOT.jar com/carrotsearch/ant/tasks/junit4/dependencies/com/google/common/collect/AbstractMapBasedMultimap$AsMap$AsMapIterator.class
23-Jan-2017 10:50:12 Class com.carrotsearch.ant.tasks.junit4.dependencies.com.google.common.collect.AbstractMapBasedMultimap$AsMap$AsMapIterator loaded from ant loader (parentFirst)
23-Jan-2017 10:50:12 Finding class com.carrotsearch.ant.tasks.junit4.dependencies.com.google.common.collect.AbstractMapBasedMultimap$WrappedSet
23-Jan-2017 10:50:12 Loaded from /mnt/work/bamboo-home/xml-data/build-dir/RNDTEST-SOFTWARE-IBM17/junit4-ant/target/junit4-ant-2.4.2-SNAPSHOT.jar com/carrotsearch/ant/tasks/junit4/dependencies/com/google/common/collect/AbstractMapBasedMultimap$WrappedSet.class
23-Jan-2017 10:50:12 Class com.carrotsearch.ant.tasks.junit4.dependencies.com.google.common.collect.AbstractMapBasedMultimap$WrappedSet loaded from ant loader (parentFirst)
23-Jan-2017 10:50:12 Class java.util.ConcurrentModificationException loaded from parent loader (parentFirst)
23-Jan-2017 10:50:12 Finding class com.carrotsearch.ant.tasks.junit4.dependencies.com.google.common.collect.ImmutableEntry
23-Jan-2017 10:50:12 Loaded from /mnt/work/bamboo-home/xml-data/build-dir/RNDTEST-SOFTWARE-IBM17/junit4-ant/target/junit4-ant-2.4.2-SNAPSHOT.jar com/carrotsearch/ant/tasks/junit4/dependencies/com/google/common/collect/ImmutableEntry.class
23-Jan-2017 10:50:12 Finding class com.carrotsearch.ant.tasks.junit4.dependencies.com.google.common.collect.AbstractMapEntry
23-Jan-2017 10:50:12 Loaded from /mnt/work/bamboo-home/xml-data/build-dir/RNDTEST-SOFTWARE-IBM17/junit4-ant/target/junit4-ant-2.4.2-SNAPSHOT.jar com/carrotsearch/ant/tasks/junit4/dependencies/com/google/common/collect/AbstractMapEntry.class
23-Jan-2017 10:50:12 Class com.carrotsearch.ant.tasks.junit4.dependencies.com.google.common.collect.AbstractMapEntry loaded from ant loader (parentFirst)
23-Jan-2017 10:50:12 Class com.carrotsearch.ant.tasks.junit4.dependencies.com.google.common.collect.ImmutableEntry loaded from ant loader (parentFirst)
23-Jan-2017 10:50:12 Class java.util.concurrent.CopyOnWriteArraySet loaded from parent loader (parentFirst)
23-Jan-2017 10:50:12 Finding class com.carrotsearch.ant.tasks.junit4.dependencies.com.google.common.collect.AbstractMapBasedMultimap$WrappedCollection$WrappedIterator
23-Jan-2017 10:50:12 Loaded from /mnt/work/bamboo-home/xml-data/build-dir/RNDTEST-SOFTWARE-IBM17/junit4-ant/target/junit4-ant-2.4.2-SNAPSHOT.jar com/carrotsearch/ant/tasks/junit4/dependencies/com/google/common/collect/AbstractMapBasedMultimap$WrappedCollection$WrappedIterator.class
23-Jan-2017 10:50:12 Class com.carrotsearch.ant.tasks.junit4.dependencies.com.google.common.collect.AbstractMapBasedMultimap$WrappedCollection$WrappedIterator loaded from ant loader (parentFirst)
23-Jan-2017 10:50:12 Class java.nio.charset.Charset loaded from parent loader (parentFirst)
23-Jan-2017 10:50:12 Class java.lang.Runtime loaded from parent loader (parentFirst)
23-Jan-2017 10:50:12 Finding class com.carrotsearch.ant.tasks.junit4.ForkedJvmInfo
23-Jan-2017 10:50:12 Loaded from /mnt/work/bamboo-home/xml-data/build-dir/RNDTEST-SOFTWARE-IBM17/junit4-ant/target/junit4-ant-2.4.2-SNAPSHOT.jar com/carrotsearch/ant/tasks/junit4/ForkedJvmInfo.class
23-Jan-2017 10:50:12 Class com.carrotsearch.ant.tasks.junit4.ForkedJvmInfo loaded from ant loader (parentFirst)
23-Jan-2017 10:50:12 Class java.util.ArrayDeque loaded from parent loader (parentFirst)
23-Jan-2017 10:50:12 Finding class com.carrotsearch.ant.tasks.junit4.JUnit4$3
23-Jan-2017 10:50:12 Loaded from /mnt/work/bamboo-home/xml-data/build-dir/RNDTEST-SOFTWARE-IBM17/junit4-ant/target/junit4-ant-2.4.2-SNAPSHOT.jar com/carrotsearch/ant/tasks/junit4/JUnit4$3.class
23-Jan-2017 10:50:12 Class com.carrotsearch.ant.tasks.junit4.JUnit4$3 loaded from ant loader (parentFirst)
23-Jan-2017 10:50:12 Finding class com.carrotsearch.ant.tasks.junit4.balancers.RoundRobinBalancer
23-Jan-2017 10:50:12 Loaded from /mnt/work/bamboo-home/xml-data/build-dir/RNDTEST-SOFTWARE-IBM17/junit4-ant/target/junit4-ant-2.4.2-SNAPSHOT.jar com/carrotsearch/ant/tasks/junit4/balancers/RoundRobinBalancer.class
23-Jan-2017 10:50:12 Class com.carrotsearch.ant.tasks.junit4.balancers.RoundRobinBalancer loaded from ant loader (parentFirst)
23-Jan-2017 10:50:12 Finding class com.carrotsearch.ant.tasks.junit4.SuiteBalancer$Assignment
23-Jan-2017 10:50:12 Loaded from /mnt/work/bamboo-home/xml-data/build-dir/RNDTEST-SOFTWARE-IBM17/junit4-ant/target/junit4-ant-2.4.2-SNAPSHOT.jar com/carrotsearch/ant/tasks/junit4/SuiteBalancer$Assignment.class
23-Jan-2017 10:50:12 Class com.carrotsearch.ant.tasks.junit4.SuiteBalancer$Assignment loaded from ant loader (parentFirst)
23-Jan-2017 10:50:12 Class java.util.Locale loaded from parent loader (parentFirst)
23-Jan-2017 10:50:12 [junit4.preconf] Assignment hint: J0  (cost     0) com.carrotsearch.ant.tasks.junit4.tests.TestSuccess (by RoundRobinBalancer)
23-Jan-2017 10:50:12 [junit4.preconf] Assignment hint: J1  (cost     0) com.carrotsearch.ant.tasks.junit4.tests.TestSuccess (by RoundRobinBalancer)
23-Jan-2017 10:50:12 [junit4.preconf] Assignment hint: J0  (cost     0) com.carrotsearch.ant.tasks.junit4.tests.TestSuccess (by RoundRobinBalancer)
23-Jan-2017 10:50:12 [junit4.preconf] Assignment hint: J1  (cost     0) com.carrotsearch.ant.tasks.junit4.tests.TestSuccess (by RoundRobinBalancer)
23-Jan-2017 10:50:12 [junit4.preconf] Assignment hint: J0  (cost     0) com.carrotsearch.ant.tasks.junit4.tests.TestSuccess (by RoundRobinBalancer)
23-Jan-2017 10:50:12 [junit4.preconf] Assignment hint: J1  (cost     0) com.carrotsearch.ant.tasks.junit4.tests.TestSuccess (by RoundRobinBalancer)
23-Jan-2017 10:50:12 [junit4.preconf] Assignment hint: J0  (cost     0) com.carrotsearch.ant.tasks.junit4.tests.TestSuccess (by RoundRobinBalancer)
23-Jan-2017 10:50:12 [junit4.preconf] Assignment hint: J1  (cost     0) com.carrotsearch.ant.tasks.junit4.tests.TestSuccess (by RoundRobinBalancer)
23-Jan-2017 10:50:12 [junit4.preconf] Assignment hint: J0  (cost     0) com.carrotsearch.ant.tasks.junit4.tests.TestSuccess (by RoundRobinBalancer)
23-Jan-2017 10:50:12 [junit4.preconf] Assignment hint: J1  (cost     0) com.carrotsearch.ant.tasks.junit4.tests.TestSuccess (by RoundRobinBalancer)
23-Jan-2017 10:50:12 Finding class com.carrotsearch.ant.tasks.junit4.balancers.SuiteHint
23-Jan-2017 10:50:12 Loaded from /mnt/work/bamboo-home/xml-data/build-dir/RNDTEST-SOFTWARE-IBM17/junit4-ant/target/junit4-ant-2.4.2-SNAPSHOT.jar com/carrotsearch/ant/tasks/junit4/balancers/SuiteHint.class
23-Jan-2017 10:50:12 Class com.carrotsearch.ant.tasks.junit4.balancers.SuiteHint loaded from ant loader (parentFirst)
23-Jan-2017 10:50:12 Finding class com.carrotsearch.ant.tasks.junit4.balancers.SuiteHint$1
23-Jan-2017 10:50:12 Loaded from /mnt/work/bamboo-home/xml-data/build-dir/RNDTEST-SOFTWARE-IBM17/junit4-ant/target/junit4-ant-2.4.2-SNAPSHOT.jar com/carrotsearch/ant/tasks/junit4/balancers/SuiteHint$1.class
23-Jan-2017 10:50:12 Class com.carrotsearch.ant.tasks.junit4.balancers.SuiteHint$1 loaded from ant loader (parentFirst)
23-Jan-2017 10:50:12 [junit4.preconf] Forked JVM J0 assignments (after shuffle):
23-Jan-2017 10:50:12 [junit4.preconf]   com.carrotsearch.ant.tasks.junit4.tests.TestSuccess
23-Jan-2017 10:50:12 [junit4.preconf]   com.carrotsearch.ant.tasks.junit4.tests.TestSuccess
23-Jan-2017 10:50:12 [junit4.preconf]   com.carrotsearch.ant.tasks.junit4.tests.TestSuccess
23-Jan-2017 10:50:12 [junit4.preconf]   com.carrotsearch.ant.tasks.junit4.tests.TestSuccess
23-Jan-2017 10:50:12 [junit4.preconf] Forked JVM J1 assignments (after shuffle):
23-Jan-2017 10:50:12 [junit4.preconf]   com.carrotsearch.ant.tasks.junit4.tests.TestSuccess
23-Jan-2017 10:50:12 [junit4.preconf]   com.carrotsearch.ant.tasks.junit4.tests.TestSuccess
23-Jan-2017 10:50:12 [junit4.preconf]   com.carrotsearch.ant.tasks.junit4.tests.TestSuccess
23-Jan-2017 10:50:12 [junit4.preconf]   com.carrotsearch.ant.tasks.junit4.tests.TestSuccess
23-Jan-2017 10:50:12 [junit4.preconf] Stealing queue:
23-Jan-2017 10:50:12 [junit4.preconf]   com.carrotsearch.ant.tasks.junit4.tests.TestSuccess 0
23-Jan-2017 10:50:12 [junit4.preconf]   com.carrotsearch.ant.tasks.junit4.tests.TestSuccess 0
23-Jan-2017 10:50:12 Finding class com.carrotsearch.ant.tasks.junit4.JUnit4$1
23-Jan-2017 10:50:12 Loaded from /mnt/work/bamboo-home/xml-data/build-dir/RNDTEST-SOFTWARE-IBM17/junit4-ant/target/junit4-ant-2.4.2-SNAPSHOT.jar com/carrotsearch/ant/tasks/junit4/JUnit4$1.class
23-Jan-2017 10:50:12 Class com.carrotsearch.ant.tasks.junit4.JUnit4$1 loaded from ant loader (parentFirst)
23-Jan-2017 10:50:12 Finding class com.carrotsearch.ant.tasks.junit4.SlaveIdle
23-Jan-2017 10:50:12 Loaded from /mnt/work/bamboo-home/xml-data/build-dir/RNDTEST-SOFTWARE-IBM17/junit4-ant/target/junit4-ant-2.4.2-SNAPSHOT.jar com/carrotsearch/ant/tasks/junit4/SlaveIdle.class
23-Jan-2017 10:50:12 Class com.carrotsearch.ant.tasks.junit4.SlaveIdle loaded from ant loader (parentFirst)
23-Jan-2017 10:50:12 Class org.apache.tools.ant.types.CommandlineJava$SysProperties loaded from parent loader (parentFirst)
23-Jan-2017 10:50:12 Class java.util.Vector loaded from parent loader (parentFirst)
23-Jan-2017 10:50:12 Finding class com.carrotsearch.ant.tasks.junit4.JUnit4$2
23-Jan-2017 10:50:12 Loaded from /mnt/work/bamboo-home/xml-data/build-dir/RNDTEST-SOFTWARE-IBM17/junit4-ant/target/junit4-ant-2.4.2-SNAPSHOT.jar com/carrotsearch/ant/tasks/junit4/JUnit4$2.class
23-Jan-2017 10:50:12 Class java.util.concurrent.Callable loaded from parent loader (parentFirst)
23-Jan-2017 10:50:12 Class com.carrotsearch.ant.tasks.junit4.JUnit4$2 loaded from ant loader (parentFirst)
23-Jan-2017 10:50:12 Class java.util.concurrent.Executors loaded from parent loader (parentFirst)
23-Jan-2017 10:50:12 Finding class com.carrotsearch.ant.tasks.junit4.dependencies.com.google.common.collect.ImmutableSortedSet
23-Jan-2017 10:50:12 Loaded from /mnt/work/bamboo-home/xml-data/build-dir/RNDTEST-SOFTWARE-IBM17/junit4-ant/target/junit4-ant-2.4.2-SNAPSHOT.jar com/carrotsearch/ant/tasks/junit4/dependencies/com/google/common/collect/ImmutableSortedSet.class
23-Jan-2017 10:50:12 Finding class com.carrotsearch.ant.tasks.junit4.dependencies.com.google.common.collect.ImmutableSortedSetFauxverideShim
23-Jan-2017 10:50:12 Loaded from /mnt/work/bamboo-home/xml-data/build-dir/RNDTEST-SOFTWARE-IBM17/junit4-ant/target/junit4-ant-2.4.2-SNAPSHOT.jar com/carrotsearch/ant/tasks/junit4/dependencies/com/google/common/collect/ImmutableSortedSetFauxverideShim.class
23-Jan-2017 10:50:12 Class com.carrotsearch.ant.tasks.junit4.dependencies.com.google.common.collect.ImmutableSortedSetFauxverideShim loaded from ant loader (parentFirst)
23-Jan-2017 10:50:12 Finding class com.carrotsearch.ant.tasks.junit4.dependencies.com.google.common.collect.SortedIterable
23-Jan-2017 10:50:12 Loaded from /mnt/work/bamboo-home/xml-data/build-dir/RNDTEST-SOFTWARE-IBM17/junit4-ant/target/junit4-ant-2.4.2-SNAPSHOT.jar com/carrotsearch/ant/tasks/junit4/dependencies/com/google/common/collect/SortedIterable.class
23-Jan-2017 10:50:12 Class com.carrotsearch.ant.tasks.junit4.dependencies.com.google.common.collect.SortedIterable loaded from ant loader (parentFirst)
23-Jan-2017 10:50:12 Class java.util.NavigableSet loaded from parent loader (parentFirst)
23-Jan-2017 10:50:12 Class com.carrotsearch.ant.tasks.junit4.dependencies.com.google.common.collect.ImmutableSortedSet loaded from ant loader (parentFirst)
23-Jan-2017 10:50:12 Finding class com.carrotsearch.ant.tasks.junit4.dependencies.com.google.common.collect.Lists
23-Jan-2017 10:50:12 Loaded from /mnt/work/bamboo-home/xml-data/build-dir/RNDTEST-SOFTWARE-IBM17/junit4-ant/target/junit4-ant-2.4.2-SNAPSHOT.jar com/carrotsearch/ant/tasks/junit4/dependencies/com/google/common/collect/Lists.class
23-Jan-2017 10:50:12 Class com.carrotsearch.ant.tasks.junit4.dependencies.com.google.common.collect.Lists loaded from ant loader (parentFirst)
23-Jan-2017 10:50:12 Finding class com.carrotsearch.ant.tasks.junit4.dependencies.com.google.common.collect.Iterators$5
23-Jan-2017 10:50:12 Loaded from /mnt/work/bamboo-home/xml-data/build-dir/RNDTEST-SOFTWARE-IBM17/junit4-ant/target/junit4-ant-2.4.2-SNAPSHOT.jar com/carrotsearch/ant/tasks/junit4/dependencies/com/google/common/collect/Iterators$5.class
23-Jan-2017 10:50:12 Class com.carrotsearch.ant.tasks.junit4.dependencies.com.google.common.collect.Iterators$5 loaded from ant loader (parentFirst)
23-Jan-2017 10:50:12 Finding class com.carrotsearch.ant.tasks.junit4.dependencies.com.google.common.collect.Queues
23-Jan-2017 10:50:12 Loaded from /mnt/work/bamboo-home/xml-data/build-dir/RNDTEST-SOFTWARE-IBM17/junit4-ant/target/junit4-ant-2.4.2-SNAPSHOT.jar com/carrotsearch/ant/tasks/junit4/dependencies/com/google/common/collect/Queues.class
23-Jan-2017 10:50:12 Class com.carrotsearch.ant.tasks.junit4.dependencies.com.google.common.collect.Queues loaded from ant loader (parentFirst)
23-Jan-2017 10:50:12 Finding class com.carrotsearch.ant.tasks.junit4.dependencies.com.google.common.eventbus.Dispatcher$PerThreadQueuedDispatcher$Event
23-Jan-2017 10:50:12 Loaded from /mnt/work/bamboo-home/xml-data/build-dir/RNDTEST-SOFTWARE-IBM17/junit4-ant/target/junit4-ant-2.4.2-SNAPSHOT.jar com/carrotsearch/ant/tasks/junit4/dependencies/com/google/common/eventbus/Dispatcher$PerThreadQueuedDispatcher$Event.class
23-Jan-2017 10:50:12 Class com.carrotsearch.ant.tasks.junit4.dependencies.com.google.common.eventbus.Dispatcher$PerThreadQueuedDispatcher$Event loaded from ant loader (parentFirst)
23-Jan-2017 10:50:12 Finding class com.carrotsearch.ant.tasks.junit4.dependencies.com.google.common.eventbus.Subscriber$1
23-Jan-2017 10:50:12 Loaded from /mnt/work/bamboo-home/xml-data/build-dir/RNDTEST-SOFTWARE-IBM17/junit4-ant/target/junit4-ant-2.4.2-SNAPSHOT.jar com/carrotsearch/ant/tasks/junit4/dependencies/com/google/common/eventbus/Subscriber$1.class
23-Jan-2017 10:50:12 Class com.carrotsearch.ant.tasks.junit4.dependencies.com.google.common.eventbus.Subscriber$1 loaded from ant loader (parentFirst)
23-Jan-2017 10:50:12 Finding class com.carrotsearch.ant.tasks.junit4.Pluralize
23-Jan-2017 10:50:12 Loaded from /mnt/work/bamboo-home/xml-data/build-dir/RNDTEST-SOFTWARE-IBM17/junit4-ant/target/junit4-ant-2.4.2-SNAPSHOT.jar com/carrotsearch/ant/tasks/junit4/Pluralize.class
23-Jan-2017 10:50:12 Class com.carrotsearch.ant.tasks.junit4.Pluralize loaded from ant loader (parentFirst)
23-Jan-2017 10:50:12 Executing 10 suites with 2 JVMs.
23-Jan-2017 10:50:12
23-Jan-2017 10:50:12 Executing 10 suites with 2 JVMs.
23-Jan-2017 10:50:12
23-Jan-2017 10:50:12 Class java.util.concurrent.ExecutorService loaded from parent loader (parentFirst)
23-Jan-2017 10:50:12 Class java.text.SimpleDateFormat loaded from parent loader (parentFirst)
23-Jan-2017 10:50:12 Class java.util.Date loaded from parent loader (parentFirst)
23-Jan-2017 10:50:12 Class java.nio.file.attribute.FileAttribute loaded from parent loader (parentFirst)
23-Jan-2017 10:50:12 [junit4.preconf] Test class names:
23-Jan-2017 10:50:12 [junit4.preconf] com.carrotsearch.ant.tasks.junit4.tests.TestSuccess
23-Jan-2017 10:50:12 [junit4.preconf] com.carrotsearch.ant.tasks.junit4.tests.TestSuccess
23-Jan-2017 10:50:12 [junit4.preconf] com.carrotsearch.ant.tasks.junit4.tests.TestSuccess
23-Jan-2017 10:50:12 [junit4.preconf] com.carrotsearch.ant.tasks.junit4.tests.TestSuccess
23-Jan-2017 10:50:12 [junit4.preconf] Test class names:
23-Jan-2017 10:50:12 [junit4.preconf] com.carrotsearch.ant.tasks.junit4.tests.TestSuccess
23-Jan-2017 10:50:12 [junit4.preconf] com.carrotsearch.ant.tasks.junit4.tests.TestSuccess
23-Jan-2017 10:50:12 [junit4.preconf] com.carrotsearch.ant.tasks.junit4.tests.TestSuccess
23-Jan-2017 10:50:12 [junit4.preconf] com.carrotsearch.ant.tasks.junit4.tests.TestSuccess
23-Jan-2017 10:50:12 Class java.nio.charset.StandardCharsets loaded from parent loader (parentFirst)
23-Jan-2017 10:50:12 Class java.nio.file.OpenOption loaded from parent loader (parentFirst)
23-Jan-2017 10:50:12 Finding class com.carrotsearch.ant.tasks.junit4.slave.SlaveMain
23-Jan-2017 10:50:12 Loaded from /mnt/work/bamboo-home/xml-data/build-dir/RNDTEST-SOFTWARE-IBM17/junit4-ant/target/junit4-ant-2.4.2-SNAPSHOT.jar com/carrotsearch/ant/tasks/junit4/slave/SlaveMain.class
23-Jan-2017 10:50:12 Class com.carrotsearch.ant.tasks.junit4.slave.SlaveMain loaded from ant loader (parentFirst)
23-Jan-2017 10:50:12 Finding class com.carrotsearch.ant.tasks.junit4.dependencies.com.carrotsearch.randomizedtesting.MethodGlobFilter
23-Jan-2017 10:50:12 Loaded from /mnt/work/bamboo-home/xml-data/build-dir/RNDTEST-SOFTWARE-IBM17/junit4-ant/target/junit4-ant-2.4.2-SNAPSHOT.jar com/carrotsearch/ant/tasks/junit4/dependencies/com/carrotsearch/randomizedtesting/MethodGlobFilter.class
23-Jan-2017 10:50:12 Finding class com.carrotsearch.ant.tasks.junit4.dependencies.com.carrotsearch.randomizedtesting.GlobFilter
23-Jan-2017 10:50:12 Loaded from /mnt/work/bamboo-home/xml-data/build-dir/RNDTEST-SOFTWARE-IBM17/junit4-ant/target/junit4-ant-2.4.2-SNAPSHOT.jar com/carrotsearch/ant/tasks/junit4/dependencies/com/carrotsearch/randomizedtesting/GlobFilter.class
23-Jan-2017 10:50:12 Class org.junit.runner.manipulation.Filter loaded from parent loader (parentFirst)
23-Jan-2017 10:50:12 Class com.carrotsearch.ant.tasks.junit4.dependencies.com.carrotsearch.randomizedtesting.GlobFilter loaded from ant loader (parentFirst)
23-Jan-2017 10:50:12 Class com.carrotsearch.ant.tasks.junit4.dependencies.com.carrotsearch.randomizedtesting.MethodGlobFilter loaded from ant loader (parentFirst)
23-Jan-2017 10:50:12 Finding class com.carrotsearch.ant.tasks.junit4.dependencies.com.carrotsearch.randomizedtesting.TeeOutputStream
23-Jan-2017 10:50:12 Loaded from /mnt/work/bamboo-home/xml-data/build-dir/RNDTEST-SOFTWARE-IBM17/junit4-ant/target/junit4-ant-2.4.2-SNAPSHOT.jar com/carrotsearch/ant/tasks/junit4/dependencies/com/carrotsearch/randomizedtesting/TeeOutputStream.class
23-Jan-2017 10:50:12 Class com.carrotsearch.ant.tasks.junit4.dependencies.com.carrotsearch.randomizedtesting.TeeOutputStream loaded from ant loader (parentFirst)
23-Jan-2017 10:50:12 Class org.apache.tools.ant.util.LoaderUtils loaded from parent loader (parentFirst)
23-Jan-2017 10:50:12 Resource com/carrotsearch/ant/tasks/junit4/slave/SlaveMain.class loaded from ant loader
23-Jan-2017 10:50:12 Resource com/carrotsearch/ant/tasks/junit4/slave/SlaveMain.class loaded from ant loader
23-Jan-2017 10:50:12 Resource com/carrotsearch/ant/tasks/junit4/dependencies/com/google/common/base/Strings.class loaded from ant loader
23-Jan-2017 10:50:12 Resource com/carrotsearch/ant/tasks/junit4/dependencies/com/google/common/base/Strings.class loaded from ant loader
23-Jan-2017 10:50:12 Resource com/carrotsearch/ant/tasks/junit4/dependencies/com/carrotsearch/randomizedtesting/MethodGlobFilter.class loaded from ant loader
23-Jan-2017 10:50:12 Resource com/carrotsearch/ant/tasks/junit4/dependencies/com/carrotsearch/randomizedtesting/MethodGlobFilter.class loaded from ant loader
23-Jan-2017 10:50:12 Resource com/carrotsearch/ant/tasks/junit4/dependencies/com/carrotsearch/randomizedtesting/TeeOutputStream.class loaded from ant loader
23-Jan-2017 10:50:12 Resource com/carrotsearch/ant/tasks/junit4/dependencies/com/carrotsearch/randomizedtesting/TeeOutputStream.class loaded from ant loader
23-Jan-2017 10:50:12 Finding class com.carrotsearch.ant.tasks.junit4.slave.SlaveMainSafe
23-Jan-2017 10:50:12 Loaded from /mnt/work/bamboo-home/xml-data/build-dir/RNDTEST-SOFTWARE-IBM17/junit4-ant/target/junit4-ant-2.4.2-SNAPSHOT.jar com/carrotsearch/ant/tasks/junit4/slave/SlaveMainSafe.class
23-Jan-2017 10:50:12 Class com.carrotsearch.ant.tasks.junit4.slave.SlaveMainSafe loaded from ant loader (parentFirst)
23-Jan-2017 10:50:12 Class java.nio.file.Path loaded from parent loader (parentFirst)
23-Jan-2017 10:50:12 Class java.io.RandomAccessFile loaded from parent loader (parentFirst)
23-Jan-2017 10:50:12 Finding class com.carrotsearch.ant.tasks.junit4.DiagnosticsListener
23-Jan-2017 10:50:12 Loaded from /mnt/work/bamboo-home/xml-data/build-dir/RNDTEST-SOFTWARE-IBM17/junit4-ant/target/junit4-ant-2.4.2-SNAPSHOT.jar com/carrotsearch/ant/tasks/junit4/DiagnosticsListener.class
23-Jan-2017 10:50:12 Class com.carrotsearch.ant.tasks.junit4.DiagnosticsListener loaded from ant loader (parentFirst)
23-Jan-2017 10:50:12 Finding class com.carrotsearch.ant.tasks.junit4.events.IEvent
23-Jan-2017 10:50:12 Loaded from /mnt/work/bamboo-home/xml-data/build-dir/RNDTEST-SOFTWARE-IBM17/junit4-ant/target/junit4-ant-2.4.2-SNAPSHOT.jar com/carrotsearch/ant/tasks/junit4/events/IEvent.class
23-Jan-2017 10:50:12 Class com.carrotsearch.ant.tasks.junit4.events.IEvent loaded from ant loader (parentFirst)
23-Jan-2017 10:50:12 Finding class com.carrotsearch.ant.tasks.junit4.events.BootstrapEvent
23-Jan-2017 10:50:12 Loaded from /mnt/work/bamboo-home/xml-data/build-dir/RNDTEST-SOFTWARE-IBM17/junit4-ant/target/junit4-ant-2.4.2-SNAPSHOT.jar com/carrotsearch/ant/tasks/junit4/events/BootstrapEvent.class
23-Jan-2017 10:50:12 Finding class com.carrotsearch.ant.tasks.junit4.events.AbstractEvent
23-Jan-2017 10:50:12 Loaded from /mnt/work/bamboo-home/xml-data/build-dir/RNDTEST-SOFTWARE-IBM17/junit4-ant/target/junit4-ant-2.4.2-SNAPSHOT.jar com/carrotsearch/ant/tasks/junit4/events/AbstractEvent.class
23-Jan-2017 10:50:12 Finding class com.carrotsearch.ant.tasks.junit4.events.RemoteEvent
23-Jan-2017 10:50:12 Loaded from /mnt/work/bamboo-home/xml-data/build-dir/RNDTEST-SOFTWARE-IBM17/junit4-ant/target/junit4-ant-2.4.2-SNAPSHOT.jar com/carrotsearch/ant/tasks/junit4/events/RemoteEvent.class
23-Jan-2017 10:50:12 Class com.carrotsearch.ant.tasks.junit4.events.RemoteEvent loaded from ant loader (parentFirst)
23-Jan-2017 10:50:12 Class com.carrotsearch.ant.tasks.junit4.events.AbstractEvent loaded from ant loader (parentFirst)
23-Jan-2017 10:50:12 Class com.carrotsearch.ant.tasks.junit4.events.BootstrapEvent loaded from ant loader (parentFirst)
23-Jan-2017 10:50:12 Finding class com.carrotsearch.ant.tasks.junit4.events.QuitEvent
23-Jan-2017 10:50:12 Loaded from /mnt/work/bamboo-home/xml-data/build-dir/RNDTEST-SOFTWARE-IBM17/junit4-ant/target/junit4-ant-2.4.2-SNAPSHOT.jar com/carrotsearch/ant/tasks/junit4/events/QuitEvent.class
23-Jan-2017 10:50:12 Class com.carrotsearch.ant.tasks.junit4.events.QuitEvent loaded from ant loader (parentFirst)
23-Jan-2017 10:50:12 Finding class com.carrotsearch.ant.tasks.junit4.events.aggregated.AggregatingListener
23-Jan-2017 10:50:12 Loaded from /mnt/work/bamboo-home/xml-data/build-dir/RNDTEST-SOFTWARE-IBM17/junit4-ant/target/junit4-ant-2.4.2-SNAPSHOT.jar com/carrotsearch/ant/tasks/junit4/events/aggregated/AggregatingListener.class
23-Jan-2017 10:50:12 Class com.carrotsearch.ant.tasks.junit4.events.aggregated.AggregatingListener loaded from ant loader (parentFirst)
23-Jan-2017 10:50:12 Finding class com.carrotsearch.ant.tasks.junit4.events.LowLevelHeartBeatEvent
23-Jan-2017 10:50:12 Loaded from /mnt/work/bamboo-home/xml-data/build-dir/RNDTEST-SOFTWARE-IBM17/junit4-ant/target/junit4-ant-2.4.2-SNAPSHOT.jar com/carrotsearch/ant/tasks/junit4/events/LowLevelHeartBeatEvent.class
23-Jan-2017 10:50:12 Class com.carrotsearch.ant.tasks.junit4.events.LowLevelHeartBeatEvent loaded from ant loader (parentFirst)
23-Jan-2017 10:50:12 Finding class com.carrotsearch.ant.tasks.junit4.events.SuiteStartedEvent
23-Jan-2017 10:50:12 Loaded from /mnt/work/bamboo-home/xml-data/build-dir/RNDTEST-SOFTWARE-IBM17/junit4-ant/target/junit4-ant-2.4.2-SNAPSHOT.jar com/carrotsearch/ant/tasks/junit4/events/SuiteStartedEvent.class
23-Jan-2017 10:50:12 Finding class com.carrotsearch.ant.tasks.junit4.events.AbstractEventWithDescription
23-Jan-2017 10:50:12 Loaded from /mnt/work/bamboo-home/xml-data/build-dir/RNDTEST-SOFTWARE-IBM17/junit4-ant/target/junit4-ant-2.4.2-SNAPSHOT.jar com/carrotsearch/ant/tasks/junit4/events/AbstractEventWithDescription.class
23-Jan-2017 10:50:12 Finding class com.carrotsearch.ant.tasks.junit4.events.IDescribable
23-Jan-2017 10:50:12 Loaded from /mnt/work/bamboo-home/xml-data/build-dir/RNDTEST-SOFTWARE-IBM17/junit4-ant/target/junit4-ant-2.4.2-SNAPSHOT.jar com/carrotsearch/ant/tasks/junit4/events/IDescribable.class
23-Jan-2017 10:50:12 Class com.carrotsearch.ant.tasks.junit4.events.IDescribable loaded from ant loader (parentFirst)
23-Jan-2017 10:50:12 Class com.carrotsearch.ant.tasks.junit4.events.AbstractEventWithDescription loaded from ant loader (parentFirst)
23-Jan-2017 10:50:12 Class com.carrotsearch.ant.tasks.junit4.events.SuiteStartedEvent loaded from ant loader (parentFirst)
23-Jan-2017 10:50:12 Finding class com.carrotsearch.ant.tasks.junit4.events.TestStartedEvent
23-Jan-2017 10:50:12 Loaded from /mnt/work/bamboo-home/xml-data/build-dir/RNDTEST-SOFTWARE-IBM17/junit4-ant/target/junit4-ant-2.4.2-SNAPSHOT.jar com/carrotsearch/ant/tasks/junit4/events/TestStartedEvent.class
23-Jan-2017 10:50:12 Class com.carrotsearch.ant.tasks.junit4.events.TestStartedEvent loaded from ant loader (parentFirst)
23-Jan-2017 10:50:12 Finding class com.carrotsearch.ant.tasks.junit4.events.TestIgnoredEvent
23-Jan-2017 10:50:12 Loaded from /mnt/work/bamboo-home/xml-data/build-dir/RNDTEST-SOFTWARE-IBM17/junit4-ant/target/junit4-ant-2.4.2-SNAPSHOT.jar com/carrotsearch/ant/tasks/junit4/events/TestIgnoredEvent.class
23-Jan-2017 10:50:12 Class com.carrotsearch.ant.tasks.junit4.events.TestIgnoredEvent loaded from ant loader (parentFirst)
23-Jan-2017 10:50:12 Finding class com.carrotsearch.ant.tasks.junit4.events.TestIgnoredAssumptionEvent
23-Jan-2017 10:50:12 Loaded from /mnt/work/bamboo-home/xml-data/build-dir/RNDTEST-SOFTWARE-IBM17/junit4-ant/target/junit4-ant-2.4.2-SNAPSHOT.jar com/carrotsearch/ant/tasks/junit4/events/TestIgnoredAssumptionEvent.class
23-Jan-2017 10:50:12 Finding class com.carrotsearch.ant.tasks.junit4.events.FailureEvent
23-Jan-2017 10:50:12 Loaded from /mnt/work/bamboo-home/xml-data/build-dir/RNDTEST-SOFTWARE-IBM17/junit4-ant/target/junit4-ant-2.4.2-SNAPSHOT.jar com/carrotsearch/ant/tasks/junit4/events/FailureEvent.class
23-Jan-2017 10:50:12 Class com.carrotsearch.ant.tasks.junit4.events.FailureEvent loaded from ant loader (parentFirst)
23-Jan-2017 10:50:12 Class com.carrotsearch.ant.tasks.junit4.events.TestIgnoredAssumptionEvent loaded from ant loader (parentFirst)
23-Jan-2017 10:50:12 Finding class com.carrotsearch.ant.tasks.junit4.events.TestFailureEvent
23-Jan-2017 10:50:12 Loaded from /mnt/work/bamboo-home/xml-data/build-dir/RNDTEST-SOFTWARE-IBM17/junit4-ant/target/junit4-ant-2.4.2-SNAPSHOT.jar com/carrotsearch/ant/tasks/junit4/events/TestFailureEvent.class
23-Jan-2017 10:50:12 Class com.carrotsearch.ant.tasks.junit4.events.TestFailureEvent loaded from ant loader (parentFirst)
23-Jan-2017 10:50:12 Finding class com.carrotsearch.ant.tasks.junit4.events.TestFinishedEvent
23-Jan-2017 10:50:12 Loaded from /mnt/work/bamboo-home/xml-data/build-dir/RNDTEST-SOFTWARE-IBM17/junit4-ant/target/junit4-ant-2.4.2-SNAPSHOT.jar com/carrotsearch/ant/tasks/junit4/events/TestFinishedEvent.class
23-Jan-2017 10:50:12 Class com.carrotsearch.ant.tasks.junit4.events.TestFinishedEvent loaded from ant loader (parentFirst)
23-Jan-2017 10:50:12 Finding class com.carrotsearch.ant.tasks.junit4.events.SuiteCompletedEvent
23-Jan-2017 10:50:12 Loaded from /mnt/work/bamboo-home/xml-data/build-dir/RNDTEST-SOFTWARE-IBM17/junit4-ant/target/junit4-ant-2.4.2-SNAPSHOT.jar com/carrotsearch/ant/tasks/junit4/events/SuiteCompletedEvent.class
23-Jan-2017 10:50:12 Class com.carrotsearch.ant.tasks.junit4.events.SuiteCompletedEvent loaded from ant loader (parentFirst)
23-Jan-2017 10:50:12 Finding class com.carrotsearch.ant.tasks.junit4.events.SuiteFailureEvent
23-Jan-2017 10:50:12 Loaded from /mnt/work/bamboo-home/xml-data/build-dir/RNDTEST-SOFTWARE-IBM17/junit4-ant/target/junit4-ant-2.4.2-SNAPSHOT.jar com/carrotsearch/ant/tasks/junit4/events/SuiteFailureEvent.class
23-Jan-2017 10:50:12 Class com.carrotsearch.ant.tasks.junit4.events.SuiteFailureEvent loaded from ant loader (parentFirst)
23-Jan-2017 10:50:12 Class sun.reflect.ConstructorAccessorImpl loaded from parent loader (parentFirst)
23-Jan-2017 10:50:12 Class java.util.concurrent.atomic.AtomicReference loaded from parent loader (parentFirst)
23-Jan-2017 10:50:12 Class java.util.concurrent.atomic.AtomicBoolean loaded from parent loader (parentFirst)
23-Jan-2017 10:50:12 Class java.io.PrintWriter loaded from parent loader (parentFirst)
23-Jan-2017 10:50:12 Finding class com.carrotsearch.ant.tasks.junit4.JUnit4$4
23-Jan-2017 10:50:12 Loaded from /mnt/work/bamboo-home/xml-data/build-dir/RNDTEST-SOFTWARE-IBM17/junit4-ant/target/junit4-ant-2.4.2-SNAPSHOT.jar com/carrotsearch/ant/tasks/junit4/JUnit4$4.class
23-Jan-2017 10:50:12 Class com.carrotsearch.ant.tasks.junit4.JUnit4$4 loaded from ant loader (parentFirst)
23-Jan-2017 10:50:12 Finding class com.carrotsearch.ant.tasks.junit4.dependencies.com.google.common.io.Closer
23-Jan-2017 10:50:12 Loaded from /mnt/work/bamboo-home/xml-data/build-dir/RNDTEST-SOFTWARE-IBM17/junit4-ant/target/junit4-ant-2.4.2-SNAPSHOT.jar com/carrotsearch/ant/tasks/junit4/dependencies/com/google/common/io/Closer.class
23-Jan-2017 10:50:12 Class com.carrotsearch.ant.tasks.junit4.dependencies.com.google.common.io.Closer loaded from ant loader (parentFirst)
23-Jan-2017 10:50:12 Finding class com.carrotsearch.ant.tasks.junit4.dependencies.com.google.common.io.Closer$Suppressor
23-Jan-2017 10:50:12 Loaded from /mnt/work/bamboo-home/xml-data/build-dir/RNDTEST-SOFTWARE-IBM17/junit4-ant/target/junit4-ant-2.4.2-SNAPSHOT.jar com/carrotsearch/ant/tasks/junit4/dependencies/com/google/common/io/Closer$Suppressor.class
23-Jan-2017 10:50:12 Class com.carrotsearch.ant.tasks.junit4.dependencies.com.google.common.io.Closer$Suppressor loaded from ant loader (parentFirst)
23-Jan-2017 10:50:12 Finding class com.carrotsearch.ant.tasks.junit4.dependencies.com.google.common.io.Closer$SuppressingSuppressor
23-Jan-2017 10:50:12 Loaded from /mnt/work/bamboo-home/xml-data/build-dir/RNDTEST-SOFTWARE-IBM17/junit4-ant/target/junit4-ant-2.4.2-SNAPSHOT.jar com/carrotsearch/ant/tasks/junit4/dependencies/com/google/common/io/Closer$SuppressingSuppressor.class
23-Jan-2017 10:50:12 Class com.carrotsearch.ant.tasks.junit4.dependencies.com.google.common.io.Closer$SuppressingSuppressor loaded from ant loader (parentFirst)
23-Jan-2017 10:50:12 Finding class com.carrotsearch.ant.tasks.junit4.LocalSlaveStreamHandler
23-Jan-2017 10:50:12 Loaded from /mnt/work/bamboo-home/xml-data/build-dir/RNDTEST-SOFTWARE-IBM17/junit4-ant/target/junit4-ant-2.4.2-SNAPSHOT.jar com/carrotsearch/ant/tasks/junit4/LocalSlaveStreamHandler.class
23-Jan-2017 10:50:12 Class com.carrotsearch.ant.tasks.junit4.LocalSlaveStreamHandler loaded from ant loader (parentFirst)
23-Jan-2017 10:50:12 Finding class com.carrotsearch.ant.tasks.junit4.LocalSlaveStreamHandler$1
23-Jan-2017 10:50:12 Loaded from /mnt/work/bamboo-home/xml-data/build-dir/RNDTEST-SOFTWARE-IBM17/junit4-ant/target/junit4-ant-2.4.2-SNAPSHOT.jar com/carrotsearch/ant/tasks/junit4/LocalSlaveStreamHandler$1.class
23-Jan-2017 10:50:12 Class com.carrotsearch.ant.tasks.junit4.LocalSlaveStreamHandler$1 loaded from ant loader (parentFirst)
23-Jan-2017 10:50:12 Finding class com.carrotsearch.ant.tasks.junit4.LocalSlaveStreamHandler$3
23-Jan-2017 10:50:12 Loaded from /mnt/work/bamboo-home/xml-data/build-dir/RNDTEST-SOFTWARE-IBM17/junit4-ant/target/junit4-ant-2.4.2-SNAPSHOT.jar com/carrotsearch/ant/tasks/junit4/LocalSlaveStreamHandler$3.class
23-Jan-2017 10:50:12 Class com.carrotsearch.ant.tasks.junit4.LocalSlaveStreamHandler$3 loaded from ant loader (parentFirst)
23-Jan-2017 10:50:12 Class java.lang.Thread$UncaughtExceptionHandler loaded from parent loader (parentFirst)
23-Jan-2017 10:50:12 Class java.nio.file.DirectoryStream loaded from parent loader (parentFirst)
23-Jan-2017 10:50:12 Finding class com.carrotsearch.ant.tasks.junit4.JUnit4$7
23-Jan-2017 10:50:12 Loaded from /mnt/work/bamboo-home/xml-data/build-dir/RNDTEST-SOFTWARE-IBM17/junit4-ant/target/junit4-ant-2.4.2-SNAPSHOT.jar com/carrotsearch/ant/tasks/junit4/JUnit4$7.class
23-Jan-2017 10:50:12 Class com.carrotsearch.ant.tasks.junit4.JUnit4$7 loaded from ant loader (parentFirst)
23-Jan-2017 10:50:12 Finding class com.carrotsearch.ant.tasks.junit4.dependencies.com.google.common.base.Throwables
23-Jan-2017 10:50:12 Loaded from /mnt/work/bamboo-home/xml-data/build-dir/RNDTEST-SOFTWARE-IBM17/junit4-ant/target/junit4-ant-2.4.2-SNAPSHOT.jar com/carrotsearch/ant/tasks/junit4/dependencies/com/google/common/base/Throwables.class
23-Jan-2017 10:50:12 Class com.carrotsearch.ant.tasks.junit4.dependencies.com.google.common.base.Throwables loaded from ant loader (parentFirst)
23-Jan-2017 10:50:12 Class java.lang.ThreadDeath loaded from parent loader (parentFirst)
23-Jan-2017 10:50:12 Finding class com.carrotsearch.ant.tasks.junit4.dependencies.com.google.common.io.Files
23-Jan-2017 10:50:12 Loaded from /mnt/work/bamboo-home/xml-data/build-dir/RNDTEST-SOFTWARE-IBM17/junit4-ant/target/junit4-ant-2.4.2-SNAPSHOT.jar com/carrotsearch/ant/tasks/junit4/dependencies/com/google/common/io/Files.class
23-Jan-2017 10:50:12 Class com.carrotsearch.ant.tasks.junit4.dependencies.com.google.common.io.Files loaded from ant loader (parentFirst)
23-Jan-2017 10:50:12 Finding class com.carrotsearch.ant.tasks.junit4.dependencies.com.google.common.io.ByteSource
23-Jan-2017 10:50:12 Loaded from /mnt/work/bamboo-home/xml-data/build-dir/RNDTEST-SOFTWARE-IBM17/junit4-ant/target/junit4-ant-2.4.2-SNAPSHOT.jar com/carrotsearch/ant/tasks/junit4/dependencies/com/google/common/io/ByteSource.class
23-Jan-2017 10:50:12 Class com.carrotsearch.ant.tasks.junit4.dependencies.com.google.common.io.ByteSource loaded from ant loader (parentFirst)
23-Jan-2017 10:50:12 Finding class com.carrotsearch.ant.tasks.junit4.dependencies.com.google.common.io.Files$FileByteSource
23-Jan-2017 10:50:12 Loaded from /mnt/work/bamboo-home/xml-data/build-dir/RNDTEST-SOFTWARE-IBM17/junit4-ant/target/junit4-ant-2.4.2-SNAPSHOT.jar com/carrotsearch/ant/tasks/junit4/dependencies/com/google/common/io/Files$FileByteSource.class
23-Jan-2017 10:50:12 Class com.carrotsearch.ant.tasks.junit4.dependencies.com.google.common.io.Files$FileByteSource loaded from ant loader (parentFirst)
23-Jan-2017 10:50:12 Finding class com.carrotsearch.ant.tasks.junit4.dependencies.com.google.common.io.ByteSink
23-Jan-2017 10:50:12 Loaded from /mnt/work/bamboo-home/xml-data/build-dir/RNDTEST-SOFTWARE-IBM17/junit4-ant/target/junit4-ant-2.4.2-SNAPSHOT.jar com/carrotsearch/ant/tasks/junit4/dependencies/com/google/common/io/ByteSink.class
23-Jan-2017 10:50:12 Class com.carrotsearch.ant.tasks.junit4.dependencies.com.google.common.io.ByteSink loaded from ant loader (parentFirst)
23-Jan-2017 10:50:12 Finding class com.carrotsearch.ant.tasks.junit4.dependencies.com.google.common.io.Files$FileByteSink
23-Jan-2017 10:50:12 Loaded from /mnt/work/bamboo-home/xml-data/build-dir/RNDTEST-SOFTWARE-IBM17/junit4-ant/target/junit4-ant-2.4.2-SNAPSHOT.jar com/carrotsearch/ant/tasks/junit4/dependencies/com/google/common/io/Files$FileByteSink.class
23-Jan-2017 10:50:12 Class com.carrotsearch.ant.tasks.junit4.dependencies.com.google.common.io.Files$FileByteSink loaded from ant loader (parentFirst)
23-Jan-2017 10:50:12 Finding class com.carrotsearch.ant.tasks.junit4.dependencies.com.google.common.collect.TreeTraverser
23-Jan-2017 10:50:12 Loaded from /mnt/work/bamboo-home/xml-data/build-dir/RNDTEST-SOFTWARE-IBM17/junit4-ant/target/junit4-ant-2.4.2-SNAPSHOT.jar com/carrotsearch/ant/tasks/junit4/dependencies/com/google/common/collect/TreeTraverser.class
23-Jan-2017 10:50:12 Class com.carrotsearch.ant.tasks.junit4.dependencies.com.google.common.collect.TreeTraverser loaded from ant loader (parentFirst)
23-Jan-2017 10:50:12 Finding class com.carrotsearch.ant.tasks.junit4.dependencies.com.google.common.io.Files$2
23-Jan-2017 10:50:12 Loaded from /mnt/work/bamboo-home/xml-data/build-dir/RNDTEST-SOFTWARE-IBM17/junit4-ant/target/junit4-ant-2.4.2-SNAPSHOT.jar com/carrotsearch/ant/tasks/junit4/dependencies/com/google/common/io/Files$2.class
23-Jan-2017 10:50:12 Class com.carrotsearch.ant.tasks.junit4.dependencies.com.google.common.io.Files$2 loaded from ant loader (parentFirst)
23-Jan-2017 10:50:12 Finding class com.carrotsearch.ant.tasks.junit4.dependencies.com.google.common.io.CharSource
23-Jan-2017 10:50:12 Loaded from /mnt/work/bamboo-home/xml-data/build-dir/RNDTEST-SOFTWARE-IBM17/junit4-ant/target/junit4-ant-2.4.2-SNAPSHOT.jar com/carrotsearch/ant/tasks/junit4/dependencies/com/google/common/io/CharSource.class
23-Jan-2017 10:50:12 Class com.carrotsearch.ant.tasks.junit4.dependencies.com.google.common.io.CharSource loaded from ant loader (parentFirst)
23-Jan-2017 10:50:12 Finding class com.carrotsearch.ant.tasks.junit4.dependencies.com.google.common.io.ByteSource$AsCharSource
23-Jan-2017 10:50:12 Loaded from /mnt/work/bamboo-home/xml-data/build-dir/RNDTEST-SOFTWARE-IBM17/junit4-ant/target/junit4-ant-2.4.2-SNAPSHOT.jar com/carrotsearch/ant/tasks/junit4/dependencies/com/google/common/io/ByteSource$AsCharSource.class
23-Jan-2017 10:50:12 Class com.carrotsearch.ant.tasks.junit4.dependencies.com.google.common.io.ByteSource$AsCharSource loaded from ant loader (parentFirst)
23-Jan-2017 10:50:12 Finding class com.carrotsearch.ant.tasks.junit4.dependencies.com.google.common.io.FileWriteMode
23-Jan-2017 10:50:12 Loaded from /mnt/work/bamboo-home/xml-data/build-dir/RNDTEST-SOFTWARE-IBM17/junit4-ant/target/junit4-ant-2.4.2-SNAPSHOT.jar com/carrotsearch/ant/tasks/junit4/dependencies/com/google/common/io/FileWriteMode.class
23-Jan-2017 10:50:12 Class com.carrotsearch.ant.tasks.junit4.dependencies.com.google.common.io.FileWriteMode loaded from ant loader (parentFirst)
23-Jan-2017 10:50:12 Finding class com.carrotsearch.ant.tasks.junit4.dependencies.com.google.common.io.CharSink
23-Jan-2017 10:50:12 Loaded from /mnt/work/bamboo-home/xml-data/build-dir/RNDTEST-SOFTWARE-IBM17/junit4-ant/target/junit4-ant-2.4.2-SNAPSHOT.jar com/carrotsearch/ant/tasks/junit4/dependencies/com/google/common/io/CharSink.class
23-Jan-2017 10:50:12 Class com.carrotsearch.ant.tasks.junit4.dependencies.com.google.common.io.CharSink loaded from ant loader (parentFirst)
23-Jan-2017 10:50:12 Finding class com.carrotsearch.ant.tasks.junit4.dependencies.com.google.common.io.ByteSink$AsCharSink
23-Jan-2017 10:50:12 Loaded from /mnt/work/bamboo-home/xml-data/build-dir/RNDTEST-SOFTWARE-IBM17/junit4-ant/target/junit4-ant-2.4.2-SNAPSHOT.jar com/carrotsearch/ant/tasks/junit4/dependencies/com/google/common/io/ByteSink$AsCharSink.class
23-Jan-2017 10:50:12 Class com.carrotsearch.ant.tasks.junit4.dependencies.com.google.common.io.ByteSink$AsCharSink loaded from ant loader (parentFirst)
23-Jan-2017 10:50:12 Finding class com.carrotsearch.ant.tasks.junit4.dependencies.com.google.common.io.ByteStreams
23-Jan-2017 10:50:12 Loaded from /mnt/work/bamboo-home/xml-data/build-dir/RNDTEST-SOFTWARE-IBM17/junit4-ant/target/junit4-ant-2.4.2-SNAPSHOT.jar com/carrotsearch/ant/tasks/junit4/dependencies/com/google/common/io/ByteStreams.class
23-Jan-2017 10:50:12 Class com.carrotsearch.ant.tasks.junit4.dependencies.com.google.common.io.ByteStreams loaded from ant loader (parentFirst)
23-Jan-2017 10:50:12 Class java.io.ByteArrayOutputStream loaded from parent loader (parentFirst)
23-Jan-2017 10:50:12 Finding class com.carrotsearch.ant.tasks.junit4.dependencies.com.google.common.io.ByteStreams$FastByteArrayOutputStream
23-Jan-2017 10:50:12 Loaded from /mnt/work/bamboo-home/xml-data/build-dir/RNDTEST-SOFTWARE-IBM17/junit4-ant/target/junit4-ant-2.4.2-SNAPSHOT.jar com/carrotsearch/ant/tasks/junit4/dependencies/com/google/common/io/ByteStreams$FastByteArrayOutputStream.class
23-Jan-2017 10:50:12 Class com.carrotsearch.ant.tasks.junit4.dependencies.com.google.common.io.ByteStreams$FastByteArrayOutputStream loaded from ant loader (parentFirst)
23-Jan-2017 10:50:12 Finding class com.carrotsearch.ant.tasks.junit4.dependencies.com.google.common.io.ByteStreams$1
23-Jan-2017 10:50:12 Loaded from /mnt/work/bamboo-home/xml-data/build-dir/RNDTEST-SOFTWARE-IBM17/junit4-ant/target/junit4-ant-2.4.2-SNAPSHOT.jar com/carrotsearch/ant/tasks/junit4/dependencies/com/google/common/io/ByteStreams$1.class
23-Jan-2017 10:50:12 Class com.carrotsearch.ant.tasks.junit4.dependencies.com.google.common.io.ByteStreams$1 loaded from ant loader (parentFirst)
23-Jan-2017 10:50:12 Finding class com.carrotsearch.ant.tasks.junit4.dependencies.com.google.common.io.Closeables
23-Jan-2017 10:50:12 Loaded from /mnt/work/bamboo-home/xml-data/build-dir/RNDTEST-SOFTWARE-IBM17/junit4-ant/target/junit4-ant-2.4.2-SNAPSHOT.jar com/carrotsearch/ant/tasks/junit4/dependencies/com/google/common/io/Closeables.class
23-Jan-2017 10:50:12 Class com.carrotsearch.ant.tasks.junit4.dependencies.com.google.common.io.Closeables loaded from ant loader (parentFirst)
23-Jan-2017 10:50:12 Finding class com.carrotsearch.ant.tasks.junit4.Duration
23-Jan-2017 10:50:12 Loaded from /mnt/work/bamboo-home/xml-data/build-dir/RNDTEST-SOFTWARE-IBM17/junit4-ant/target/junit4-ant-2.4.2-SNAPSHOT.jar com/carrotsearch/ant/tasks/junit4/Duration.class
23-Jan-2017 10:50:12 Class com.carrotsearch.ant.tasks.junit4.Duration loaded from ant loader (parentFirst)
23-Jan-2017 10:50:12 Class java.lang.Float loaded from parent loader (parentFirst)
23-Jan-2017 10:50:12 [junit4.preconf] Execution time total: 0.02 sec.
23-Jan-2017 10:50:12 [junit4.preconf] ERROR: JVM J0 ended with an exception, command line: null
23-Jan-2017 10:50:12 [junit4.preconf] ERROR: JVM J0 ended with an exception: Cwd of a forked JVM already exists and is not empty and setOnNonEmptyWorkDirectory=FAIL: [/mnt/work/bamboo-home/xml-data/build-dir/RNDTEST-SOFTWARE-IBM17/junit4-ant/target/test-classes/J0/cwdconflict.tmp]
23-Jan-2017 10:50:12 [junit4.preconf]         at com.carrotsearch.ant.tasks.junit4.JUnit4.getWorkingDirectory(JUnit4.java:1719)
23-Jan-2017 10:50:12 [junit4.preconf]         at com.carrotsearch.ant.tasks.junit4.JUnit4.forkProcess(JUnit4.java:1624)
23-Jan-2017 10:50:12 [junit4.preconf]         at com.carrotsearch.ant.tasks.junit4.JUnit4.executeSlave(JUnit4.java:1481)
23-Jan-2017 10:50:12 [junit4.preconf]         at com.carrotsearch.ant.tasks.junit4.JUnit4.access$000(JUnit4.java:125)
23-Jan-2017 10:50:12 [junit4.preconf]         at com.carrotsearch.ant.tasks.junit4.JUnit4$2.call(JUnit4.java:981)
23-Jan-2017 10:50:12 [junit4.preconf]         at com.carrotsearch.ant.tasks.junit4.JUnit4$2.call(JUnit4.java:978)
23-Jan-2017 10:50:12 [junit4.preconf]         at java.util.concurrent.FutureTask.run(FutureTask.java:277)
23-Jan-2017 10:50:12 [junit4.preconf]         at java.util.concurrent.ThreadPoolExecutor.runWorker(ThreadPoolExecutor.java:1153)
23-Jan-2017 10:50:12 [junit4.preconf]         at java.util.concurrent.ThreadPoolExecutor$Worker.run(ThreadPoolExecutor.java:628)
23-Jan-2017 10:50:12 [junit4.preconf]         at java.lang.Thread.run(Thread.java:785)
23-Jan-2017 10:50:12 [junit4.preconf] ERROR: JVM J1 ended with an exception, command line: null
23-Jan-2017 10:50:12 [junit4.preconf] ERROR: JVM J1 ended with an exception: Cwd of a forked JVM already exists and is not empty and setOnNonEmptyWorkDirectory=FAIL: [/mnt/work/bamboo-home/xml-data/build-dir/RNDTEST-SOFTWARE-IBM17/junit4-ant/target/test-classes/J1/cwdconflict.tmp]
23-Jan-2017 10:50:12 [junit4.preconf]         at com.carrotsearch.ant.tasks.junit4.JUnit4.getWorkingDirectory(JUnit4.java:1719)
23-Jan-2017 10:50:12 [junit4.preconf]         at com.carrotsearch.ant.tasks.junit4.JUnit4.forkProcess(JUnit4.java:1624)
23-Jan-2017 10:50:12 [junit4.preconf]         at com.carrotsearch.ant.tasks.junit4.JUnit4.executeSlave(JUnit4.java:1481)
23-Jan-2017 10:50:12 [junit4.preconf]         at com.carrotsearch.ant.tasks.junit4.JUnit4.access$000(JUnit4.java:125)
23-Jan-2017 10:50:12 [junit4.preconf]         at com.carrotsearch.ant.tasks.junit4.JUnit4$2.call(JUnit4.java:981)
23-Jan-2017 10:50:12 [junit4.preconf]         at com.carrotsearch.ant.tasks.junit4.JUnit4$2.call(JUnit4.java:978)
23-Jan-2017 10:50:12 [junit4.preconf]         at java.util.concurrent.FutureTask.run(FutureTask.java:277)
23-Jan-2017 10:50:12 [junit4.preconf]         at java.util.concurrent.ThreadPoolExecutor.runWorker(ThreadPoolExecutor.java:1153)
23-Jan-2017 10:50:12 [junit4.preconf]         at java.util.concurrent.ThreadPoolExecutor$Worker.run(ThreadPoolExecutor.java:628)
23-Jan-2017 10:50:12 [junit4.preconf]         at java.lang.Thread.run(Thread.java:785)
23-Jan-2017 10:50:12
23-Jan-2017 10:50:12 Tests run: 1, Failures: 0, Errors: 1, Skipped: 0, Time elapsed: 0.002 sec <<< FAILURE! - in com.carrotsearch.ant.tasks.junit4.it.TestDuplicateResourceCollections
23-Jan-2017 10:50:12 duplicateResourceCollectionEntries(com.carrotsearch.ant.tasks.junit4.it.TestDuplicateResourceCollections)  Time elapsed: 0.002 sec  <<< ERROR!
23-Jan-2017 10:50:12 org.apache.tools.ant.BuildException: At least one slave process threw an exception, first: Cwd of a forked JVM already exists and is not empty and setOnNonEmptyWorkDirectory=FAIL: [/mnt/work/bamboo-home/xml-data/build-dir/RNDTEST-SOFTWARE-IBM17/junit4-ant/target/test-classes/J0/cwdconflict.tmp]
23-Jan-2017 10:50:12         at com.carrotsearch.ant.tasks.junit4.it.TestDuplicateResourceCollections.duplicateResourceCollectionEntries(TestDuplicateResourceCollections.java:10)
23-Jan-2017 10:50:12 Caused by: org.apache.tools.ant.BuildException: Cwd of a forked JVM already exists and is not empty and setOnNonEmptyWorkDirectory=FAIL: [/mnt/work/bamboo-home/xml-data/build-dir/RNDTEST-SOFTWARE-IBM17/junit4-ant/target/test-classes/J0/cwdconflict.tmp]
23-Jan-2017 10:50:12
23-Jan-2017 10:50:12
23-Jan-2017 10:50:12 Results :
23-Jan-2017 10:50:12
23-Jan-2017 10:50:12 Failed tests:
23-Jan-2017 10:50:12   TestCrashesAndExceptions.jvmcrash:19->AntBuildFileTestBase.expectBuildExceptionContaining:102
23-Jan-2017 10:50:12 Expected: a string containing "was not empty, see:"
23-Jan-2017 10:50:12      got: "At least one slave process threw an exception, first: Cwd of a forked JVM already exists and is not empty and setOnNonEmptyWorkDirectory=FAIL: [/mnt/work/bamboo-home/xml-data/build-dir/RNDTEST-SOFTWARE-IBM17/junit4-ant/target/test-classes/J0/cwdconflict.tmp]"
23-Jan-2017 10:50:12
23-Jan-2017 10:50:12   TestIfNoTestsOption.allFilteredOut:10->AntBuildFileTestBase.expectBuildExceptionContaining:102
23-Jan-2017 10:50:12 Expected: a string containing "There were no executed tests: 0 suites, 0 tests"
23-Jan-2017 10:50:12      got: "At least one slave process threw an exception, first: Cwd of a forked JVM already exists and is not empty and setOnNonEmptyWorkDirectory=FAIL: [/mnt/work/bamboo-home/xml-data/build-dir/RNDTEST-SOFTWARE-IBM17/junit4-ant/target/test-classes/J0/cwdconflict.tmp]"
23-Jan-2017 10:50:12
23-Jan-2017 10:50:12   TestIfNoTestsOption.oneAssumptionIgnored:20->AntBuildFileTestBase.expectBuildExceptionContaining:102
23-Jan-2017 10:50:12 Expected: a string containing "There were no executed tests: 1 suite, 1 test, 1 ignored"
23-Jan-2017 10:50:12      got: "At least one slave process threw an exception, first: Cwd of a forked JVM already exists and is not empty and setOnNonEmptyWorkDirectory=FAIL: [/mnt/work/bamboo-home/xml-data/build-dir/RNDTEST-SOFTWARE-IBM17/junit4-ant/target/test-classes/J0/cwdconflict.tmp]"
23-Jan-2017 10:50:12
23-Jan-2017 10:50:12   TestIfNoTestsOption.oneError:35->AntBuildFileTestBase.expectBuildExceptionContaining:102
23-Jan-2017 10:50:12 Expected: a string containing "There were test failures: 1 suite, 1 test, 1 error"
23-Jan-2017 10:50:12      got: "At least one slave process threw an exception, first: Cwd of a forked JVM already exists and is not empty and setOnNonEmptyWorkDirectory=FAIL: [/mnt/work/bamboo-home/xml-data/build-dir/RNDTEST-SOFTWARE-IBM17/junit4-ant/target/test-classes/J0/cwdconflict.tmp]"
23-Jan-2017 10:50:12
23-Jan-2017 10:50:12   TestIfNoTestsOption.oneFailure:30->AntBuildFileTestBase.expectBuildExceptionContaining:102
23-Jan-2017 10:50:12 Expected: a string containing "There were test failures: 1 suite, 1 test, 1 failure"
23-Jan-2017 10:50:12      got: "At least one slave process threw an exception, first: Cwd of a forked JVM already exists and is not empty and setOnNonEmptyWorkDirectory=FAIL: [/mnt/work/bamboo-home/xml-data/build-dir/RNDTEST-SOFTWARE-IBM17/junit4-ant/target/test-classes/J0/cwdconflict.tmp]"
23-Jan-2017 10:50:12
23-Jan-2017 10:50:12   TestIfNoTestsOption.oneIgnored:15->AntBuildFileTestBase.expectBuildExceptionContaining:102
23-Jan-2017 10:50:12 Expected: a string containing "There were no executed tests: 1 suite, 1 test, 1 ignored"
23-Jan-2017 10:50:12      got: "At least one slave process threw an exception, first: Cwd of a forked JVM already exists and is not empty and setOnNonEmptyWorkDirectory=FAIL: [/mnt/work/bamboo-home/xml-data/build-dir/RNDTEST-SOFTWARE-IBM17/junit4-ant/target/test-classes/J0/cwdconflict.tmp]"
23-Jan-2017 10:50:12
23-Jan-2017 10:50:12   TestMiscJUnit4Attributes.afterClassError:37->AntBuildFileTestBase.expectBuildExceptionContaining:102
23-Jan-2017 10:50:12 Expected: a string containing "1 suite, 1 test, 1 suite-level error"
23-Jan-2017 10:50:12      got: "At least one slave process threw an exception, first: Cwd of a forked JVM already exists and is not empty and setOnNonEmptyWorkDirectory=FAIL: [/mnt/work/bamboo-home/xml-data/build-dir/RNDTEST-SOFTWARE-IBM17/junit4-ant/target/test-classes/J0/cwdconflict.tmp]"
23-Jan-2017 10:50:12
23-Jan-2017 10:50:12   TestMiscJUnit4Attributes.assertions:81->AntBuildFileTestBase.expectBuildExceptionContaining:102
23-Jan-2017 10:50:12 Expected: a string containing "There were test failures"
23-Jan-2017 10:50:12      got: "At least one slave process threw an exception, first: Cwd of a forked JVM already exists and is not empty and setOnNonEmptyWorkDirectory=FAIL: [/mnt/work/bamboo-home/xml-data/build-dir/RNDTEST-SOFTWARE-IBM17/junit4-ant/target/test-classes/J0/cwdconflict.tmp]"
23-Jan-2017 10:50:12
23-Jan-2017 10:50:12   TestMiscJUnit4Attributes.beforeClassError:30->AntBuildFileTestBase.expectBuildExceptionContaining:102
23-Jan-2017 10:50:12 Expected: a string containing "1 suite, 0 tests, 1 suite-level error"
23-Jan-2017 10:50:12      got: "At least one slave process threw an exception, first: Cwd of a forked JVM already exists and is not empty and setOnNonEmptyWorkDirectory=FAIL: [/mnt/work/bamboo-home/xml-data/build-dir/RNDTEST-SOFTWARE-IBM17/junit4-ant/target/test-classes/J0/cwdconflict.tmp]"
23-Jan-2017 10:50:12
23-Jan-2017 10:50:12   TestMiscJUnit4Attributes.hierarchicalSuiteDescription:44->AntBuildFileTestBase.expectBuildExceptionContaining:102
23-Jan-2017 10:50:12 Expected: a string containing "1 suite, 2 tests, 3 suite-level errors, 1 error"
23-Jan-2017 10:50:12      got: "At least one slave process threw an exception, first: Cwd of a forked JVM already exists and is not empty and setOnNonEmptyWorkDirectory=FAIL: [/mnt/work/bamboo-home/xml-data/build-dir/RNDTEST-SOFTWARE-IBM17/junit4-ant/target/test-classes/J0/cwdconflict.tmp]"
23-Jan-2017 10:50:12
23-Jan-2017 10:50:12   TestMiscJUnit4Attributes.statuses:18->AntBuildFileTestBase.expectBuildExceptionContaining:102
23-Jan-2017 10:50:12 Expected: a string containing "1 suite, 5 tests, 1 error, 1 failure, 2 ignored (1 assumption)"
23-Jan-2017 10:50:12      got: "At least one slave process threw an exception, first: Cwd of a forked JVM already exists and is not empty and setOnNonEmptyWorkDirectory=FAIL: [/mnt/work/bamboo-home/xml-data/build-dir/RNDTEST-SOFTWARE-IBM17/junit4-ant/target/test-classes/J0/cwdconflict.tmp]"
23-Jan-2017 10:50:12
23-Jan-2017 10:50:12   TestPreconditions.nojunit:10->AntBuildFileTestBase.expectBuildExceptionContaining:102
23-Jan-2017 10:50:12 Expected: a string containing "Forked JVM's classpath must include a junit4 JAR"
23-Jan-2017 10:50:12      got: "At least one slave process threw an exception, first: Cwd of a forked JVM already exists and is not empty and setOnNonEmptyWorkDirectory=FAIL: [/mnt/work/bamboo-home/xml-data/build-dir/RNDTEST-SOFTWARE-IBM17/junit4-ant/target/test-classes/J0/cwdconflict.tmp]"
23-Jan-2017 10:50:12
23-Jan-2017 10:50:12   TestPreconditions.oldjunit:16->AntBuildFileTestBase.assertLogContains:79 Log did not contain: 'Forked JVM's classpath must use JUnit 4.10 or newer'
23-Jan-2017 10:50:12   TestStackOverflowInEventEmitter.stackoverflow:10->AntBuildFileTestBase.expectBuildExceptionContaining:102
23-Jan-2017 10:50:12 Expected: a string containing "Quit event not received from the forked process?"
23-Jan-2017 10:50:12      got: "At least one slave process threw an exception, first: Cwd of a forked JVM already exists and is not empty and setOnNonEmptyWorkDirectory=FAIL: [/mnt/work/bamboo-home/xml-data/build-dir/RNDTEST-SOFTWARE-IBM17/junit4-ant/target/test-classes/J0/cwdconflict.tmp]"
23-Jan-2017 10:50:12
23-Jan-2017 10:50:12   TestSuiteClassesBad.notinstantiable:16->AntBuildFileTestBase.expectBuildExceptionContaining:102
23-Jan-2017 10:50:12 Expected: a string containing "There were test failures: 1 suite, 1 test, 1 error"
23-Jan-2017 10:50:12      got: "At least one slave process threw an exception, first: Cwd of a forked JVM already exists and is not empty and setOnNonEmptyWorkDirectory=FAIL: [/mnt/work/bamboo-home/xml-data/build-dir/RNDTEST-SOFTWARE-IBM17/junit4-ant/target/test-classes/J0/cwdconflict.tmp]"
23-Jan-2017 10:50:12
23-Jan-2017 10:50:12   TestUnhandledSlaveFailure.checkSlaveMainFailure:13->AntBuildFileTestBase.assertLogContains:79 Log did not contain: 'BAMBOOOOOCHA!'
23-Jan-2017 10:50:12 Tests in error:
23-Jan-2017 10:50:12   TestChildVmSysprops.sysprops:10->AntBuildFileTestBase.executeTarget:110 » Build
23-Jan-2017 10:50:12   TestCrashesAndExceptions.slavehanging:12->AntBuildFileTestBase.executeTarget:110 » Build
23-Jan-2017 10:50:12   TestDuplicateResourceCollections.duplicateResourceCollectionEntries:10->AntBuildFileTestBase.executeTarget:110 » Build
23-Jan-2017 10:50:12   TestFileEncodings.checkTypicalEncodings:14->AntBuildFileTestBase.executeTarget:110 » Build
23-Jan-2017 10:50:12   TestFiltering.classfilter:10->AntBuildFileTestBase.executeTarget:110 » Build A...
23-Jan-2017 10:50:12   TestFiltering.filterexpression:22->AntBuildFileTestBase.executeTarget:110 » Build
23-Jan-2017 10:50:12   TestFiltering.methodfilter:16->AntBuildFileTestBase.executeTarget:110 » Build ...
23-Jan-2017 10:50:12   TestHeartbeat.testHeartbeat:12->AntBuildFileTestBase.executeTarget:110 » Build
23-Jan-2017 10:50:12   TestIfNoTestsOption.oneSuccessfull:25->AntBuildFileTestBase.executeTarget:110 » Build
23-Jan-2017 10:50:12   TestJvmLogging.jvmverbose:12->AntBuildFileTestBase.executeTarget:110 » Build A...
23-Jan-2017 10:50:12   TestJvmLogging.sysouts:18->AntBuildFileTestBase.executeTarget:110 » Build At l...
23-Jan-2017 10:50:12   TestMiscJUnit4Attributes.balancing:87->AntBuildFileTestBase.executeTarget:110 » Build
23-Jan-2017 10:50:12   TestMiscJUnit4Attributes.balancing_nohints:96->AntBuildFileTestBase.executeTarget:110 » Build
23-Jan-2017 10:50:12   TestMiscJUnit4Attributes.ignoredSuite:24->AntBuildFileTestBase.executeTarget:110 » Build
23-Jan-2017 10:50:12   TestMiscJUnit4Attributes.jvmarg:60->AntBuildFileTestBase.executeTarget:110 » Build
23-Jan-2017 10:50:12   TestMiscJUnit4Attributes.maxmem:55->AntBuildFileTestBase.executeTarget:110 » Build
23-Jan-2017 10:50:12   TestMiscJUnit4Attributes.mergehints:101->AntBuildFileTestBase.executeTarget:110 » Build
23-Jan-2017 10:50:12   TestMiscJUnit4Attributes.reproducestring:75->AntBuildFileTestBase.executeTarget:110 » Build
23-Jan-2017 10:50:12   TestMiscJUnit4Attributes.seedpassing:65->AntBuildFileTestBase.executeTarget:110 » Build
23-Jan-2017 10:50:12   TestOutputCapture.outofordersysouts:20->AntBuildFileTestBase.executeTarget:110 » Build
23-Jan-2017 10:50:12   TestOutputCapture.staticScopeOutput:25->AntBuildFileTestBase.executeTarget:110 » Build
23-Jan-2017 10:50:12   TestOutputCapture.sysstreams:12->AntBuildFileTestBase.executeTarget:110 » Build
23-Jan-2017 10:50:12   TestReplication.pseudoBalancing:35->AntBuildFileTestBase.executeTarget:110 » Build
23-Jan-2017 10:50:12   TestReplication.replicationAndBalancing:24->AntBuildFileTestBase.executeTarget:110 » Build
23-Jan-2017 10:50:12   TestReplication.singleSuiteReplication:15->AntBuildFileTestBase.executeTarget:110 » Build
23-Jan-2017 10:50:12   TestSourceSuitesAsInput.sourcesuites:9->AntBuildFileTestBase.executeTarget:110 » Build
23-Jan-2017 10:50:12   TestStatsProperties.allFilteredOut:10->AntBuildFileTestBase.executeTarget:110 » Build
23-Jan-2017 10:50:12   TestSuiteDuplicates.suiteduplicate:10->AntBuildFileTestBase.executeTarget:110 » Build
23-Jan-2017 10:50:12   TestSysProperties.env:37->AntBuildFileTestBase.executeTarget:110 » Build At le...
23-Jan-2017 10:50:12   TestSysProperties.failureProperty:12->AntBuildFileTestBase.executeTarget:110 » Build
23-Jan-2017 10:50:12   TestSysProperties.failureTypePassing:17->AntBuildFileTestBase.executeTarget:110 » Build
23-Jan-2017 10:50:12   TestSysProperties.iters:42->AntBuildFileTestBase.executeTarget:110 » Build At ...
23-Jan-2017 10:50:12   TestSysProperties.sysproperty:32->AntBuildFileTestBase.executeTarget:110 » Build
23-Jan-2017 10:50:12   TestTextReport.errorsSoFarIndicator:114->AntBuildFileTestBase.executeTarget:110 » Build
23-Jan-2017 10:50:12   TestTextReport.failureslist:88->AntBuildFileTestBase.executeTarget:110 » Build
23-Jan-2017 10:50:12   TestTextReport.filtertrace_custom:104->AntBuildFileTestBase.executeTarget:110 » Build
23-Jan-2017 10:50:12   TestTextReport.filtertrace_default:94->AntBuildFileTestBase.executeTarget:110 » Build
23-Jan-2017 10:50:12   TestTextReport.listeners:48->AntBuildFileTestBase.executeTarget:110 » Build At...
23-Jan-2017 10:50:12   TestTextReport.reasonForIgnored:26->AntBuildFileTestBase.executeTarget:110 » Build
23-Jan-2017 10:50:12   TestTextReport.reasonForIgnoredByDisabledGroup:34->AntBuildFileTestBase.executeTarget:110 » Build
23-Jan-2017 10:50:12   TestTextReport.reasonForSuiteAssumptionIgnored:40->AntBuildFileTestBase.executeTarget:110 » Build
23-Jan-2017 10:50:12   TestTextReport.suiteerror:18->AntBuildFileTestBase.executeTarget:110 » Build A...
23-Jan-2017 10:50:12   TestTextReport.sysoutsOnSuiteFailure:62->AntBuildFileTestBase.executeTarget:110 » Build
23-Jan-2017 10:50:12   TestTextReport.sysoutsOnSuiteTimeout:72->AntBuildFileTestBase.executeTarget:110 » Build
23-Jan-2017 10:50:12   TestTextReport.sysoutsPassthrough:83->AntBuildFileTestBase.executeTarget:110 » Build
23-Jan-2017 10:50:12   TestTextReport.timestamps:55->AntBuildFileTestBase.executeTarget:110 » Build A...
23-Jan-2017 10:50:12
23-Jan-2017 10:50:12 Tests run: 87, Failures: 16, Errors: 46, Skipped: 3
23-Jan-2017 10:50:12
23-Jan-2017 10:50:12 [INFO] ------------------------------------------------------------------------
23-Jan-2017 10:50:12 [INFO] Reactor Summary:
23-Jan-2017 10:50:12 [INFO]
23-Jan-2017 10:50:12 [INFO] RandomizedTesting Parent POM ....................... SUCCESS [  1.339 s]
23-Jan-2017 10:50:12 [INFO] RandomizedTesting Randomized Runner ................ SUCCESS [ 43.094 s]
23-Jan-2017 10:50:12 [INFO] RandomizedTesting JUnit4 ANT Task .................. FAILURE [ 55.940 s]
23-Jan-2017 10:50:12 [INFO] RandomizedTesting JUnit4 Maven Plugin .............. SKIPPED
23-Jan-2017 10:50:12 [INFO] RandomizedTesting JUnit4 Maven Plugin Tests ........ SKIPPED
23-Jan-2017 10:50:12 [INFO] RandomizedTesting Examples ......................... SKIPPED
23-Jan-2017 10:50:12 [INFO] RandomizedTesting ANT Examples ..................... SKIPPED
23-Jan-2017 10:50:12 [INFO] RandomizedTesting Security Manager Example ......... SKIPPED
23-Jan-2017 10:50:12 [INFO] ------------------------------------------------------------------------
23-Jan-2017 10:50:12 [INFO] BUILD FAILURE
23-Jan-2017 10:50:12 [INFO] ------------------------------------------------------------------------
23-Jan-2017 10:50:12 [INFO] Total time: 01:40 min
23-Jan-2017 10:50:12 [INFO] Finished at: 2017-01-23T10:50:12+01:00
23-Jan-2017 10:50:12 [INFO] Final Memory: 31M/74M
23-Jan-2017 10:50:12 [INFO] ------------------------------------------------------------------------
23-Jan-2017 10:50:12 [ERROR] Failed to execute goal org.apache.maven.plugins:maven-surefire-plugin:2.19.1:test (surefire-it) on project junit4-ant: There are test failures.
23-Jan-2017 10:50:12 [ERROR]
23-Jan-2017 10:50:12 [ERROR] Please refer to /mnt/work/bamboo-home/xml-data/build-dir/RNDTEST-SOFTWARE-IBM17/junit4-ant/target/surefire-reports for the individual test results.
23-Jan-2017 10:50:12 [ERROR] -> [Help 1]
23-Jan-2017 10:50:12 [ERROR]
23-Jan-2017 10:50:12 [ERROR] To see the full stack trace of the errors, re-run Maven with the -e switch.
23-Jan-2017 10:50:12 [ERROR] Re-run Maven using the -X switch to enable full debug logging.
23-Jan-2017 10:50:12 [ERROR]
23-Jan-2017 10:50:12 [ERROR] For more information about the errors and possible solutions, please read the following articles:
23-Jan-2017 10:50:12 [ERROR] [Help 1] http://cwiki.apache.org/confluence/display/MAVEN/MojoFailureException
23-Jan-2017 10:50:12 [ERROR]
23-Jan-2017 10:50:12 [ERROR] After correcting the problems, you can resume the build with the command
23-Jan-2017 10:50:12 [ERROR]   mvn <goals> -rf :junit4-ant
23-Jan-2017 10:50:12 Failing task since return code of [/home/bamboo/tools/apache-maven-3.2.5/bin/mvn --batch-mode -Djava.io.tmpdir=/home/bamboo/bamboo-software/temp/RNDTEST-SOFTWARE-IBM17 -Dmaven.repo.local=/mnt/work/bamboo-home/.m2/AGENT-1146881/repository clean verify -Dproguard.java.home=/usr/lib/jvm/jdk8/jre] was 1 while expected 0
23-Jan-2017 10:50:12 Parsing test results under /mnt/work/bamboo-home/xml-data/build-dir/RNDTEST-SOFTWARE-IBM17...
23-Jan-2017 10:50:12 Finished task 'Maven 3.x' with result: Failed
23-Jan-2017 10:50:12 Running post build plugin 'npm Cache Cleanup'
23-Jan-2017 10:50:12 Running post build plugin 'NCover Results Collector'
23-Jan-2017 10:50:12 Running post build plugin 'Clover Results Collector'
23-Jan-2017 10:50:12 Running post build plugin 'Docker Container Cleanup'
23-Jan-2017 10:50:12 Running post build plugin 'Artifact Copier'
23-Jan-2017 10:50:13 Successfully removed working directory at '/mnt/work/bamboo-home/xml-data/build-dir/RNDTEST-SOFTWARE-IBM17'
23-Jan-2017 10:50:13 Finalising the build...
23-Jan-2017 10:50:13 Stopping timer.
23-Jan-2017 10:50:13 Build RNDTEST-SOFTWARE-IBM17-164 completed.
23-Jan-2017 10:50:13 Running on server: post build plugin 'NCover Results Collector'
23-Jan-2017 10:50:13 Running on server: post build plugin 'Clover Delta Calculator'
23-Jan-2017 10:50:13 Running on server: post build plugin 'Maven Dependencies Postprocessor'
23-Jan-2017 10:50:13 Running on server: post build plugin 'Build Hanging Detection Configuration'
23-Jan-2017 10:50:13 All post build plugins have finished
23-Jan-2017 10:50:13 Generating build results summary...
23-Jan-2017 10:50:17 Saving build results to disk...
23-Jan-2017 10:50:17 Logging substituted variables...
23-Jan-2017 10:50:18 Indexing build results...
23-Jan-2017 10:50:18 Finished building RNDTEST-SOFTWARE-IBM17-164.