Build #98

Build: #98 failed Changes by Dawid Weiss

Stages & jobs

  1. Compile and test

  2. Package

Test results

  • 608 tests in total
  • 416 tests failed
  • 416 failures are new
  • 6 seconds taken in total.
New test failures 416
Status Test View job Duration
Collapse Failed TestAnnotationInheritance checkOldMethodRules History
JDK 11 J9 < 1 sec
org.junit.ComparisonFailure: [# JUnit order:
[before-class, rule-before, inherited before-test, inherited testMethod, inherited after-test, rule-after, after-class]
# RR order:
[]] expected:<[["before-class",
    "rule-before",
    "inherited before-test",
    "inherited testMethod",
    "inherited after-test",
(3 more lines...)
Collapse Failed TestAnnotationInheritance checkOldMethodRules History
JDK 1.7 < 1 sec
org.junit.ComparisonFailure: [# JUnit order:
[before-class, rule-before, inherited before-test, inherited testMethod, inherited after-test, rule-after, after-class]
# RR order:
[]] expected:<[["before-class",
    "rule-before",
    "inherited before-test",
    "inherited testMethod",
    "inherited after-test",
(3 more lines...)
Collapse Failed TestAnnotationInheritance checkOldMethodRules History
JDK 1.8 < 1 sec
org.junit.ComparisonFailure: [# JUnit order:
[before-class, rule-before, inherited before-test, inherited testMethod, inherited after-test, rule-after, after-class]
# RR order:
[]] expected:<[["before-class",
    "rule-before",
    "inherited before-test",
    "inherited testMethod",
    "inherited after-test",
(3 more lines...)
Collapse Failed TestAnnotationInheritance checkOldMethodRules History
JDK 9 < 1 sec
org.junit.ComparisonFailure: [# JUnit order:
[before-class, rule-before, inherited before-test, inherited testMethod, inherited after-test, rule-after, after-class]
# RR order:
[]] expected:<[["before-class",
    "rule-before",
    "inherited before-test",
    "inherited testMethod",
    "inherited after-test",
(3 more lines...)
Collapse Failed TestAssumptionsAtClassLevel checkOrder History
JDK 11 J9 < 1 sec
java.lang.AssertionError: expected:<1> but was:<0>
	at org.junit.Assert.fail(Assert.java:93)
	at org.junit.Assert.failNotEquals(Assert.java:647)
	at org.junit.Assert.assertEquals(Assert.java:128)
	at org.junit.Assert.assertEquals(Assert.java:472)
	at org.junit.Assert.assertEquals(Assert.java:456)
	at com.carrotsearch.randomizedtesting.contracts.TestAssumptionsAtClassLevel.checkOrder(TestAssumptionsAtClassLevel.java:84)
Collapse Failed TestAssumptionsAtClassLevel checkOrder History
JDK 1.7 < 1 sec
java.lang.AssertionError: expected:<1> but was:<0>
	at org.junit.Assert.fail(Assert.java:93)
	at org.junit.Assert.failNotEquals(Assert.java:647)
	at org.junit.Assert.assertEquals(Assert.java:128)
	at org.junit.Assert.assertEquals(Assert.java:472)
	at org.junit.Assert.assertEquals(Assert.java:456)
	at com.carrotsearch.randomizedtesting.contracts.TestAssumptionsAtClassLevel.checkOrder(TestAssumptionsAtClassLevel.java:84)
Collapse Failed TestAssumptionsAtClassLevel checkOrder History
JDK 1.8 < 1 sec
java.lang.AssertionError: expected:<1> but was:<0>
	at org.junit.Assert.fail(Assert.java:93)
	at org.junit.Assert.failNotEquals(Assert.java:647)
	at org.junit.Assert.assertEquals(Assert.java:128)
	at org.junit.Assert.assertEquals(Assert.java:472)
	at org.junit.Assert.assertEquals(Assert.java:456)
	at com.carrotsearch.randomizedtesting.contracts.TestAssumptionsAtClassLevel.checkOrder(TestAssumptionsAtClassLevel.java:84)
Collapse Failed TestAssumptionsAtClassLevel checkOrder History
JDK 9 < 1 sec
java.lang.AssertionError: expected:<1> but was:<0>
	at org.junit.Assert.fail(Assert.java:93)
	at org.junit.Assert.failNotEquals(Assert.java:647)
	at org.junit.Assert.assertEquals(Assert.java:128)
	at org.junit.Assert.assertEquals(Assert.java:472)
	at org.junit.Assert.assertEquals(Assert.java:456)
	at com.carrotsearch.randomizedtesting.contracts.TestAssumptionsAtClassLevel.checkOrder(TestAssumptionsAtClassLevel.java:84)
Collapse Failed TestBeforeAfterMethodOrder checkOrder History
JDK 11 J9 < 1 sec
java.lang.AssertionError: JUnit4 and RandomizedRunner differed.
	at org.junit.Assert.fail(Assert.java:93)
	at com.carrotsearch.randomizedtesting.contracts.TestBeforeAfterMethodOrder.checkOrder(TestBeforeAfterMethodOrder.java:224)
Collapse Failed TestBeforeAfterMethodOrder checkOrder History
JDK 1.7 < 1 sec
java.lang.AssertionError: JUnit4 and RandomizedRunner differed.
	at org.junit.Assert.fail(Assert.java:93)
	at com.carrotsearch.randomizedtesting.contracts.TestBeforeAfterMethodOrder.checkOrder(TestBeforeAfterMethodOrder.java:224)
Collapse Failed TestBeforeAfterMethodOrder checkOrder History
JDK 1.8 < 1 sec
java.lang.AssertionError: JUnit4 and RandomizedRunner differed.
	at org.junit.Assert.fail(Assert.java:93)
	at com.carrotsearch.randomizedtesting.contracts.TestBeforeAfterMethodOrder.checkOrder(TestBeforeAfterMethodOrder.java:224)
Collapse Failed TestBeforeAfterMethodOrder checkOrder History
JDK 9 < 1 sec
java.lang.AssertionError: JUnit4 and RandomizedRunner differed.
	at org.junit.Assert.fail(Assert.java:93)
	at com.carrotsearch.randomizedtesting.contracts.TestBeforeAfterMethodOrder.checkOrder(TestBeforeAfterMethodOrder.java:224)
Collapse Failed TestClassRules checkOldMethodRules History
JDK 11 J9 < 1 sec
java.lang.AssertionError: expected:<[rule-before, before-class, passing, after-class, rule-after]> but was:<[]>
	at org.junit.Assert.fail(Assert.java:93)
	at org.junit.Assert.failNotEquals(Assert.java:647)
	at org.junit.Assert.assertEquals(Assert.java:128)
	at org.junit.Assert.assertEquals(Assert.java:147)
	at com.carrotsearch.randomizedtesting.contracts.TestClassRules.assertSameExecution(TestClassRules.java:73)
	at com.carrotsearch.randomizedtesting.contracts.TestClassRules.checkOldMethodRules(TestClassRules.java:60)
Collapse Failed TestClassRules checkOldMethodRules History
JDK 1.7 < 1 sec
java.lang.AssertionError: expected:<[rule-before, before-class, passing, after-class, rule-after]> but was:<[]>
	at org.junit.Assert.fail(Assert.java:93)
	at org.junit.Assert.failNotEquals(Assert.java:647)
	at org.junit.Assert.assertEquals(Assert.java:128)
	at org.junit.Assert.assertEquals(Assert.java:147)
	at com.carrotsearch.randomizedtesting.contracts.TestClassRules.assertSameExecution(TestClassRules.java:73)
	at com.carrotsearch.randomizedtesting.contracts.TestClassRules.checkOldMethodRules(TestClassRules.java:60)
Collapse Failed TestClassRules checkOldMethodRules History
JDK 1.8 < 1 sec
java.lang.AssertionError: expected:<[rule-before, before-class, passing, after-class, rule-after]> but was:<[]>
	at org.junit.Assert.fail(Assert.java:93)
	at org.junit.Assert.failNotEquals(Assert.java:647)
	at org.junit.Assert.assertEquals(Assert.java:128)
	at org.junit.Assert.assertEquals(Assert.java:147)
	at com.carrotsearch.randomizedtesting.contracts.TestClassRules.assertSameExecution(TestClassRules.java:73)
	at com.carrotsearch.randomizedtesting.contracts.TestClassRules.checkOldMethodRules(TestClassRules.java:60)
Collapse Failed TestClassRules checkOldMethodRules History
JDK 9 < 1 sec
java.lang.AssertionError: expected:<[rule-before, before-class, passing, after-class, rule-after]> but was:<[]>
	at org.junit.Assert.fail(Assert.java:93)
	at org.junit.Assert.failNotEquals(Assert.java:647)
	at org.junit.Assert.assertEquals(Assert.java:128)
	at org.junit.Assert.assertEquals(Assert.java:147)
	at com.carrotsearch.randomizedtesting.contracts.TestClassRules.assertSameExecution(TestClassRules.java:73)
	at com.carrotsearch.randomizedtesting.contracts.TestClassRules.checkOldMethodRules(TestClassRules.java:60)
Collapse Failed TestNoClassHooksShadowingRule testShadowingWithAnnotation History
JDK 11 J9 < 1 sec
java.lang.AssertionError: 
Expecting actual not to be empty
	at com.carrotsearch.randomizedtesting.rules.TestNoClassHooksShadowingRule.testShadowingWithAnnotation(TestNoClassHooksShadowingRule.java:71)
Collapse Failed TestNoClassHooksShadowingRule testShadowingNoAnnotation History
JDK 11 J9 < 1 sec
java.lang.AssertionError: 
Expecting actual not to be empty
	at com.carrotsearch.randomizedtesting.rules.TestNoClassHooksShadowingRule.testShadowingNoAnnotation(TestNoClassHooksShadowingRule.java:63)
Collapse Failed TestNoClassHooksShadowingRule testShadowingNoAnnotation History
JDK 1.7 < 1 sec
java.lang.AssertionError: 
Expecting actual not to be empty
	at com.carrotsearch.randomizedtesting.rules.TestNoClassHooksShadowingRule.testShadowingNoAnnotation(TestNoClassHooksShadowingRule.java:63)
Collapse Failed TestNoClassHooksShadowingRule testShadowingWithAnnotation History
JDK 1.7 < 1 sec
java.lang.AssertionError: 
Expecting actual not to be empty
	at com.carrotsearch.randomizedtesting.rules.TestNoClassHooksShadowingRule.testShadowingWithAnnotation(TestNoClassHooksShadowingRule.java:71)
Collapse Failed TestNoClassHooksShadowingRule testShadowingNoAnnotation History
JDK 1.8 < 1 sec
java.lang.AssertionError: 
Expecting actual not to be empty
	at com.carrotsearch.randomizedtesting.rules.TestNoClassHooksShadowingRule.testShadowingNoAnnotation(TestNoClassHooksShadowingRule.java:63)
Collapse Failed TestNoClassHooksShadowingRule testShadowingWithAnnotation History
JDK 1.8 < 1 sec
java.lang.AssertionError: 
Expecting actual not to be empty
	at com.carrotsearch.randomizedtesting.rules.TestNoClassHooksShadowingRule.testShadowingWithAnnotation(TestNoClassHooksShadowingRule.java:71)
Collapse Failed TestNoClassHooksShadowingRule testShadowingWithAnnotation History
JDK 9 < 1 sec
java.lang.AssertionError: 
Expecting actual not to be empty
	at com.carrotsearch.randomizedtesting.rules.TestNoClassHooksShadowingRule.testShadowingWithAnnotation(TestNoClassHooksShadowingRule.java:71)
Collapse Failed TestNoClassHooksShadowingRule testShadowingNoAnnotation History
JDK 9 < 1 sec
java.lang.AssertionError: 
Expecting actual not to be empty
	at com.carrotsearch.randomizedtesting.rules.TestNoClassHooksShadowingRule.testShadowingNoAnnotation(TestNoClassHooksShadowingRule.java:63)
Collapse Failed TestNoInstanceHooksOverridesRule testOverrideNoAnnotation History
JDK 11 J9 < 1 sec
java.lang.AssertionError: 
Expecting actual not to be empty
	at com.carrotsearch.randomizedtesting.rules.TestNoInstanceHooksOverridesRule.testOverrideNoAnnotation(TestNoInstanceHooksOverridesRule.java:79)
Collapse Failed TestNoInstanceHooksOverridesRule testOverrideWithAnnotation History
JDK 11 J9 < 1 sec
java.lang.AssertionError: 
Expecting actual not to be empty
	at com.carrotsearch.randomizedtesting.rules.TestNoInstanceHooksOverridesRule.testOverrideWithAnnotation(TestNoInstanceHooksOverridesRule.java:87)
Collapse Failed TestNoInstanceHooksOverridesRule testOverrideWithAnnotation History
JDK 1.7 < 1 sec
java.lang.AssertionError: 
Expecting actual not to be empty
	at com.carrotsearch.randomizedtesting.rules.TestNoInstanceHooksOverridesRule.testOverrideWithAnnotation(TestNoInstanceHooksOverridesRule.java:87)
Collapse Failed TestNoInstanceHooksOverridesRule testOverrideNoAnnotation History
JDK 1.7 < 1 sec
java.lang.AssertionError: 
Expecting actual not to be empty
	at com.carrotsearch.randomizedtesting.rules.TestNoInstanceHooksOverridesRule.testOverrideNoAnnotation(TestNoInstanceHooksOverridesRule.java:79)
Collapse Failed TestNoInstanceHooksOverridesRule testOverrideWithAnnotation History
JDK 1.8 < 1 sec
java.lang.AssertionError: 
Expecting actual not to be empty
	at com.carrotsearch.randomizedtesting.rules.TestNoInstanceHooksOverridesRule.testOverrideWithAnnotation(TestNoInstanceHooksOverridesRule.java:87)
Collapse Failed TestNoInstanceHooksOverridesRule testOverrideNoAnnotation History
JDK 1.8 < 1 sec
java.lang.AssertionError: 
Expecting actual not to be empty
	at com.carrotsearch.randomizedtesting.rules.TestNoInstanceHooksOverridesRule.testOverrideNoAnnotation(TestNoInstanceHooksOverridesRule.java:79)
Collapse Failed TestNoInstanceHooksOverridesRule testOverrideNoAnnotation History
JDK 9 < 1 sec
java.lang.AssertionError: 
Expecting actual not to be empty
	at com.carrotsearch.randomizedtesting.rules.TestNoInstanceHooksOverridesRule.testOverrideNoAnnotation(TestNoInstanceHooksOverridesRule.java:79)
Collapse Failed TestNoInstanceHooksOverridesRule testOverrideWithAnnotation History
JDK 9 < 1 sec
java.lang.AssertionError: 
Expecting actual not to be empty
	at com.carrotsearch.randomizedtesting.rules.TestNoInstanceHooksOverridesRule.testOverrideWithAnnotation(TestNoInstanceHooksOverridesRule.java:87)
Collapse Failed TestStaticFieldsInvariantRule testFailingAboveThreshold History
JDK 11 J9 < 1 sec
java.lang.AssertionError: 
Expected size:<1> but was:<0> in:
<[]>
	at com.carrotsearch.randomizedtesting.rules.TestStaticFieldsInvariantRule.testFailingAboveThreshold(TestStaticFieldsInvariantRule.java:100)
Collapse Failed TestStaticFieldsInvariantRule testFailingAboveThreshold History
JDK 1.7 < 1 sec
java.lang.AssertionError: 
Expected size:<1> but was:<0> in:
<[]>
	at com.carrotsearch.randomizedtesting.rules.TestStaticFieldsInvariantRule.testFailingAboveThreshold(TestStaticFieldsInvariantRule.java:100)
Collapse Failed TestStaticFieldsInvariantRule testFailingAboveThreshold History
JDK 1.8 < 1 sec
java.lang.AssertionError: 
Expected size:<1> but was:<0> in:
<[]>
	at com.carrotsearch.randomizedtesting.rules.TestStaticFieldsInvariantRule.testFailingAboveThreshold(TestStaticFieldsInvariantRule.java:100)
Collapse Failed TestStaticFieldsInvariantRule testFailingAboveThreshold History
JDK 9 < 1 sec
java.lang.AssertionError: 
Expected size:<1> but was:<0> in:
<[]>
	at com.carrotsearch.randomizedtesting.rules.TestStaticFieldsInvariantRule.testFailingAboveThreshold(TestStaticFieldsInvariantRule.java:100)
Collapse Failed TestClassMethodFiltering testMethodFilter History
JDK 11 J9 < 1 sec
java.lang.AssertionError: expected:<[beforeClass1, method1, beforeClass2, method1]> but was:<[]>
	at org.junit.Assert.fail(Assert.java:93)
	at org.junit.Assert.failNotEquals(Assert.java:647)
	at org.junit.Assert.assertEquals(Assert.java:128)
	at org.junit.Assert.assertEquals(Assert.java:147)
	at com.carrotsearch.randomizedtesting.TestClassMethodFiltering.testMethodFilter(TestClassMethodFiltering.java:87)
Collapse Failed TestClassMethodFiltering testClassMethodFilter History
JDK 11 J9 < 1 sec
java.lang.AssertionError: expected:<[beforeClass1, method2]> but was:<[]>
	at org.junit.Assert.fail(Assert.java:93)
	at org.junit.Assert.failNotEquals(Assert.java:647)
	at org.junit.Assert.assertEquals(Assert.java:128)
	at org.junit.Assert.assertEquals(Assert.java:147)
	at com.carrotsearch.randomizedtesting.TestClassMethodFiltering.testClassMethodFilter(TestClassMethodFiltering.java:77)
Collapse Failed TestClassMethodFiltering testGlobMethodName History
JDK 11 J9 < 1 sec
java.lang.AssertionError: expected:<[beforeClass1, method1, beforeClass2, method1]> but was:<[]>
	at org.junit.Assert.fail(Assert.java:93)
	at org.junit.Assert.failNotEquals(Assert.java:647)
	at org.junit.Assert.assertEquals(Assert.java:128)
	at org.junit.Assert.assertEquals(Assert.java:147)
	at com.carrotsearch.randomizedtesting.TestClassMethodFiltering.testGlobMethodName(TestClassMethodFiltering.java:109)
Collapse Failed TestClassMethodFiltering testClassFilter History
JDK 11 J9 < 1 sec
java.lang.AssertionError: null
	at org.junit.Assert.fail(Assert.java:92)
	at org.junit.Assert.assertTrue(Assert.java:43)
	at org.junit.Assert.assertTrue(Assert.java:54)
	at com.carrotsearch.randomizedtesting.TestClassMethodFiltering.testClassFilter(TestClassMethodFiltering.java:64)
Collapse Failed TestClassMethodFiltering testGlobClassName History
JDK 11 J9 < 1 sec
java.lang.AssertionError: null
	at org.junit.Assert.fail(Assert.java:92)
	at org.junit.Assert.assertTrue(Assert.java:43)
	at org.junit.Assert.assertTrue(Assert.java:54)
	at com.carrotsearch.randomizedtesting.TestClassMethodFiltering.testGlobClassName(TestClassMethodFiltering.java:97)
Collapse Failed TestClassMethodFiltering testGlobMethodName History
JDK 1.7 < 1 sec
java.lang.AssertionError: expected:<[beforeClass1, method1, beforeClass2, method1]> but was:<[]>
	at org.junit.Assert.fail(Assert.java:93)
	at org.junit.Assert.failNotEquals(Assert.java:647)
	at org.junit.Assert.assertEquals(Assert.java:128)
	at org.junit.Assert.assertEquals(Assert.java:147)
	at com.carrotsearch.randomizedtesting.TestClassMethodFiltering.testGlobMethodName(TestClassMethodFiltering.java:109)
Collapse Failed TestClassMethodFiltering testClassFilter History
JDK 1.7 < 1 sec
java.lang.AssertionError: null
	at org.junit.Assert.fail(Assert.java:92)
	at org.junit.Assert.assertTrue(Assert.java:43)
	at org.junit.Assert.assertTrue(Assert.java:54)
	at com.carrotsearch.randomizedtesting.TestClassMethodFiltering.testClassFilter(TestClassMethodFiltering.java:64)
Collapse Failed TestClassMethodFiltering testGlobClassName History
JDK 1.7 < 1 sec
java.lang.AssertionError: null
	at org.junit.Assert.fail(Assert.java:92)
	at org.junit.Assert.assertTrue(Assert.java:43)
	at org.junit.Assert.assertTrue(Assert.java:54)
	at com.carrotsearch.randomizedtesting.TestClassMethodFiltering.testGlobClassName(TestClassMethodFiltering.java:97)
Collapse Failed TestClassMethodFiltering testMethodFilter History
JDK 1.7 < 1 sec
java.lang.AssertionError: expected:<[beforeClass1, method1, beforeClass2, method1]> but was:<[]>
	at org.junit.Assert.fail(Assert.java:93)
	at org.junit.Assert.failNotEquals(Assert.java:647)
	at org.junit.Assert.assertEquals(Assert.java:128)
	at org.junit.Assert.assertEquals(Assert.java:147)
	at com.carrotsearch.randomizedtesting.TestClassMethodFiltering.testMethodFilter(TestClassMethodFiltering.java:87)
Collapse Failed TestClassMethodFiltering testClassMethodFilter History
JDK 1.7 < 1 sec
java.lang.AssertionError: expected:<[beforeClass1, method2]> but was:<[]>
	at org.junit.Assert.fail(Assert.java:93)
	at org.junit.Assert.failNotEquals(Assert.java:647)
	at org.junit.Assert.assertEquals(Assert.java:128)
	at org.junit.Assert.assertEquals(Assert.java:147)
	at com.carrotsearch.randomizedtesting.TestClassMethodFiltering.testClassMethodFilter(TestClassMethodFiltering.java:77)
Collapse Failed TestClassMethodFiltering testGlobMethodName History
JDK 1.8 < 1 sec
java.lang.AssertionError: expected:<[beforeClass1, method1, beforeClass2, method1]> but was:<[]>
	at org.junit.Assert.fail(Assert.java:93)
	at org.junit.Assert.failNotEquals(Assert.java:647)
	at org.junit.Assert.assertEquals(Assert.java:128)
	at org.junit.Assert.assertEquals(Assert.java:147)
	at com.carrotsearch.randomizedtesting.TestClassMethodFiltering.testGlobMethodName(TestClassMethodFiltering.java:109)
Collapse Failed TestClassMethodFiltering testMethodFilter History
JDK 1.8 < 1 sec
java.lang.AssertionError: expected:<[beforeClass1, method1, beforeClass2, method1]> but was:<[]>
	at org.junit.Assert.fail(Assert.java:93)
	at org.junit.Assert.failNotEquals(Assert.java:647)
	at org.junit.Assert.assertEquals(Assert.java:128)
	at org.junit.Assert.assertEquals(Assert.java:147)
	at com.carrotsearch.randomizedtesting.TestClassMethodFiltering.testMethodFilter(TestClassMethodFiltering.java:87)
Collapse Failed TestClassMethodFiltering testClassFilter History
JDK 1.8 < 1 sec
java.lang.AssertionError: null
	at org.junit.Assert.fail(Assert.java:92)
	at org.junit.Assert.assertTrue(Assert.java:43)
	at org.junit.Assert.assertTrue(Assert.java:54)
	at com.carrotsearch.randomizedtesting.TestClassMethodFiltering.testClassFilter(TestClassMethodFiltering.java:64)
Collapse Failed TestClassMethodFiltering testClassMethodFilter History
JDK 1.8 < 1 sec
java.lang.AssertionError: expected:<[beforeClass1, method2]> but was:<[]>
	at org.junit.Assert.fail(Assert.java:93)
	at org.junit.Assert.failNotEquals(Assert.java:647)
	at org.junit.Assert.assertEquals(Assert.java:128)
	at org.junit.Assert.assertEquals(Assert.java:147)
	at com.carrotsearch.randomizedtesting.TestClassMethodFiltering.testClassMethodFilter(TestClassMethodFiltering.java:77)
Collapse Failed TestClassMethodFiltering testGlobClassName History
JDK 1.8 < 1 sec
java.lang.AssertionError: null
	at org.junit.Assert.fail(Assert.java:92)
	at org.junit.Assert.assertTrue(Assert.java:43)
	at org.junit.Assert.assertTrue(Assert.java:54)
	at com.carrotsearch.randomizedtesting.TestClassMethodFiltering.testGlobClassName(TestClassMethodFiltering.java:97)
Collapse Failed TestClassMethodFiltering testGlobClassName History
JDK 9 < 1 sec
java.lang.AssertionError: null
	at org.junit.Assert.fail(Assert.java:92)
	at org.junit.Assert.assertTrue(Assert.java:43)
	at org.junit.Assert.assertTrue(Assert.java:54)
	at com.carrotsearch.randomizedtesting.TestClassMethodFiltering.testGlobClassName(TestClassMethodFiltering.java:97)
Collapse Failed TestClassMethodFiltering testClassMethodFilter History
JDK 9 < 1 sec
java.lang.AssertionError: expected:<[beforeClass1, method2]> but was:<[]>
	at org.junit.Assert.fail(Assert.java:93)
	at org.junit.Assert.failNotEquals(Assert.java:647)
	at org.junit.Assert.assertEquals(Assert.java:128)
	at org.junit.Assert.assertEquals(Assert.java:147)
	at com.carrotsearch.randomizedtesting.TestClassMethodFiltering.testClassMethodFilter(TestClassMethodFiltering.java:77)
Collapse Failed TestClassMethodFiltering testGlobMethodName History
JDK 9 < 1 sec
java.lang.AssertionError: expected:<[beforeClass1, method1, beforeClass2, method1]> but was:<[]>
	at org.junit.Assert.fail(Assert.java:93)
	at org.junit.Assert.failNotEquals(Assert.java:647)
	at org.junit.Assert.assertEquals(Assert.java:128)
	at org.junit.Assert.assertEquals(Assert.java:147)
	at com.carrotsearch.randomizedtesting.TestClassMethodFiltering.testGlobMethodName(TestClassMethodFiltering.java:109)
Collapse Failed TestClassMethodFiltering testClassFilter History
JDK 9 < 1 sec
java.lang.AssertionError: null
	at org.junit.Assert.fail(Assert.java:92)
	at org.junit.Assert.assertTrue(Assert.java:43)
	at org.junit.Assert.assertTrue(Assert.java:54)
	at com.carrotsearch.randomizedtesting.TestClassMethodFiltering.testClassFilter(TestClassMethodFiltering.java:64)
Collapse Failed TestClassMethodFiltering testMethodFilter History
JDK 9 < 1 sec
java.lang.AssertionError: expected:<[beforeClass1, method1, beforeClass2, method1]> but was:<[]>
	at org.junit.Assert.fail(Assert.java:93)
	at org.junit.Assert.failNotEquals(Assert.java:647)
	at org.junit.Assert.assertEquals(Assert.java:128)
	at org.junit.Assert.assertEquals(Assert.java:147)
	at com.carrotsearch.randomizedtesting.TestClassMethodFiltering.testMethodFilter(TestClassMethodFiltering.java:87)
Collapse Failed TestContextRandom testRandomSeed History
JDK 11 J9 < 1 sec
java.lang.AssertionError: null
	at org.junit.Assert.fail(Assert.java:92)
	at org.junit.Assert.assertTrue(Assert.java:43)
	at org.junit.Assert.assertFalse(Assert.java:68)
	at org.junit.Assert.assertFalse(Assert.java:79)
	at com.carrotsearch.randomizedtesting.TestContextRandom.testRandomSeed(TestContextRandom.java:87)
Collapse Failed TestContextRandom testRandomSeed History
JDK 1.7 < 1 sec
java.lang.AssertionError: null
	at org.junit.Assert.fail(Assert.java:92)
	at org.junit.Assert.assertTrue(Assert.java:43)
	at org.junit.Assert.assertFalse(Assert.java:68)
	at org.junit.Assert.assertFalse(Assert.java:79)
	at com.carrotsearch.randomizedtesting.TestContextRandom.testRandomSeed(TestContextRandom.java:87)
Collapse Failed TestContextRandom testRandomSeed History
JDK 1.8 < 1 sec
java.lang.AssertionError: null
	at org.junit.Assert.fail(Assert.java:92)
	at org.junit.Assert.assertTrue(Assert.java:43)
	at org.junit.Assert.assertFalse(Assert.java:68)
	at org.junit.Assert.assertFalse(Assert.java:79)
	at com.carrotsearch.randomizedtesting.TestContextRandom.testRandomSeed(TestContextRandom.java:87)
Collapse Failed TestContextRandom testRandomSeed History
JDK 9 < 1 sec
java.lang.AssertionError: null
	at org.junit.Assert.fail(Assert.java:92)
	at org.junit.Assert.assertTrue(Assert.java:43)
	at org.junit.Assert.assertFalse(Assert.java:68)
	at org.junit.Assert.assertFalse(Assert.java:79)
	at com.carrotsearch.randomizedtesting.TestContextRandom.testRandomSeed(TestContextRandom.java:87)
Collapse Failed TestCustomMethodProvider testJUnit4Valid History
JDK 11 J9 < 1 sec
java.lang.AssertionError: expected:<1> but was:<0>
	at org.junit.Assert.fail(Assert.java:93)
	at org.junit.Assert.failNotEquals(Assert.java:647)
	at org.junit.Assert.assertEquals(Assert.java:128)
	at org.junit.Assert.assertEquals(Assert.java:472)
	at org.junit.Assert.assertEquals(Assert.java:456)
	at com.carrotsearch.randomizedtesting.TestCustomMethodProvider.testJUnit4Valid(TestCustomMethodProvider.java:55)
Collapse Failed TestCustomMethodProvider testJUnit4Valid History
JDK 1.7 < 1 sec
java.lang.AssertionError: expected:<1> but was:<0>
	at org.junit.Assert.fail(Assert.java:93)
	at org.junit.Assert.failNotEquals(Assert.java:647)
	at org.junit.Assert.assertEquals(Assert.java:128)
	at org.junit.Assert.assertEquals(Assert.java:472)
	at org.junit.Assert.assertEquals(Assert.java:456)
	at com.carrotsearch.randomizedtesting.TestCustomMethodProvider.testJUnit4Valid(TestCustomMethodProvider.java:55)
Collapse Failed TestCustomMethodProvider testJUnit4Valid History
JDK 1.8 < 1 sec
java.lang.AssertionError: expected:<1> but was:<0>
	at org.junit.Assert.fail(Assert.java:93)
	at org.junit.Assert.failNotEquals(Assert.java:647)
	at org.junit.Assert.assertEquals(Assert.java:128)
	at org.junit.Assert.assertEquals(Assert.java:472)
	at org.junit.Assert.assertEquals(Assert.java:456)
	at com.carrotsearch.randomizedtesting.TestCustomMethodProvider.testJUnit4Valid(TestCustomMethodProvider.java:55)
Collapse Failed TestCustomMethodProvider testJUnit4Valid History
JDK 9 < 1 sec
java.lang.AssertionError: expected:<1> but was:<0>
	at org.junit.Assert.fail(Assert.java:93)
	at org.junit.Assert.failNotEquals(Assert.java:647)
	at org.junit.Assert.assertEquals(Assert.java:128)
	at org.junit.Assert.assertEquals(Assert.java:472)
	at org.junit.Assert.assertEquals(Assert.java:456)
	at com.carrotsearch.randomizedtesting.TestCustomMethodProvider.testJUnit4Valid(TestCustomMethodProvider.java:55)
Collapse Failed TestExpected testSameMethodRandomnessWithFixedRunner History
JDK 11 J9 < 1 sec
junit.framework.AssertionFailedError: expected:<2> but was:<0>
	at junit.framework.Assert.fail(Assert.java:50)
	at junit.framework.Assert.failNotEquals(Assert.java:287)
	at junit.framework.Assert.assertEquals(Assert.java:67)
	at junit.framework.Assert.assertEquals(Assert.java:199)
	at junit.framework.Assert.assertEquals(Assert.java:205)
	at com.carrotsearch.randomizedtesting.TestExpected.testSameMethodRandomnessWithFixedRunner(TestExpected.java:39)
Collapse Failed TestExpected testSuccessfulExceptedFailure History
JDK 11 J9 < 1 sec
junit.framework.AssertionFailedError: expected:<1> but was:<0>
	at junit.framework.Assert.fail(Assert.java:50)
	at junit.framework.Assert.failNotEquals(Assert.java:287)
	at junit.framework.Assert.assertEquals(Assert.java:67)
	at junit.framework.Assert.assertEquals(Assert.java:199)
	at junit.framework.Assert.assertEquals(Assert.java:205)
	at com.carrotsearch.randomizedtesting.TestExpected.testSuccessfulExceptedFailure(TestExpected.java:49)
Collapse Failed TestExpected testSameMethodRandomnessWithFixedRunner History
JDK 1.7 < 1 sec
junit.framework.AssertionFailedError: expected:<2> but was:<0>
	at junit.framework.Assert.fail(Assert.java:50)
	at junit.framework.Assert.failNotEquals(Assert.java:287)
	at junit.framework.Assert.assertEquals(Assert.java:67)
	at junit.framework.Assert.assertEquals(Assert.java:199)
	at junit.framework.Assert.assertEquals(Assert.java:205)
	at com.carrotsearch.randomizedtesting.TestExpected.testSameMethodRandomnessWithFixedRunner(TestExpected.java:39)
Collapse Failed TestExpected testSuccessfulExceptedFailure History
JDK 1.7 < 1 sec
junit.framework.AssertionFailedError: expected:<1> but was:<0>
	at junit.framework.Assert.fail(Assert.java:50)
	at junit.framework.Assert.failNotEquals(Assert.java:287)
	at junit.framework.Assert.assertEquals(Assert.java:67)
	at junit.framework.Assert.assertEquals(Assert.java:199)
	at junit.framework.Assert.assertEquals(Assert.java:205)
	at com.carrotsearch.randomizedtesting.TestExpected.testSuccessfulExceptedFailure(TestExpected.java:49)
Collapse Failed TestExpected testSameMethodRandomnessWithFixedRunner History
JDK 1.8 < 1 sec
junit.framework.AssertionFailedError: expected:<2> but was:<0>
	at junit.framework.Assert.fail(Assert.java:50)
	at junit.framework.Assert.failNotEquals(Assert.java:287)
	at junit.framework.Assert.assertEquals(Assert.java:67)
	at junit.framework.Assert.assertEquals(Assert.java:199)
	at junit.framework.Assert.assertEquals(Assert.java:205)
	at com.carrotsearch.randomizedtesting.TestExpected.testSameMethodRandomnessWithFixedRunner(TestExpected.java:39)
Collapse Failed TestExpected testSuccessfulExceptedFailure History
JDK 1.8 < 1 sec
junit.framework.AssertionFailedError: expected:<1> but was:<0>
	at junit.framework.Assert.fail(Assert.java:50)
	at junit.framework.Assert.failNotEquals(Assert.java:287)
	at junit.framework.Assert.assertEquals(Assert.java:67)
	at junit.framework.Assert.assertEquals(Assert.java:199)
	at junit.framework.Assert.assertEquals(Assert.java:205)
	at com.carrotsearch.randomizedtesting.TestExpected.testSuccessfulExceptedFailure(TestExpected.java:49)
Collapse Failed TestExpected testSameMethodRandomnessWithFixedRunner History
JDK 9 < 1 sec
junit.framework.AssertionFailedError: expected:<2> but was:<0>
	at junit.framework.Assert.fail(Assert.java:50)
	at junit.framework.Assert.failNotEquals(Assert.java:287)
	at junit.framework.Assert.assertEquals(Assert.java:67)
	at junit.framework.Assert.assertEquals(Assert.java:199)
	at junit.framework.Assert.assertEquals(Assert.java:205)
	at com.carrotsearch.randomizedtesting.TestExpected.testSameMethodRandomnessWithFixedRunner(TestExpected.java:39)
Collapse Failed TestExpected testSuccessfulExceptedFailure History
JDK 9 < 1 sec
junit.framework.AssertionFailedError: expected:<1> but was:<0>
	at junit.framework.Assert.fail(Assert.java:50)
	at junit.framework.Assert.failNotEquals(Assert.java:287)
	at junit.framework.Assert.assertEquals(Assert.java:67)
	at junit.framework.Assert.assertEquals(Assert.java:199)
	at junit.framework.Assert.assertEquals(Assert.java:205)
	at com.carrotsearch.randomizedtesting.TestExpected.testSuccessfulExceptedFailure(TestExpected.java:49)
Collapse Failed TestFailurePropagationCompatibility testRunEquals History
JDK 11 J9 < 1 sec
java.lang.AssertionError: null
	at org.junit.Assert.fail(Assert.java:92)
	at org.junit.Assert.fail(Assert.java:100)
	at com.carrotsearch.randomizedtesting.TestFailurePropagationCompatibility.testRunEquals(TestFailurePropagationCompatibility.java:125)
Collapse Failed TestFailurePropagationCompatibility testRunEquals History
JDK 1.7 < 1 sec
java.lang.AssertionError: null
	at org.junit.Assert.fail(Assert.java:92)
	at org.junit.Assert.fail(Assert.java:100)
	at com.carrotsearch.randomizedtesting.TestFailurePropagationCompatibility.testRunEquals(TestFailurePropagationCompatibility.java:125)
Collapse Failed TestFailurePropagationCompatibility testRunEquals History
JDK 1.8 < 1 sec
java.lang.AssertionError: null
	at org.junit.Assert.fail(Assert.java:92)
	at org.junit.Assert.fail(Assert.java:100)
	at com.carrotsearch.randomizedtesting.TestFailurePropagationCompatibility.testRunEquals(TestFailurePropagationCompatibility.java:125)
Collapse Failed TestFailurePropagationCompatibility testRunEquals History
JDK 9 < 1 sec
java.lang.AssertionError: null
	at org.junit.Assert.fail(Assert.java:92)
	at org.junit.Assert.fail(Assert.java:100)
	at com.carrotsearch.randomizedtesting.TestFailurePropagationCompatibility.testRunEquals(TestFailurePropagationCompatibility.java:125)
Collapse Failed TestFilteringWarnings testItersWithFixedSeed History
JDK 11 J9 < 1 sec
java.lang.AssertionError: null
	at org.junit.Assert.fail(Assert.java:92)
	at org.junit.Assert.assertTrue(Assert.java:43)
	at org.junit.Assert.assertTrue(Assert.java:54)
	at com.carrotsearch.randomizedtesting.TestFilteringWarnings.testItersWithFixedSeed(TestFilteringWarnings.java:92)
Collapse Failed TestFilteringWarnings testItersWithRandomSeed History
JDK 11 J9 < 1 sec
java.lang.AssertionError: null
	at org.junit.Assert.fail(Assert.java:92)
	at org.junit.Assert.assertTrue(Assert.java:43)
	at org.junit.Assert.assertTrue(Assert.java:54)
	at com.carrotsearch.randomizedtesting.TestFilteringWarnings.testItersWithRandomSeed(TestFilteringWarnings.java:77)
Collapse Failed TestFilteringWarnings testItersWithFixedMethodName History
JDK 11 J9 < 1 sec
java.lang.AssertionError: null
	at org.junit.Assert.fail(Assert.java:92)
	at org.junit.Assert.assertTrue(Assert.java:43)
	at org.junit.Assert.assertTrue(Assert.java:54)
	at com.carrotsearch.randomizedtesting.TestFilteringWarnings.testItersWithFixedMethodName(TestFilteringWarnings.java:106)
Collapse Failed TestFilteringWarnings testItersWithRandomSeed History
JDK 1.7 < 1 sec
java.lang.AssertionError: null
	at org.junit.Assert.fail(Assert.java:92)
	at org.junit.Assert.assertTrue(Assert.java:43)
	at org.junit.Assert.assertTrue(Assert.java:54)
	at com.carrotsearch.randomizedtesting.TestFilteringWarnings.testItersWithRandomSeed(TestFilteringWarnings.java:77)
Collapse Failed TestFilteringWarnings testItersWithFixedSeed History
JDK 1.7 < 1 sec
java.lang.AssertionError: null
	at org.junit.Assert.fail(Assert.java:92)
	at org.junit.Assert.assertTrue(Assert.java:43)
	at org.junit.Assert.assertTrue(Assert.java:54)
	at com.carrotsearch.randomizedtesting.TestFilteringWarnings.testItersWithFixedSeed(TestFilteringWarnings.java:92)
Collapse Failed TestFilteringWarnings testItersWithFixedMethodName History
JDK 1.7 < 1 sec
java.lang.AssertionError: null
	at org.junit.Assert.fail(Assert.java:92)
	at org.junit.Assert.assertTrue(Assert.java:43)
	at org.junit.Assert.assertTrue(Assert.java:54)
	at com.carrotsearch.randomizedtesting.TestFilteringWarnings.testItersWithFixedMethodName(TestFilteringWarnings.java:106)
Collapse Failed TestFilteringWarnings testItersWithFixedSeed History
JDK 1.8 < 1 sec
java.lang.AssertionError: null
	at org.junit.Assert.fail(Assert.java:92)
	at org.junit.Assert.assertTrue(Assert.java:43)
	at org.junit.Assert.assertTrue(Assert.java:54)
	at com.carrotsearch.randomizedtesting.TestFilteringWarnings.testItersWithFixedSeed(TestFilteringWarnings.java:92)
Collapse Failed TestFilteringWarnings testItersWithRandomSeed History
JDK 1.8 < 1 sec
java.lang.AssertionError: null
	at org.junit.Assert.fail(Assert.java:92)
	at org.junit.Assert.assertTrue(Assert.java:43)
	at org.junit.Assert.assertTrue(Assert.java:54)
	at com.carrotsearch.randomizedtesting.TestFilteringWarnings.testItersWithRandomSeed(TestFilteringWarnings.java:77)
Collapse Failed TestFilteringWarnings testItersWithFixedMethodName History
JDK 1.8 < 1 sec
java.lang.AssertionError: null
	at org.junit.Assert.fail(Assert.java:92)
	at org.junit.Assert.assertTrue(Assert.java:43)
	at org.junit.Assert.assertTrue(Assert.java:54)
	at com.carrotsearch.randomizedtesting.TestFilteringWarnings.testItersWithFixedMethodName(TestFilteringWarnings.java:106)
Collapse Failed TestFilteringWarnings testItersWithRandomSeed History
JDK 9 < 1 sec
java.lang.AssertionError: null
	at org.junit.Assert.fail(Assert.java:92)
	at org.junit.Assert.assertTrue(Assert.java:43)
	at org.junit.Assert.assertTrue(Assert.java:54)
	at com.carrotsearch.randomizedtesting.TestFilteringWarnings.testItersWithRandomSeed(TestFilteringWarnings.java:77)
Collapse Failed TestFilteringWarnings testItersWithFixedMethodName History
JDK 9 < 1 sec
java.lang.AssertionError: null
	at org.junit.Assert.fail(Assert.java:92)
	at org.junit.Assert.assertTrue(Assert.java:43)
	at org.junit.Assert.assertTrue(Assert.java:54)
	at com.carrotsearch.randomizedtesting.TestFilteringWarnings.testItersWithFixedMethodName(TestFilteringWarnings.java:106)
Collapse Failed TestFilteringWarnings testItersWithFixedSeed History
JDK 9 < 1 sec
java.lang.AssertionError: null
	at org.junit.Assert.fail(Assert.java:92)
	at org.junit.Assert.assertTrue(Assert.java:43)
	at org.junit.Assert.assertTrue(Assert.java:54)
	at com.carrotsearch.randomizedtesting.TestFilteringWarnings.testItersWithFixedSeed(TestFilteringWarnings.java:92)
Collapse Failed TestIgnoredRunCount checkIgnoredCount History
JDK 11 J9 < 1 sec
java.lang.AssertionError: expected:<1> but was:<0>
	at org.junit.Assert.fail(Assert.java:93)
	at org.junit.Assert.failNotEquals(Assert.java:647)
	at org.junit.Assert.assertEquals(Assert.java:128)
	at org.junit.Assert.assertEquals(Assert.java:472)
	at org.junit.Assert.assertEquals(Assert.java:456)
	at com.carrotsearch.randomizedtesting.TestIgnoredRunCount.assertSameExecution(TestIgnoredRunCount.java:27)
	at com.carrotsearch.randomizedtesting.TestIgnoredRunCount.checkIgnoredCount(TestIgnoredRunCount.java:18)
Collapse Failed TestIgnoredRunCount checkIgnoredCount History
JDK 1.7 < 1 sec
java.lang.AssertionError: expected:<1> but was:<0>
	at org.junit.Assert.fail(Assert.java:93)
	at org.junit.Assert.failNotEquals(Assert.java:647)
	at org.junit.Assert.assertEquals(Assert.java:128)
	at org.junit.Assert.assertEquals(Assert.java:472)
	at org.junit.Assert.assertEquals(Assert.java:456)
	at com.carrotsearch.randomizedtesting.TestIgnoredRunCount.assertSameExecution(TestIgnoredRunCount.java:27)
	at com.carrotsearch.randomizedtesting.TestIgnoredRunCount.checkIgnoredCount(TestIgnoredRunCount.java:18)
Collapse Failed TestIgnoredRunCount checkIgnoredCount History
JDK 1.8 < 1 sec
java.lang.AssertionError: expected:<1> but was:<0>
	at org.junit.Assert.fail(Assert.java:93)
	at org.junit.Assert.failNotEquals(Assert.java:647)
	at org.junit.Assert.assertEquals(Assert.java:128)
	at org.junit.Assert.assertEquals(Assert.java:472)
	at org.junit.Assert.assertEquals(Assert.java:456)
	at com.carrotsearch.randomizedtesting.TestIgnoredRunCount.assertSameExecution(TestIgnoredRunCount.java:27)
	at com.carrotsearch.randomizedtesting.TestIgnoredRunCount.checkIgnoredCount(TestIgnoredRunCount.java:18)
Collapse Failed TestIgnoredRunCount checkIgnoredCount History
JDK 9 < 1 sec
java.lang.AssertionError: expected:<1> but was:<0>
	at org.junit.Assert.fail(Assert.java:93)
	at org.junit.Assert.failNotEquals(Assert.java:647)
	at org.junit.Assert.assertEquals(Assert.java:128)
	at org.junit.Assert.assertEquals(Assert.java:472)
	at org.junit.Assert.assertEquals(Assert.java:456)
	at com.carrotsearch.randomizedtesting.TestIgnoredRunCount.assertSameExecution(TestIgnoredRunCount.java:27)
	at com.carrotsearch.randomizedtesting.TestIgnoredRunCount.checkIgnoredCount(TestIgnoredRunCount.java:18)
Collapse Failed TestJUnit3MethodProvider testJUnit3Valid History
JDK 11 J9 < 1 sec
java.lang.AssertionError: expected:<1> but was:<0>
	at org.junit.Assert.fail(Assert.java:93)
	at org.junit.Assert.failNotEquals(Assert.java:647)
	at org.junit.Assert.assertEquals(Assert.java:128)
	at org.junit.Assert.assertEquals(Assert.java:472)
	at org.junit.Assert.assertEquals(Assert.java:456)
	at com.carrotsearch.randomizedtesting.TestJUnit3MethodProvider.testJUnit3Valid(TestJUnit3MethodProvider.java:39)
Collapse Failed TestJUnit3MethodProvider testJUnit3Overrides History
JDK 11 J9 < 1 sec
java.lang.AssertionError: expected:<1> but was:<0>
	at org.junit.Assert.fail(Assert.java:93)
	at org.junit.Assert.failNotEquals(Assert.java:647)
	at org.junit.Assert.assertEquals(Assert.java:128)
	at org.junit.Assert.assertEquals(Assert.java:472)
	at org.junit.Assert.assertEquals(Assert.java:456)
	at com.carrotsearch.randomizedtesting.TestJUnit3MethodProvider.testJUnit3Overrides(TestJUnit3MethodProvider.java:69)
Collapse Failed TestJUnit3MethodProvider testJUnit3Overrides History
JDK 1.7 < 1 sec
java.lang.AssertionError: expected:<1> but was:<0>
	at org.junit.Assert.fail(Assert.java:93)
	at org.junit.Assert.failNotEquals(Assert.java:647)
	at org.junit.Assert.assertEquals(Assert.java:128)
	at org.junit.Assert.assertEquals(Assert.java:472)
	at org.junit.Assert.assertEquals(Assert.java:456)
	at com.carrotsearch.randomizedtesting.TestJUnit3MethodProvider.testJUnit3Overrides(TestJUnit3MethodProvider.java:69)
Collapse Failed TestJUnit3MethodProvider testJUnit3Valid History
JDK 1.7 < 1 sec
java.lang.AssertionError: expected:<1> but was:<0>
	at org.junit.Assert.fail(Assert.java:93)
	at org.junit.Assert.failNotEquals(Assert.java:647)
	at org.junit.Assert.assertEquals(Assert.java:128)
	at org.junit.Assert.assertEquals(Assert.java:472)
	at org.junit.Assert.assertEquals(Assert.java:456)
	at com.carrotsearch.randomizedtesting.TestJUnit3MethodProvider.testJUnit3Valid(TestJUnit3MethodProvider.java:39)
Collapse Failed TestJUnit3MethodProvider testJUnit3Overrides History
JDK 1.8 < 1 sec
java.lang.AssertionError: expected:<1> but was:<0>
	at org.junit.Assert.fail(Assert.java:93)
	at org.junit.Assert.failNotEquals(Assert.java:647)
	at org.junit.Assert.assertEquals(Assert.java:128)
	at org.junit.Assert.assertEquals(Assert.java:472)
	at org.junit.Assert.assertEquals(Assert.java:456)
	at com.carrotsearch.randomizedtesting.TestJUnit3MethodProvider.testJUnit3Overrides(TestJUnit3MethodProvider.java:69)
Collapse Failed TestJUnit3MethodProvider testJUnit3Valid History
JDK 1.8 < 1 sec
java.lang.AssertionError: expected:<1> but was:<0>
	at org.junit.Assert.fail(Assert.java:93)
	at org.junit.Assert.failNotEquals(Assert.java:647)
	at org.junit.Assert.assertEquals(Assert.java:128)
	at org.junit.Assert.assertEquals(Assert.java:472)
	at org.junit.Assert.assertEquals(Assert.java:456)
	at com.carrotsearch.randomizedtesting.TestJUnit3MethodProvider.testJUnit3Valid(TestJUnit3MethodProvider.java:39)
Collapse Failed TestJUnit3MethodProvider testJUnit3Valid History
JDK 9 < 1 sec
java.lang.AssertionError: expected:<1> but was:<0>
	at org.junit.Assert.fail(Assert.java:93)
	at org.junit.Assert.failNotEquals(Assert.java:647)
	at org.junit.Assert.assertEquals(Assert.java:128)
	at org.junit.Assert.assertEquals(Assert.java:472)
	at org.junit.Assert.assertEquals(Assert.java:456)
	at com.carrotsearch.randomizedtesting.TestJUnit3MethodProvider.testJUnit3Valid(TestJUnit3MethodProvider.java:39)
Collapse Failed TestJUnit3MethodProvider testJUnit3Overrides History
JDK 9 < 1 sec
java.lang.AssertionError: expected:<1> but was:<0>
	at org.junit.Assert.fail(Assert.java:93)
	at org.junit.Assert.failNotEquals(Assert.java:647)
	at org.junit.Assert.assertEquals(Assert.java:128)
	at org.junit.Assert.assertEquals(Assert.java:472)
	at org.junit.Assert.assertEquals(Assert.java:456)
	at com.carrotsearch.randomizedtesting.TestJUnit3MethodProvider.testJUnit3Overrides(TestJUnit3MethodProvider.java:69)
Skipped tests 4
Status Test Failing since View job
Skipped TestContextRandom testFixedSeedSubthreads History
JDK 11 J9
Skipped TestContextRandom testFixedSeedSubthreads History
JDK 1.7
Skipped TestContextRandom testFixedSeedSubthreads History
JDK 1.8
Skipped TestContextRandom testFixedSeedSubthreads History
JDK 9