Build #98

Build: #98 failed Changes by Dawid Weiss

Stages & jobs

  1. Compile and test

  2. Package

Logs

The following logs have been generated by the jobs in this plan.
  • Expand all
  • Collapse all
Job Logs
Collapse JDK 1.7 Compile and test Download or View
04-Nov-2015 15:29:01 [INFO] RandomizedTesting JUnit4 Maven Plugin .............. SKIPPED
04-Nov-2015 15:29:01 [INFO] RandomizedTesting JUnit4 Maven Plugin Tests ........ SKIPPED
04-Nov-2015 15:29:01 [INFO] RandomizedTesting Examples ......................... SKIPPED
04-Nov-2015 15:29:01 [INFO] RandomizedTesting ANT Examples ..................... SKIPPED
04-Nov-2015 15:29:01 [INFO] RandomizedTesting Security Manager Example ......... SKIPPED
04-Nov-2015 15:29:01 [INFO] ------------------------------------------------------------------------
04-Nov-2015 15:29:01 [INFO] BUILD FAILURE
04-Nov-2015 15:29:01 [INFO] ------------------------------------------------------------------------
04-Nov-2015 15:29:01 [INFO] Total time: 7.868 s
04-Nov-2015 15:29:01 [INFO] Finished at: 2015-11-04T15:29:01+01:00
04-Nov-2015 15:29:01 [INFO] Final Memory: 16M/481M
04-Nov-2015 15:29:01 [INFO] ------------------------------------------------------------------------
04-Nov-2015 15:29:01 [ERROR] Failed to execute goal org.apache.maven.plugins:maven-surefire-plugin:2.18.1:test (default-test) on project randomizedtesting-runner: There are test failures.
04-Nov-2015 15:29:01 [ERROR]
04-Nov-2015 15:29:01 [ERROR] Please refer to /mnt/work/bamboo-home/xml-data/build-dir/RNDTEST-SOFTWARE-JDK17/randomized-runner/target/surefire-reports for the individual test results.
04-Nov-2015 15:29:01 [ERROR] -> [Help 1]
04-Nov-2015 15:29:01 [ERROR]
04-Nov-2015 15:29:01 [ERROR] To see the full stack trace of the errors, re-run Maven with the -e switch.
04-Nov-2015 15:29:01 [ERROR] Re-run Maven using the -X switch to enable full debug logging.
04-Nov-2015 15:29:01 [ERROR]
04-Nov-2015 15:29:01 [ERROR] For more information about the errors and possible solutions, please read the following articles:
04-Nov-2015 15:29:01 [ERROR] [Help 1] http://cwiki.apache.org/confluence/display/MAVEN/MojoFailureException
04-Nov-2015 15:29:01 [ERROR]
04-Nov-2015 15:29:01 [ERROR] After correcting the problems, you can resume the build with the command
04-Nov-2015 15:29:01 [ERROR]   mvn <goals> -rf :randomizedtesting-runner
Collapse JDK 1.8 Compile and test Download or View
04-Nov-2015 15:28:57 [INFO] RandomizedTesting JUnit4 Maven Plugin .............. SKIPPED
04-Nov-2015 15:28:57 [INFO] RandomizedTesting JUnit4 Maven Plugin Tests ........ SKIPPED
04-Nov-2015 15:28:57 [INFO] RandomizedTesting Examples ......................... SKIPPED
04-Nov-2015 15:28:57 [INFO] RandomizedTesting ANT Examples ..................... SKIPPED
04-Nov-2015 15:28:57 [INFO] RandomizedTesting Security Manager Example ......... SKIPPED
04-Nov-2015 15:28:57 [INFO] ------------------------------------------------------------------------
04-Nov-2015 15:28:57 [INFO] BUILD FAILURE
04-Nov-2015 15:28:57 [INFO] ------------------------------------------------------------------------
04-Nov-2015 15:28:57 [INFO] Total time: 7.918 s
04-Nov-2015 15:28:57 [INFO] Finished at: 2015-11-04T15:28:57+01:00
04-Nov-2015 15:28:57 [INFO] Final Memory: 19M/411M
04-Nov-2015 15:28:57 [INFO] ------------------------------------------------------------------------
04-Nov-2015 15:28:57 [ERROR] Failed to execute goal org.apache.maven.plugins:maven-surefire-plugin:2.18.1:test (default-test) on project randomizedtesting-runner: There are test failures.
04-Nov-2015 15:28:57 [ERROR]
04-Nov-2015 15:28:57 [ERROR] Please refer to /mnt/work/bamboo-home/xml-data/build-dir/RNDTEST-SOFTWARE-JDK18/randomized-runner/target/surefire-reports for the individual test results.
04-Nov-2015 15:28:57 [ERROR] -> [Help 1]
04-Nov-2015 15:28:57 [ERROR]
04-Nov-2015 15:28:57 [ERROR] To see the full stack trace of the errors, re-run Maven with the -e switch.
04-Nov-2015 15:28:57 [ERROR] Re-run Maven using the -X switch to enable full debug logging.
04-Nov-2015 15:28:57 [ERROR]
04-Nov-2015 15:28:57 [ERROR] For more information about the errors and possible solutions, please read the following articles:
04-Nov-2015 15:28:57 [ERROR] [Help 1] http://cwiki.apache.org/confluence/display/MAVEN/MojoFailureException
04-Nov-2015 15:28:57 [ERROR]
04-Nov-2015 15:28:57 [ERROR] After correcting the problems, you can resume the build with the command
04-Nov-2015 15:28:57 [ERROR]   mvn <goals> -rf :randomizedtesting-runner
Collapse JDK 11 J9 Compile and test Download or View
04-Nov-2015 15:29:00 [INFO] RandomizedTesting JUnit4 Maven Plugin .............. SKIPPED
04-Nov-2015 15:29:00 [INFO] RandomizedTesting JUnit4 Maven Plugin Tests ........ SKIPPED
04-Nov-2015 15:29:00 [INFO] RandomizedTesting Examples ......................... SKIPPED
04-Nov-2015 15:29:00 [INFO] RandomizedTesting ANT Examples ..................... SKIPPED
04-Nov-2015 15:29:00 [INFO] RandomizedTesting Security Manager Example ......... SKIPPED
04-Nov-2015 15:29:00 [INFO] ------------------------------------------------------------------------
04-Nov-2015 15:29:00 [INFO] BUILD FAILURE
04-Nov-2015 15:29:00 [INFO] ------------------------------------------------------------------------
04-Nov-2015 15:29:00 [INFO] Total time: 11.556 s
04-Nov-2015 15:29:00 [INFO] Finished at: 2015-11-04T15:29:00+01:00
04-Nov-2015 15:29:00 [INFO] Final Memory: 17M/38M
04-Nov-2015 15:29:00 [INFO] ------------------------------------------------------------------------
04-Nov-2015 15:29:00 [ERROR] Failed to execute goal org.apache.maven.plugins:maven-surefire-plugin:2.18.1:test (default-test) on project randomizedtesting-runner: There are test failures.
04-Nov-2015 15:29:00 [ERROR]
04-Nov-2015 15:29:00 [ERROR] Please refer to /mnt/work/bamboo-home/xml-data/build-dir/RNDTEST-SOFTWARE-IBM17/randomized-runner/target/surefire-reports for the individual test results.
04-Nov-2015 15:29:00 [ERROR] -> [Help 1]
04-Nov-2015 15:29:00 [ERROR]
04-Nov-2015 15:29:00 [ERROR] To see the full stack trace of the errors, re-run Maven with the -e switch.
04-Nov-2015 15:29:00 [ERROR] Re-run Maven using the -X switch to enable full debug logging.
04-Nov-2015 15:29:00 [ERROR]
04-Nov-2015 15:29:00 [ERROR] For more information about the errors and possible solutions, please read the following articles:
04-Nov-2015 15:29:00 [ERROR] [Help 1] http://cwiki.apache.org/confluence/display/MAVEN/MojoFailureException
04-Nov-2015 15:29:00 [ERROR]
04-Nov-2015 15:29:00 [ERROR] After correcting the problems, you can resume the build with the command
04-Nov-2015 15:29:00 [ERROR]   mvn <goals> -rf :randomizedtesting-runner
Collapse JDK 9 Compile and test Download or View
04-Nov-2015 15:28:59 [INFO] RandomizedTesting JUnit4 Maven Plugin .............. SKIPPED
04-Nov-2015 15:28:59 [INFO] RandomizedTesting JUnit4 Maven Plugin Tests ........ SKIPPED
04-Nov-2015 15:28:59 [INFO] RandomizedTesting Examples ......................... SKIPPED
04-Nov-2015 15:28:59 [INFO] RandomizedTesting ANT Examples ..................... SKIPPED
04-Nov-2015 15:28:59 [INFO] RandomizedTesting Security Manager Example ......... SKIPPED
04-Nov-2015 15:28:59 [INFO] ------------------------------------------------------------------------
04-Nov-2015 15:28:59 [INFO] BUILD FAILURE
04-Nov-2015 15:28:59 [INFO] ------------------------------------------------------------------------
04-Nov-2015 15:28:59 [INFO] Total time: 8.540 s
04-Nov-2015 15:28:59 [INFO] Finished at: 2015-11-04T15:28:59+01:00
04-Nov-2015 15:29:00 [INFO] Final Memory: 35M/486M
04-Nov-2015 15:29:00 [INFO] ------------------------------------------------------------------------
04-Nov-2015 15:29:00 [ERROR] Failed to execute goal org.apache.maven.plugins:maven-surefire-plugin:2.18.1:test (default-test) on project randomizedtesting-runner: There are test failures.
04-Nov-2015 15:29:00 [ERROR]
04-Nov-2015 15:29:00 [ERROR] Please refer to /mnt/work/bamboo-home/xml-data/build-dir/RNDTEST-SOFTWARE-JDK19/randomized-runner/target/surefire-reports for the individual test results.
04-Nov-2015 15:29:00 [ERROR] -> [Help 1]
04-Nov-2015 15:29:00 [ERROR]
04-Nov-2015 15:29:00 [ERROR] To see the full stack trace of the errors, re-run Maven with the -e switch.
04-Nov-2015 15:29:00 [ERROR] Re-run Maven using the -X switch to enable full debug logging.
04-Nov-2015 15:29:00 [ERROR]
04-Nov-2015 15:29:00 [ERROR] For more information about the errors and possible solutions, please read the following articles:
04-Nov-2015 15:29:00 [ERROR] [Help 1] http://cwiki.apache.org/confluence/display/MAVEN/MojoFailureException
04-Nov-2015 15:29:00 [ERROR]
04-Nov-2015 15:29:00 [ERROR] After correcting the problems, you can resume the build with the command
04-Nov-2015 15:29:00 [ERROR]   mvn <goals> -rf :randomizedtesting-runner