Build #84

Build: #84 failed Changes by Dawid Weiss

Stages & jobs

  1. Compile and test

  2. Package

Logs

The following logs have been generated by the jobs in this plan.
  • Expand all
  • Collapse all
Job Logs
Collapse JDK 11 J9 Compile and test Download or View
27-Oct-2015 13:44:52 [INFO] RandomizedTesting Parent POM ....................... SUCCESS [  0.203 s]
27-Oct-2015 13:44:52 [INFO] RandomizedTesting Randomized Runner ................ SUCCESS [ 46.968 s]
27-Oct-2015 13:44:52 [INFO] RandomizedTesting JUnit4 ANT Task .................. FAILURE [ 10.397 s]
27-Oct-2015 13:44:52 [INFO] RandomizedTesting JUnit4 Maven Plugin .............. SKIPPED
27-Oct-2015 13:44:52 [INFO] RandomizedTesting JUnit4 Maven Plugin Tests ........ SKIPPED
27-Oct-2015 13:44:52 [INFO] RandomizedTesting Examples ......................... SKIPPED
27-Oct-2015 13:44:52 [INFO] RandomizedTesting ANT Examples ..................... SKIPPED
27-Oct-2015 13:44:52 [INFO] RandomizedTesting Security Manager Example ......... SKIPPED
27-Oct-2015 13:44:52 [INFO] ------------------------------------------------------------------------
27-Oct-2015 13:44:52 [INFO] BUILD FAILURE
27-Oct-2015 13:44:52 [INFO] ------------------------------------------------------------------------
27-Oct-2015 13:44:52 [INFO] Total time: 57.987 s
27-Oct-2015 13:44:52 [INFO] Finished at: 2015-10-27T13:44:52+01:00
27-Oct-2015 13:44:52 [INFO] Final Memory: 30M/51M
27-Oct-2015 13:44:52 [INFO] ------------------------------------------------------------------------
27-Oct-2015 13:44:52 [ERROR] Failed to execute goal com.pyx4me:proguard-maven-plugin:2.0.4:proguard (default) on project junit4-ant: Obfuscation failed (result=1) -> [Help 1]
27-Oct-2015 13:44:52 [ERROR]
27-Oct-2015 13:44:52 [ERROR] To see the full stack trace of the errors, re-run Maven with the -e switch.
27-Oct-2015 13:44:52 [ERROR] Re-run Maven using the -X switch to enable full debug logging.
27-Oct-2015 13:44:52 [ERROR]
27-Oct-2015 13:44:52 [ERROR] For more information about the errors and possible solutions, please read the following articles:
27-Oct-2015 13:44:52 [ERROR] [Help 1] http://cwiki.apache.org/confluence/display/MAVEN/MojoExecutionException
27-Oct-2015 13:44:52 [ERROR]
27-Oct-2015 13:44:52 [ERROR] After correcting the problems, you can resume the build with the command
27-Oct-2015 13:44:52 [ERROR]   mvn <goals> -rf :junit4-ant