Build #228

Build: #228 failed Changes by Dawid Weiss

Stages & jobs

  1. Compile and test

  2. Package

Test results

  • 13,315 tests in total
  • 178 tests failed
  • 178 failures are new
  • 48 tests were quarantined / skipped
  • 7 minutes taken in total.
New test failures 178
Status Test View job Duration
Collapse Failed TestAltJavaVendors altVendors History
JDK 10 < 1 sec
org.apache.tools.ant.BuildException: java.io.FileNotFoundException: C:\Users\bamboo\AppData\Local\Temp\RNDTEST-SOFTWARE-RRJ10\surefire12705780684809620788\..%5C..%5C..%5C..%5C..%5C..%5C..%5Cbamboo%5Cxml-data%5Cbuild-dir%5CRNDTEST-SOFTWARE-RRJ10%5Cjunit4-ant%5Ctarget%5Ctest-classes\junit4.xml (The system cannot find the path specified)
Caused by: java.io.FileNotFoundException: C:\Users\bamboo\AppData\Local\Temp\RNDTEST-SOFTWARE-RRJ10\surefire12705780684809620788\..%5C..%5C..%5C..%5C..%5C..%5C..%5Cbamboo%5Cxml-data%5Cbuild-dir%5CRNDTEST-SOFTWARE-RRJ10%5Cjunit4-ant%5Ctarget%5Ctest-classes\junit4.xml (The system cannot find the path specified)
Collapse Failed TestAltJavaVendors altVendors History
JDK 11 < 1 sec
org.apache.tools.ant.BuildException: java.io.FileNotFoundException: C:\Users\bamboo\AppData\Local\Temp\RNDTEST-SOFTWARE-JDK11\surefire7650670692521780251\..%5C..%5C..%5C..%5C..%5C..%5C..%5Cbamboo%5Cxml-data%5Cbuild-dir%5CRNDTEST-SOFTWARE-JDK11%5Cjunit4-ant%5Ctarget%5Ctest-classes\junit4.xml (The system cannot find the path specified)
Caused by: java.io.FileNotFoundException: C:\Users\bamboo\AppData\Local\Temp\RNDTEST-SOFTWARE-JDK11\surefire7650670692521780251\..%5C..%5C..%5C..%5C..%5C..%5C..%5Cbamboo%5Cxml-data%5Cbuild-dir%5CRNDTEST-SOFTWARE-JDK11%5Cjunit4-ant%5Ctarget%5Ctest-classes\junit4.xml (The system cannot find the path specified)
Collapse Failed TestAntXmlReport antxml History
JDK 10 < 1 sec
org.apache.tools.ant.BuildException: java.io.FileNotFoundException: C:\Users\bamboo\AppData\Local\Temp\RNDTEST-SOFTWARE-RRJ10\surefire12705780684809620788\..%5C..%5C..%5C..%5C..%5C..%5C..%5Cbamboo%5Cxml-data%5Cbuild-dir%5CRNDTEST-SOFTWARE-RRJ10%5Cjunit4-ant%5Ctarget%5Ctest-classes\junit4.xml (The system cannot find the path specified)
Caused by: java.io.FileNotFoundException: C:\Users\bamboo\AppData\Local\Temp\RNDTEST-SOFTWARE-RRJ10\surefire12705780684809620788\..%5C..%5C..%5C..%5C..%5C..%5C..%5Cbamboo%5Cxml-data%5Cbuild-dir%5CRNDTEST-SOFTWARE-RRJ10%5Cjunit4-ant%5Ctarget%5Ctest-classes\junit4.xml (The system cannot find the path specified)
Collapse Failed TestAntXmlReport summary History
JDK 10 < 1 sec
org.apache.tools.ant.BuildException: java.io.FileNotFoundException: C:\Users\bamboo\AppData\Local\Temp\RNDTEST-SOFTWARE-RRJ10\surefire12705780684809620788\..%5C..%5C..%5C..%5C..%5C..%5C..%5Cbamboo%5Cxml-data%5Cbuild-dir%5CRNDTEST-SOFTWARE-RRJ10%5Cjunit4-ant%5Ctarget%5Ctest-classes\junit4.xml (The system cannot find the path specified)
Caused by: java.io.FileNotFoundException: C:\Users\bamboo\AppData\Local\Temp\RNDTEST-SOFTWARE-RRJ10\surefire12705780684809620788\..%5C..%5C..%5C..%5C..%5C..%5C..%5Cbamboo%5Cxml-data%5Cbuild-dir%5CRNDTEST-SOFTWARE-RRJ10%5Cjunit4-ant%5Ctarget%5Ctest-classes\junit4.xml (The system cannot find the path specified)
Collapse Failed TestAntXmlReport antxml History
JDK 11 < 1 sec
org.apache.tools.ant.BuildException: java.io.FileNotFoundException: C:\Users\bamboo\AppData\Local\Temp\RNDTEST-SOFTWARE-JDK11\surefire7650670692521780251\..%5C..%5C..%5C..%5C..%5C..%5C..%5Cbamboo%5Cxml-data%5Cbuild-dir%5CRNDTEST-SOFTWARE-JDK11%5Cjunit4-ant%5Ctarget%5Ctest-classes\junit4.xml (The system cannot find the path specified)
Caused by: java.io.FileNotFoundException: C:\Users\bamboo\AppData\Local\Temp\RNDTEST-SOFTWARE-JDK11\surefire7650670692521780251\..%5C..%5C..%5C..%5C..%5C..%5C..%5Cbamboo%5Cxml-data%5Cbuild-dir%5CRNDTEST-SOFTWARE-JDK11%5Cjunit4-ant%5Ctarget%5Ctest-classes\junit4.xml (The system cannot find the path specified)
Collapse Failed TestAntXmlReport summary History
JDK 11 < 1 sec
org.apache.tools.ant.BuildException: java.io.FileNotFoundException: C:\Users\bamboo\AppData\Local\Temp\RNDTEST-SOFTWARE-JDK11\surefire7650670692521780251\..%5C..%5C..%5C..%5C..%5C..%5C..%5Cbamboo%5Cxml-data%5Cbuild-dir%5CRNDTEST-SOFTWARE-JDK11%5Cjunit4-ant%5Ctarget%5Ctest-classes\junit4.xml (The system cannot find the path specified)
Caused by: java.io.FileNotFoundException: C:\Users\bamboo\AppData\Local\Temp\RNDTEST-SOFTWARE-JDK11\surefire7650670692521780251\..%5C..%5C..%5C..%5C..%5C..%5C..%5Cbamboo%5Cxml-data%5Cbuild-dir%5CRNDTEST-SOFTWARE-JDK11%5Cjunit4-ant%5Ctarget%5Ctest-classes\junit4.xml (The system cannot find the path specified)
Collapse Failed TestChildVmSysprops sysprops History
JDK 10 < 1 sec
org.apache.tools.ant.BuildException: java.io.FileNotFoundException: C:\Users\bamboo\AppData\Local\Temp\RNDTEST-SOFTWARE-RRJ10\surefire12705780684809620788\..%5C..%5C..%5C..%5C..%5C..%5C..%5Cbamboo%5Cxml-data%5Cbuild-dir%5CRNDTEST-SOFTWARE-RRJ10%5Cjunit4-ant%5Ctarget%5Ctest-classes\junit4.xml (The system cannot find the path specified)
Caused by: java.io.FileNotFoundException: C:\Users\bamboo\AppData\Local\Temp\RNDTEST-SOFTWARE-RRJ10\surefire12705780684809620788\..%5C..%5C..%5C..%5C..%5C..%5C..%5Cbamboo%5Cxml-data%5Cbuild-dir%5CRNDTEST-SOFTWARE-RRJ10%5Cjunit4-ant%5Ctarget%5Ctest-classes\junit4.xml (The system cannot find the path specified)
Collapse Failed TestChildVmSysprops sysprops History
JDK 11 < 1 sec
org.apache.tools.ant.BuildException: java.io.FileNotFoundException: C:\Users\bamboo\AppData\Local\Temp\RNDTEST-SOFTWARE-JDK11\surefire7650670692521780251\..%5C..%5C..%5C..%5C..%5C..%5C..%5Cbamboo%5Cxml-data%5Cbuild-dir%5CRNDTEST-SOFTWARE-JDK11%5Cjunit4-ant%5Ctarget%5Ctest-classes\junit4.xml (The system cannot find the path specified)
Caused by: java.io.FileNotFoundException: C:\Users\bamboo\AppData\Local\Temp\RNDTEST-SOFTWARE-JDK11\surefire7650670692521780251\..%5C..%5C..%5C..%5C..%5C..%5C..%5Cbamboo%5Cxml-data%5Cbuild-dir%5CRNDTEST-SOFTWARE-JDK11%5Cjunit4-ant%5Ctarget%5Ctest-classes\junit4.xml (The system cannot find the path specified)
Collapse Failed TestCrashesAndExceptions jvmcrash History
JDK 10 < 1 sec
org.apache.tools.ant.BuildException: java.io.FileNotFoundException: C:\Users\bamboo\AppData\Local\Temp\RNDTEST-SOFTWARE-RRJ10\surefire12705780684809620788\..%5C..%5C..%5C..%5C..%5C..%5C..%5Cbamboo%5Cxml-data%5Cbuild-dir%5CRNDTEST-SOFTWARE-RRJ10%5Cjunit4-ant%5Ctarget%5Ctest-classes\junit4.xml (The system cannot find the path specified)
Caused by: java.io.FileNotFoundException: C:\Users\bamboo\AppData\Local\Temp\RNDTEST-SOFTWARE-RRJ10\surefire12705780684809620788\..%5C..%5C..%5C..%5C..%5C..%5C..%5Cbamboo%5Cxml-data%5Cbuild-dir%5CRNDTEST-SOFTWARE-RRJ10%5Cjunit4-ant%5Ctarget%5Ctest-classes\junit4.xml (The system cannot find the path specified)
Collapse Failed TestCrashesAndExceptions slavehanging History
JDK 10 < 1 sec
org.apache.tools.ant.BuildException: java.io.FileNotFoundException: C:\Users\bamboo\AppData\Local\Temp\RNDTEST-SOFTWARE-RRJ10\surefire12705780684809620788\..%5C..%5C..%5C..%5C..%5C..%5C..%5Cbamboo%5Cxml-data%5Cbuild-dir%5CRNDTEST-SOFTWARE-RRJ10%5Cjunit4-ant%5Ctarget%5Ctest-classes\junit4.xml (The system cannot find the path specified)
Caused by: java.io.FileNotFoundException: C:\Users\bamboo\AppData\Local\Temp\RNDTEST-SOFTWARE-RRJ10\surefire12705780684809620788\..%5C..%5C..%5C..%5C..%5C..%5C..%5Cbamboo%5Cxml-data%5Cbuild-dir%5CRNDTEST-SOFTWARE-RRJ10%5Cjunit4-ant%5Ctarget%5Ctest-classes\junit4.xml (The system cannot find the path specified)
Collapse Failed TestCrashesAndExceptions slavehanging History
JDK 11 < 1 sec
org.apache.tools.ant.BuildException: java.io.FileNotFoundException: C:\Users\bamboo\AppData\Local\Temp\RNDTEST-SOFTWARE-JDK11\surefire7650670692521780251\..%5C..%5C..%5C..%5C..%5C..%5C..%5Cbamboo%5Cxml-data%5Cbuild-dir%5CRNDTEST-SOFTWARE-JDK11%5Cjunit4-ant%5Ctarget%5Ctest-classes\junit4.xml (The system cannot find the path specified)
Caused by: java.io.FileNotFoundException: C:\Users\bamboo\AppData\Local\Temp\RNDTEST-SOFTWARE-JDK11\surefire7650670692521780251\..%5C..%5C..%5C..%5C..%5C..%5C..%5Cbamboo%5Cxml-data%5Cbuild-dir%5CRNDTEST-SOFTWARE-JDK11%5Cjunit4-ant%5Ctarget%5Ctest-classes\junit4.xml (The system cannot find the path specified)
Collapse Failed TestCrashesAndExceptions jvmcrash History
JDK 11 < 1 sec
org.apache.tools.ant.BuildException: java.io.FileNotFoundException: C:\Users\bamboo\AppData\Local\Temp\RNDTEST-SOFTWARE-JDK11\surefire7650670692521780251\..%5C..%5C..%5C..%5C..%5C..%5C..%5Cbamboo%5Cxml-data%5Cbuild-dir%5CRNDTEST-SOFTWARE-JDK11%5Cjunit4-ant%5Ctarget%5Ctest-classes\junit4.xml (The system cannot find the path specified)
Caused by: java.io.FileNotFoundException: C:\Users\bamboo\AppData\Local\Temp\RNDTEST-SOFTWARE-JDK11\surefire7650670692521780251\..%5C..%5C..%5C..%5C..%5C..%5C..%5Cbamboo%5Cxml-data%5Cbuild-dir%5CRNDTEST-SOFTWARE-JDK11%5Cjunit4-ant%5Ctarget%5Ctest-classes\junit4.xml (The system cannot find the path specified)
Collapse Failed TestCwdConflict cwdconflict History
JDK 10 < 1 sec
org.apache.tools.ant.BuildException: java.io.FileNotFoundException: C:\Users\bamboo\AppData\Local\Temp\RNDTEST-SOFTWARE-RRJ10\surefire12705780684809620788\..%5C..%5C..%5C..%5C..%5C..%5C..%5Cbamboo%5Cxml-data%5Cbuild-dir%5CRNDTEST-SOFTWARE-RRJ10%5Cjunit4-ant%5Ctarget%5Ctest-classes\junit4.xml (The system cannot find the path specified)
Caused by: java.io.FileNotFoundException: C:\Users\bamboo\AppData\Local\Temp\RNDTEST-SOFTWARE-RRJ10\surefire12705780684809620788\..%5C..%5C..%5C..%5C..%5C..%5C..%5Cbamboo%5Cxml-data%5Cbuild-dir%5CRNDTEST-SOFTWARE-RRJ10%5Cjunit4-ant%5Ctarget%5Ctest-classes\junit4.xml (The system cannot find the path specified)
Collapse Failed TestCwdConflict cwdconflict History
JDK 11 < 1 sec
org.apache.tools.ant.BuildException: java.io.FileNotFoundException: C:\Users\bamboo\AppData\Local\Temp\RNDTEST-SOFTWARE-JDK11\surefire7650670692521780251\..%5C..%5C..%5C..%5C..%5C..%5C..%5Cbamboo%5Cxml-data%5Cbuild-dir%5CRNDTEST-SOFTWARE-JDK11%5Cjunit4-ant%5Ctarget%5Ctest-classes\junit4.xml (The system cannot find the path specified)
Caused by: java.io.FileNotFoundException: C:\Users\bamboo\AppData\Local\Temp\RNDTEST-SOFTWARE-JDK11\surefire7650670692521780251\..%5C..%5C..%5C..%5C..%5C..%5C..%5Cbamboo%5Cxml-data%5Cbuild-dir%5CRNDTEST-SOFTWARE-JDK11%5Cjunit4-ant%5Ctarget%5Ctest-classes\junit4.xml (The system cannot find the path specified)
Collapse Failed TestDuplicateResourceCollections duplicateResourceCollectionEntries History
JDK 10 < 1 sec
org.apache.tools.ant.BuildException: java.io.FileNotFoundException: C:\Users\bamboo\AppData\Local\Temp\RNDTEST-SOFTWARE-RRJ10\surefire12705780684809620788\..%5C..%5C..%5C..%5C..%5C..%5C..%5Cbamboo%5Cxml-data%5Cbuild-dir%5CRNDTEST-SOFTWARE-RRJ10%5Cjunit4-ant%5Ctarget%5Ctest-classes\junit4.xml (The system cannot find the path specified)
Caused by: java.io.FileNotFoundException: C:\Users\bamboo\AppData\Local\Temp\RNDTEST-SOFTWARE-RRJ10\surefire12705780684809620788\..%5C..%5C..%5C..%5C..%5C..%5C..%5Cbamboo%5Cxml-data%5Cbuild-dir%5CRNDTEST-SOFTWARE-RRJ10%5Cjunit4-ant%5Ctarget%5Ctest-classes\junit4.xml (The system cannot find the path specified)
Collapse Failed TestDuplicateResourceCollections duplicateResourceCollectionEntries History
JDK 11 < 1 sec
org.apache.tools.ant.BuildException: java.io.FileNotFoundException: C:\Users\bamboo\AppData\Local\Temp\RNDTEST-SOFTWARE-JDK11\surefire7650670692521780251\..%5C..%5C..%5C..%5C..%5C..%5C..%5Cbamboo%5Cxml-data%5Cbuild-dir%5CRNDTEST-SOFTWARE-JDK11%5Cjunit4-ant%5Ctarget%5Ctest-classes\junit4.xml (The system cannot find the path specified)
Caused by: java.io.FileNotFoundException: C:\Users\bamboo\AppData\Local\Temp\RNDTEST-SOFTWARE-JDK11\surefire7650670692521780251\..%5C..%5C..%5C..%5C..%5C..%5C..%5Cbamboo%5Cxml-data%5Cbuild-dir%5CRNDTEST-SOFTWARE-JDK11%5Cjunit4-ant%5Ctarget%5Ctest-classes\junit4.xml (The system cannot find the path specified)
Collapse Failed TestFileEncodings checkTypicalEncodings History
JDK 10 < 1 sec
org.apache.tools.ant.BuildException: java.io.FileNotFoundException: C:\Users\bamboo\AppData\Local\Temp\RNDTEST-SOFTWARE-RRJ10\surefire12705780684809620788\..%5C..%5C..%5C..%5C..%5C..%5C..%5Cbamboo%5Cxml-data%5Cbuild-dir%5CRNDTEST-SOFTWARE-RRJ10%5Cjunit4-ant%5Ctarget%5Ctest-classes\junit4.xml (The system cannot find the path specified)
Caused by: java.io.FileNotFoundException: C:\Users\bamboo\AppData\Local\Temp\RNDTEST-SOFTWARE-RRJ10\surefire12705780684809620788\..%5C..%5C..%5C..%5C..%5C..%5C..%5Cbamboo%5Cxml-data%5Cbuild-dir%5CRNDTEST-SOFTWARE-RRJ10%5Cjunit4-ant%5Ctarget%5Ctest-classes\junit4.xml (The system cannot find the path specified)
Collapse Failed TestFileEncodings checkTypicalEncodings History
JDK 11 < 1 sec
org.apache.tools.ant.BuildException: java.io.FileNotFoundException: C:\Users\bamboo\AppData\Local\Temp\RNDTEST-SOFTWARE-JDK11\surefire7650670692521780251\..%5C..%5C..%5C..%5C..%5C..%5C..%5Cbamboo%5Cxml-data%5Cbuild-dir%5CRNDTEST-SOFTWARE-JDK11%5Cjunit4-ant%5Ctarget%5Ctest-classes\junit4.xml (The system cannot find the path specified)
Caused by: java.io.FileNotFoundException: C:\Users\bamboo\AppData\Local\Temp\RNDTEST-SOFTWARE-JDK11\surefire7650670692521780251\..%5C..%5C..%5C..%5C..%5C..%5C..%5Cbamboo%5Cxml-data%5Cbuild-dir%5CRNDTEST-SOFTWARE-JDK11%5Cjunit4-ant%5Ctarget%5Ctest-classes\junit4.xml (The system cannot find the path specified)
Collapse Failed TestFiltering classfilter History
JDK 10 < 1 sec
org.apache.tools.ant.BuildException: java.io.FileNotFoundException: C:\Users\bamboo\AppData\Local\Temp\RNDTEST-SOFTWARE-RRJ10\surefire12705780684809620788\..%5C..%5C..%5C..%5C..%5C..%5C..%5Cbamboo%5Cxml-data%5Cbuild-dir%5CRNDTEST-SOFTWARE-RRJ10%5Cjunit4-ant%5Ctarget%5Ctest-classes\junit4.xml (The system cannot find the path specified)
Caused by: java.io.FileNotFoundException: C:\Users\bamboo\AppData\Local\Temp\RNDTEST-SOFTWARE-RRJ10\surefire12705780684809620788\..%5C..%5C..%5C..%5C..%5C..%5C..%5Cbamboo%5Cxml-data%5Cbuild-dir%5CRNDTEST-SOFTWARE-RRJ10%5Cjunit4-ant%5Ctarget%5Ctest-classes\junit4.xml (The system cannot find the path specified)
Collapse Failed TestFiltering methodfilter History
JDK 10 < 1 sec
org.apache.tools.ant.BuildException: java.io.FileNotFoundException: C:\Users\bamboo\AppData\Local\Temp\RNDTEST-SOFTWARE-RRJ10\surefire12705780684809620788\..%5C..%5C..%5C..%5C..%5C..%5C..%5Cbamboo%5Cxml-data%5Cbuild-dir%5CRNDTEST-SOFTWARE-RRJ10%5Cjunit4-ant%5Ctarget%5Ctest-classes\junit4.xml (The system cannot find the path specified)
Caused by: java.io.FileNotFoundException: C:\Users\bamboo\AppData\Local\Temp\RNDTEST-SOFTWARE-RRJ10\surefire12705780684809620788\..%5C..%5C..%5C..%5C..%5C..%5C..%5Cbamboo%5Cxml-data%5Cbuild-dir%5CRNDTEST-SOFTWARE-RRJ10%5Cjunit4-ant%5Ctarget%5Ctest-classes\junit4.xml (The system cannot find the path specified)
Collapse Failed TestFiltering filterexpression History
JDK 10 < 1 sec
org.apache.tools.ant.BuildException: java.io.FileNotFoundException: C:\Users\bamboo\AppData\Local\Temp\RNDTEST-SOFTWARE-RRJ10\surefire12705780684809620788\..%5C..%5C..%5C..%5C..%5C..%5C..%5Cbamboo%5Cxml-data%5Cbuild-dir%5CRNDTEST-SOFTWARE-RRJ10%5Cjunit4-ant%5Ctarget%5Ctest-classes\junit4.xml (The system cannot find the path specified)
Caused by: java.io.FileNotFoundException: C:\Users\bamboo\AppData\Local\Temp\RNDTEST-SOFTWARE-RRJ10\surefire12705780684809620788\..%5C..%5C..%5C..%5C..%5C..%5C..%5Cbamboo%5Cxml-data%5Cbuild-dir%5CRNDTEST-SOFTWARE-RRJ10%5Cjunit4-ant%5Ctarget%5Ctest-classes\junit4.xml (The system cannot find the path specified)
Collapse Failed TestFiltering classfilter History
JDK 11 < 1 sec
org.apache.tools.ant.BuildException: java.io.FileNotFoundException: C:\Users\bamboo\AppData\Local\Temp\RNDTEST-SOFTWARE-JDK11\surefire7650670692521780251\..%5C..%5C..%5C..%5C..%5C..%5C..%5Cbamboo%5Cxml-data%5Cbuild-dir%5CRNDTEST-SOFTWARE-JDK11%5Cjunit4-ant%5Ctarget%5Ctest-classes\junit4.xml (The system cannot find the path specified)
Caused by: java.io.FileNotFoundException: C:\Users\bamboo\AppData\Local\Temp\RNDTEST-SOFTWARE-JDK11\surefire7650670692521780251\..%5C..%5C..%5C..%5C..%5C..%5C..%5Cbamboo%5Cxml-data%5Cbuild-dir%5CRNDTEST-SOFTWARE-JDK11%5Cjunit4-ant%5Ctarget%5Ctest-classes\junit4.xml (The system cannot find the path specified)
Collapse Failed TestFiltering methodfilter History
JDK 11 < 1 sec
org.apache.tools.ant.BuildException: java.io.FileNotFoundException: C:\Users\bamboo\AppData\Local\Temp\RNDTEST-SOFTWARE-JDK11\surefire7650670692521780251\..%5C..%5C..%5C..%5C..%5C..%5C..%5Cbamboo%5Cxml-data%5Cbuild-dir%5CRNDTEST-SOFTWARE-JDK11%5Cjunit4-ant%5Ctarget%5Ctest-classes\junit4.xml (The system cannot find the path specified)
Caused by: java.io.FileNotFoundException: C:\Users\bamboo\AppData\Local\Temp\RNDTEST-SOFTWARE-JDK11\surefire7650670692521780251\..%5C..%5C..%5C..%5C..%5C..%5C..%5Cbamboo%5Cxml-data%5Cbuild-dir%5CRNDTEST-SOFTWARE-JDK11%5Cjunit4-ant%5Ctarget%5Ctest-classes\junit4.xml (The system cannot find the path specified)
Collapse Failed TestFiltering filterexpression History
JDK 11 < 1 sec
org.apache.tools.ant.BuildException: java.io.FileNotFoundException: C:\Users\bamboo\AppData\Local\Temp\RNDTEST-SOFTWARE-JDK11\surefire7650670692521780251\..%5C..%5C..%5C..%5C..%5C..%5C..%5Cbamboo%5Cxml-data%5Cbuild-dir%5CRNDTEST-SOFTWARE-JDK11%5Cjunit4-ant%5Ctarget%5Ctest-classes\junit4.xml (The system cannot find the path specified)
Caused by: java.io.FileNotFoundException: C:\Users\bamboo\AppData\Local\Temp\RNDTEST-SOFTWARE-JDK11\surefire7650670692521780251\..%5C..%5C..%5C..%5C..%5C..%5C..%5Cbamboo%5Cxml-data%5Cbuild-dir%5CRNDTEST-SOFTWARE-JDK11%5Cjunit4-ant%5Ctarget%5Ctest-classes\junit4.xml (The system cannot find the path specified)
Collapse Failed TestHeartbeat testHeartbeat History
JDK 10 < 1 sec
org.apache.tools.ant.BuildException: java.io.FileNotFoundException: C:\Users\bamboo\AppData\Local\Temp\RNDTEST-SOFTWARE-RRJ10\surefire12705780684809620788\..%5C..%5C..%5C..%5C..%5C..%5C..%5Cbamboo%5Cxml-data%5Cbuild-dir%5CRNDTEST-SOFTWARE-RRJ10%5Cjunit4-ant%5Ctarget%5Ctest-classes\junit4.xml (The system cannot find the path specified)
Caused by: java.io.FileNotFoundException: C:\Users\bamboo\AppData\Local\Temp\RNDTEST-SOFTWARE-RRJ10\surefire12705780684809620788\..%5C..%5C..%5C..%5C..%5C..%5C..%5Cbamboo%5Cxml-data%5Cbuild-dir%5CRNDTEST-SOFTWARE-RRJ10%5Cjunit4-ant%5Ctarget%5Ctest-classes\junit4.xml (The system cannot find the path specified)
Collapse Failed TestHeartbeat testHeartbeat History
JDK 11 < 1 sec
org.apache.tools.ant.BuildException: java.io.FileNotFoundException: C:\Users\bamboo\AppData\Local\Temp\RNDTEST-SOFTWARE-JDK11\surefire7650670692521780251\..%5C..%5C..%5C..%5C..%5C..%5C..%5Cbamboo%5Cxml-data%5Cbuild-dir%5CRNDTEST-SOFTWARE-JDK11%5Cjunit4-ant%5Ctarget%5Ctest-classes\junit4.xml (The system cannot find the path specified)
Caused by: java.io.FileNotFoundException: C:\Users\bamboo\AppData\Local\Temp\RNDTEST-SOFTWARE-JDK11\surefire7650670692521780251\..%5C..%5C..%5C..%5C..%5C..%5C..%5Cbamboo%5Cxml-data%5Cbuild-dir%5CRNDTEST-SOFTWARE-JDK11%5Cjunit4-ant%5Ctarget%5Ctest-classes\junit4.xml (The system cannot find the path specified)
Collapse Failed TestIfNoTestsOption oneError History
JDK 10 < 1 sec
org.apache.tools.ant.BuildException: java.io.FileNotFoundException: C:\Users\bamboo\AppData\Local\Temp\RNDTEST-SOFTWARE-RRJ10\surefire12705780684809620788\..%5C..%5C..%5C..%5C..%5C..%5C..%5Cbamboo%5Cxml-data%5Cbuild-dir%5CRNDTEST-SOFTWARE-RRJ10%5Cjunit4-ant%5Ctarget%5Ctest-classes\junit4.xml (The system cannot find the path specified)
Caused by: java.io.FileNotFoundException: C:\Users\bamboo\AppData\Local\Temp\RNDTEST-SOFTWARE-RRJ10\surefire12705780684809620788\..%5C..%5C..%5C..%5C..%5C..%5C..%5Cbamboo%5Cxml-data%5Cbuild-dir%5CRNDTEST-SOFTWARE-RRJ10%5Cjunit4-ant%5Ctarget%5Ctest-classes\junit4.xml (The system cannot find the path specified)
Collapse Failed TestIfNoTestsOption oneSuccessfull History
JDK 10 < 1 sec
org.apache.tools.ant.BuildException: java.io.FileNotFoundException: C:\Users\bamboo\AppData\Local\Temp\RNDTEST-SOFTWARE-RRJ10\surefire12705780684809620788\..%5C..%5C..%5C..%5C..%5C..%5C..%5Cbamboo%5Cxml-data%5Cbuild-dir%5CRNDTEST-SOFTWARE-RRJ10%5Cjunit4-ant%5Ctarget%5Ctest-classes\junit4.xml (The system cannot find the path specified)
Caused by: java.io.FileNotFoundException: C:\Users\bamboo\AppData\Local\Temp\RNDTEST-SOFTWARE-RRJ10\surefire12705780684809620788\..%5C..%5C..%5C..%5C..%5C..%5C..%5Cbamboo%5Cxml-data%5Cbuild-dir%5CRNDTEST-SOFTWARE-RRJ10%5Cjunit4-ant%5Ctarget%5Ctest-classes\junit4.xml (The system cannot find the path specified)
Collapse Failed TestIfNoTestsOption oneIgnored History
JDK 10 < 1 sec
org.apache.tools.ant.BuildException: java.io.FileNotFoundException: C:\Users\bamboo\AppData\Local\Temp\RNDTEST-SOFTWARE-RRJ10\surefire12705780684809620788\..%5C..%5C..%5C..%5C..%5C..%5C..%5Cbamboo%5Cxml-data%5Cbuild-dir%5CRNDTEST-SOFTWARE-RRJ10%5Cjunit4-ant%5Ctarget%5Ctest-classes\junit4.xml (The system cannot find the path specified)
Caused by: java.io.FileNotFoundException: C:\Users\bamboo\AppData\Local\Temp\RNDTEST-SOFTWARE-RRJ10\surefire12705780684809620788\..%5C..%5C..%5C..%5C..%5C..%5C..%5Cbamboo%5Cxml-data%5Cbuild-dir%5CRNDTEST-SOFTWARE-RRJ10%5Cjunit4-ant%5Ctarget%5Ctest-classes\junit4.xml (The system cannot find the path specified)
Collapse Failed TestIfNoTestsOption oneFailure History
JDK 10 < 1 sec
org.apache.tools.ant.BuildException: java.io.FileNotFoundException: C:\Users\bamboo\AppData\Local\Temp\RNDTEST-SOFTWARE-RRJ10\surefire12705780684809620788\..%5C..%5C..%5C..%5C..%5C..%5C..%5Cbamboo%5Cxml-data%5Cbuild-dir%5CRNDTEST-SOFTWARE-RRJ10%5Cjunit4-ant%5Ctarget%5Ctest-classes\junit4.xml (The system cannot find the path specified)
Caused by: java.io.FileNotFoundException: C:\Users\bamboo\AppData\Local\Temp\RNDTEST-SOFTWARE-RRJ10\surefire12705780684809620788\..%5C..%5C..%5C..%5C..%5C..%5C..%5Cbamboo%5Cxml-data%5Cbuild-dir%5CRNDTEST-SOFTWARE-RRJ10%5Cjunit4-ant%5Ctarget%5Ctest-classes\junit4.xml (The system cannot find the path specified)
Collapse Failed TestIfNoTestsOption oneAssumptionIgnored History
JDK 10 < 1 sec
org.apache.tools.ant.BuildException: java.io.FileNotFoundException: C:\Users\bamboo\AppData\Local\Temp\RNDTEST-SOFTWARE-RRJ10\surefire12705780684809620788\..%5C..%5C..%5C..%5C..%5C..%5C..%5Cbamboo%5Cxml-data%5Cbuild-dir%5CRNDTEST-SOFTWARE-RRJ10%5Cjunit4-ant%5Ctarget%5Ctest-classes\junit4.xml (The system cannot find the path specified)
Caused by: java.io.FileNotFoundException: C:\Users\bamboo\AppData\Local\Temp\RNDTEST-SOFTWARE-RRJ10\surefire12705780684809620788\..%5C..%5C..%5C..%5C..%5C..%5C..%5Cbamboo%5Cxml-data%5Cbuild-dir%5CRNDTEST-SOFTWARE-RRJ10%5Cjunit4-ant%5Ctarget%5Ctest-classes\junit4.xml (The system cannot find the path specified)
Collapse Failed TestIfNoTestsOption allFilteredOut History
JDK 10 < 1 sec
org.apache.tools.ant.BuildException: java.io.FileNotFoundException: C:\Users\bamboo\AppData\Local\Temp\RNDTEST-SOFTWARE-RRJ10\surefire12705780684809620788\..%5C..%5C..%5C..%5C..%5C..%5C..%5Cbamboo%5Cxml-data%5Cbuild-dir%5CRNDTEST-SOFTWARE-RRJ10%5Cjunit4-ant%5Ctarget%5Ctest-classes\junit4.xml (The system cannot find the path specified)
Caused by: java.io.FileNotFoundException: C:\Users\bamboo\AppData\Local\Temp\RNDTEST-SOFTWARE-RRJ10\surefire12705780684809620788\..%5C..%5C..%5C..%5C..%5C..%5C..%5Cbamboo%5Cxml-data%5Cbuild-dir%5CRNDTEST-SOFTWARE-RRJ10%5Cjunit4-ant%5Ctarget%5Ctest-classes\junit4.xml (The system cannot find the path specified)
Collapse Failed TestIfNoTestsOption oneError History
JDK 11 < 1 sec
org.apache.tools.ant.BuildException: java.io.FileNotFoundException: C:\Users\bamboo\AppData\Local\Temp\RNDTEST-SOFTWARE-JDK11\surefire7650670692521780251\..%5C..%5C..%5C..%5C..%5C..%5C..%5Cbamboo%5Cxml-data%5Cbuild-dir%5CRNDTEST-SOFTWARE-JDK11%5Cjunit4-ant%5Ctarget%5Ctest-classes\junit4.xml (The system cannot find the path specified)
Caused by: java.io.FileNotFoundException: C:\Users\bamboo\AppData\Local\Temp\RNDTEST-SOFTWARE-JDK11\surefire7650670692521780251\..%5C..%5C..%5C..%5C..%5C..%5C..%5Cbamboo%5Cxml-data%5Cbuild-dir%5CRNDTEST-SOFTWARE-JDK11%5Cjunit4-ant%5Ctarget%5Ctest-classes\junit4.xml (The system cannot find the path specified)
Collapse Failed TestIfNoTestsOption oneSuccessfull History
JDK 11 < 1 sec
org.apache.tools.ant.BuildException: java.io.FileNotFoundException: C:\Users\bamboo\AppData\Local\Temp\RNDTEST-SOFTWARE-JDK11\surefire7650670692521780251\..%5C..%5C..%5C..%5C..%5C..%5C..%5Cbamboo%5Cxml-data%5Cbuild-dir%5CRNDTEST-SOFTWARE-JDK11%5Cjunit4-ant%5Ctarget%5Ctest-classes\junit4.xml (The system cannot find the path specified)
Caused by: java.io.FileNotFoundException: C:\Users\bamboo\AppData\Local\Temp\RNDTEST-SOFTWARE-JDK11\surefire7650670692521780251\..%5C..%5C..%5C..%5C..%5C..%5C..%5Cbamboo%5Cxml-data%5Cbuild-dir%5CRNDTEST-SOFTWARE-JDK11%5Cjunit4-ant%5Ctarget%5Ctest-classes\junit4.xml (The system cannot find the path specified)
Collapse Failed TestIfNoTestsOption oneIgnored History
JDK 11 < 1 sec
org.apache.tools.ant.BuildException: java.io.FileNotFoundException: C:\Users\bamboo\AppData\Local\Temp\RNDTEST-SOFTWARE-JDK11\surefire7650670692521780251\..%5C..%5C..%5C..%5C..%5C..%5C..%5Cbamboo%5Cxml-data%5Cbuild-dir%5CRNDTEST-SOFTWARE-JDK11%5Cjunit4-ant%5Ctarget%5Ctest-classes\junit4.xml (The system cannot find the path specified)
Caused by: java.io.FileNotFoundException: C:\Users\bamboo\AppData\Local\Temp\RNDTEST-SOFTWARE-JDK11\surefire7650670692521780251\..%5C..%5C..%5C..%5C..%5C..%5C..%5Cbamboo%5Cxml-data%5Cbuild-dir%5CRNDTEST-SOFTWARE-JDK11%5Cjunit4-ant%5Ctarget%5Ctest-classes\junit4.xml (The system cannot find the path specified)
Collapse Failed TestIfNoTestsOption oneFailure History
JDK 11 < 1 sec
org.apache.tools.ant.BuildException: java.io.FileNotFoundException: C:\Users\bamboo\AppData\Local\Temp\RNDTEST-SOFTWARE-JDK11\surefire7650670692521780251\..%5C..%5C..%5C..%5C..%5C..%5C..%5Cbamboo%5Cxml-data%5Cbuild-dir%5CRNDTEST-SOFTWARE-JDK11%5Cjunit4-ant%5Ctarget%5Ctest-classes\junit4.xml (The system cannot find the path specified)
Caused by: java.io.FileNotFoundException: C:\Users\bamboo\AppData\Local\Temp\RNDTEST-SOFTWARE-JDK11\surefire7650670692521780251\..%5C..%5C..%5C..%5C..%5C..%5C..%5Cbamboo%5Cxml-data%5Cbuild-dir%5CRNDTEST-SOFTWARE-JDK11%5Cjunit4-ant%5Ctarget%5Ctest-classes\junit4.xml (The system cannot find the path specified)
Collapse Failed TestIfNoTestsOption oneAssumptionIgnored History
JDK 11 < 1 sec
org.apache.tools.ant.BuildException: java.io.FileNotFoundException: C:\Users\bamboo\AppData\Local\Temp\RNDTEST-SOFTWARE-JDK11\surefire7650670692521780251\..%5C..%5C..%5C..%5C..%5C..%5C..%5Cbamboo%5Cxml-data%5Cbuild-dir%5CRNDTEST-SOFTWARE-JDK11%5Cjunit4-ant%5Ctarget%5Ctest-classes\junit4.xml (The system cannot find the path specified)
Caused by: java.io.FileNotFoundException: C:\Users\bamboo\AppData\Local\Temp\RNDTEST-SOFTWARE-JDK11\surefire7650670692521780251\..%5C..%5C..%5C..%5C..%5C..%5C..%5Cbamboo%5Cxml-data%5Cbuild-dir%5CRNDTEST-SOFTWARE-JDK11%5Cjunit4-ant%5Ctarget%5Ctest-classes\junit4.xml (The system cannot find the path specified)
Collapse Failed TestIfNoTestsOption allFilteredOut History
JDK 11 < 1 sec
org.apache.tools.ant.BuildException: java.io.FileNotFoundException: C:\Users\bamboo\AppData\Local\Temp\RNDTEST-SOFTWARE-JDK11\surefire7650670692521780251\..%5C..%5C..%5C..%5C..%5C..%5C..%5Cbamboo%5Cxml-data%5Cbuild-dir%5CRNDTEST-SOFTWARE-JDK11%5Cjunit4-ant%5Ctarget%5Ctest-classes\junit4.xml (The system cannot find the path specified)
Caused by: java.io.FileNotFoundException: C:\Users\bamboo\AppData\Local\Temp\RNDTEST-SOFTWARE-JDK11\surefire7650670692521780251\..%5C..%5C..%5C..%5C..%5C..%5C..%5Cbamboo%5Cxml-data%5Cbuild-dir%5CRNDTEST-SOFTWARE-JDK11%5Cjunit4-ant%5Ctarget%5Ctest-classes\junit4.xml (The system cannot find the path specified)
Collapse Failed TestJsonReport antxml History
JDK 10 < 1 sec
org.apache.tools.ant.BuildException: java.io.FileNotFoundException: C:\Users\bamboo\AppData\Local\Temp\RNDTEST-SOFTWARE-RRJ10\surefire12705780684809620788\..%5C..%5C..%5C..%5C..%5C..%5C..%5Cbamboo%5Cxml-data%5Cbuild-dir%5CRNDTEST-SOFTWARE-RRJ10%5Cjunit4-ant%5Ctarget%5Ctest-classes\junit4.xml (The system cannot find the path specified)
Caused by: java.io.FileNotFoundException: C:\Users\bamboo\AppData\Local\Temp\RNDTEST-SOFTWARE-RRJ10\surefire12705780684809620788\..%5C..%5C..%5C..%5C..%5C..%5C..%5Cbamboo%5Cxml-data%5Cbuild-dir%5CRNDTEST-SOFTWARE-RRJ10%5Cjunit4-ant%5Ctarget%5Ctest-classes\junit4.xml (The system cannot find the path specified)
Collapse Failed TestJsonReport antxml History
JDK 11 < 1 sec
org.apache.tools.ant.BuildException: java.io.FileNotFoundException: C:\Users\bamboo\AppData\Local\Temp\RNDTEST-SOFTWARE-JDK11\surefire7650670692521780251\..%5C..%5C..%5C..%5C..%5C..%5C..%5Cbamboo%5Cxml-data%5Cbuild-dir%5CRNDTEST-SOFTWARE-JDK11%5Cjunit4-ant%5Ctarget%5Ctest-classes\junit4.xml (The system cannot find the path specified)
Caused by: java.io.FileNotFoundException: C:\Users\bamboo\AppData\Local\Temp\RNDTEST-SOFTWARE-JDK11\surefire7650670692521780251\..%5C..%5C..%5C..%5C..%5C..%5C..%5Cbamboo%5Cxml-data%5Cbuild-dir%5CRNDTEST-SOFTWARE-JDK11%5Cjunit4-ant%5Ctarget%5Ctest-classes\junit4.xml (The system cannot find the path specified)
Collapse Failed TestJUnitCompat junitcompat3 History
JDK 10 < 1 sec
org.apache.tools.ant.BuildException: java.io.FileNotFoundException: C:\Users\bamboo\AppData\Local\Temp\RNDTEST-SOFTWARE-RRJ10\surefire12705780684809620788\..%5C..%5C..%5C..%5C..%5C..%5C..%5Cbamboo%5Cxml-data%5Cbuild-dir%5CRNDTEST-SOFTWARE-RRJ10%5Cjunit4-ant%5Ctarget%5Ctest-classes\junit4.xml (The system cannot find the path specified)
Caused by: java.io.FileNotFoundException: C:\Users\bamboo\AppData\Local\Temp\RNDTEST-SOFTWARE-RRJ10\surefire12705780684809620788\..%5C..%5C..%5C..%5C..%5C..%5C..%5Cbamboo%5Cxml-data%5Cbuild-dir%5CRNDTEST-SOFTWARE-RRJ10%5Cjunit4-ant%5Ctarget%5Ctest-classes\junit4.xml (The system cannot find the path specified)
Collapse Failed TestJUnitCompat junitcompat2 History
JDK 10 < 1 sec
org.apache.tools.ant.BuildException: java.io.FileNotFoundException: C:\Users\bamboo\AppData\Local\Temp\RNDTEST-SOFTWARE-RRJ10\surefire12705780684809620788\..%5C..%5C..%5C..%5C..%5C..%5C..%5Cbamboo%5Cxml-data%5Cbuild-dir%5CRNDTEST-SOFTWARE-RRJ10%5Cjunit4-ant%5Ctarget%5Ctest-classes\junit4.xml (The system cannot find the path specified)
Caused by: java.io.FileNotFoundException: C:\Users\bamboo\AppData\Local\Temp\RNDTEST-SOFTWARE-RRJ10\surefire12705780684809620788\..%5C..%5C..%5C..%5C..%5C..%5C..%5Cbamboo%5Cxml-data%5Cbuild-dir%5CRNDTEST-SOFTWARE-RRJ10%5Cjunit4-ant%5Ctarget%5Ctest-classes\junit4.xml (The system cannot find the path specified)
Collapse Failed TestJUnitCompat junitcompat1 History
JDK 10 < 1 sec
org.apache.tools.ant.BuildException: java.io.FileNotFoundException: C:\Users\bamboo\AppData\Local\Temp\RNDTEST-SOFTWARE-RRJ10\surefire12705780684809620788\..%5C..%5C..%5C..%5C..%5C..%5C..%5Cbamboo%5Cxml-data%5Cbuild-dir%5CRNDTEST-SOFTWARE-RRJ10%5Cjunit4-ant%5Ctarget%5Ctest-classes\junit4.xml (The system cannot find the path specified)
Caused by: java.io.FileNotFoundException: C:\Users\bamboo\AppData\Local\Temp\RNDTEST-SOFTWARE-RRJ10\surefire12705780684809620788\..%5C..%5C..%5C..%5C..%5C..%5C..%5Cbamboo%5Cxml-data%5Cbuild-dir%5CRNDTEST-SOFTWARE-RRJ10%5Cjunit4-ant%5Ctarget%5Ctest-classes\junit4.xml (The system cannot find the path specified)
Collapse Failed TestJUnitCompat junitcompat1 History
JDK 11 < 1 sec
org.apache.tools.ant.BuildException: java.io.FileNotFoundException: C:\Users\bamboo\AppData\Local\Temp\RNDTEST-SOFTWARE-JDK11\surefire7650670692521780251\..%5C..%5C..%5C..%5C..%5C..%5C..%5Cbamboo%5Cxml-data%5Cbuild-dir%5CRNDTEST-SOFTWARE-JDK11%5Cjunit4-ant%5Ctarget%5Ctest-classes\junit4.xml (The system cannot find the path specified)
Caused by: java.io.FileNotFoundException: C:\Users\bamboo\AppData\Local\Temp\RNDTEST-SOFTWARE-JDK11\surefire7650670692521780251\..%5C..%5C..%5C..%5C..%5C..%5C..%5Cbamboo%5Cxml-data%5Cbuild-dir%5CRNDTEST-SOFTWARE-JDK11%5Cjunit4-ant%5Ctarget%5Ctest-classes\junit4.xml (The system cannot find the path specified)
Collapse Failed TestJUnitCompat junitcompat3 History
JDK 11 < 1 sec
org.apache.tools.ant.BuildException: java.io.FileNotFoundException: C:\Users\bamboo\AppData\Local\Temp\RNDTEST-SOFTWARE-JDK11\surefire7650670692521780251\..%5C..%5C..%5C..%5C..%5C..%5C..%5Cbamboo%5Cxml-data%5Cbuild-dir%5CRNDTEST-SOFTWARE-JDK11%5Cjunit4-ant%5Ctarget%5Ctest-classes\junit4.xml (The system cannot find the path specified)
Caused by: java.io.FileNotFoundException: C:\Users\bamboo\AppData\Local\Temp\RNDTEST-SOFTWARE-JDK11\surefire7650670692521780251\..%5C..%5C..%5C..%5C..%5C..%5C..%5Cbamboo%5Cxml-data%5Cbuild-dir%5CRNDTEST-SOFTWARE-JDK11%5Cjunit4-ant%5Ctarget%5Ctest-classes\junit4.xml (The system cannot find the path specified)
Collapse Failed TestJUnitCompat junitcompat2 History
JDK 11 < 1 sec
org.apache.tools.ant.BuildException: java.io.FileNotFoundException: C:\Users\bamboo\AppData\Local\Temp\RNDTEST-SOFTWARE-JDK11\surefire7650670692521780251\..%5C..%5C..%5C..%5C..%5C..%5C..%5Cbamboo%5Cxml-data%5Cbuild-dir%5CRNDTEST-SOFTWARE-JDK11%5Cjunit4-ant%5Ctarget%5Ctest-classes\junit4.xml (The system cannot find the path specified)
Caused by: java.io.FileNotFoundException: C:\Users\bamboo\AppData\Local\Temp\RNDTEST-SOFTWARE-JDK11\surefire7650670692521780251\..%5C..%5C..%5C..%5C..%5C..%5C..%5Cbamboo%5Cxml-data%5Cbuild-dir%5CRNDTEST-SOFTWARE-JDK11%5Cjunit4-ant%5Ctarget%5Ctest-classes\junit4.xml (The system cannot find the path specified)
Collapse Failed TestJvmLogging jvmverbose History
JDK 10 < 1 sec
org.apache.tools.ant.BuildException: java.io.FileNotFoundException: C:\Users\bamboo\AppData\Local\Temp\RNDTEST-SOFTWARE-RRJ10\surefire12705780684809620788\..%5C..%5C..%5C..%5C..%5C..%5C..%5Cbamboo%5Cxml-data%5Cbuild-dir%5CRNDTEST-SOFTWARE-RRJ10%5Cjunit4-ant%5Ctarget%5Ctest-classes\junit4.xml (The system cannot find the path specified)
Caused by: java.io.FileNotFoundException: C:\Users\bamboo\AppData\Local\Temp\RNDTEST-SOFTWARE-RRJ10\surefire12705780684809620788\..%5C..%5C..%5C..%5C..%5C..%5C..%5Cbamboo%5Cxml-data%5Cbuild-dir%5CRNDTEST-SOFTWARE-RRJ10%5Cjunit4-ant%5Ctarget%5Ctest-classes\junit4.xml (The system cannot find the path specified)
Collapse Failed TestJvmLogging sysouts History
JDK 10 < 1 sec
org.apache.tools.ant.BuildException: java.io.FileNotFoundException: C:\Users\bamboo\AppData\Local\Temp\RNDTEST-SOFTWARE-RRJ10\surefire12705780684809620788\..%5C..%5C..%5C..%5C..%5C..%5C..%5Cbamboo%5Cxml-data%5Cbuild-dir%5CRNDTEST-SOFTWARE-RRJ10%5Cjunit4-ant%5Ctarget%5Ctest-classes\junit4.xml (The system cannot find the path specified)
Caused by: java.io.FileNotFoundException: C:\Users\bamboo\AppData\Local\Temp\RNDTEST-SOFTWARE-RRJ10\surefire12705780684809620788\..%5C..%5C..%5C..%5C..%5C..%5C..%5Cbamboo%5Cxml-data%5Cbuild-dir%5CRNDTEST-SOFTWARE-RRJ10%5Cjunit4-ant%5Ctarget%5Ctest-classes\junit4.xml (The system cannot find the path specified)
Collapse Failed TestJvmLogging jvmverbose History
JDK 11 < 1 sec
org.apache.tools.ant.BuildException: java.io.FileNotFoundException: C:\Users\bamboo\AppData\Local\Temp\RNDTEST-SOFTWARE-JDK11\surefire7650670692521780251\..%5C..%5C..%5C..%5C..%5C..%5C..%5Cbamboo%5Cxml-data%5Cbuild-dir%5CRNDTEST-SOFTWARE-JDK11%5Cjunit4-ant%5Ctarget%5Ctest-classes\junit4.xml (The system cannot find the path specified)
Caused by: java.io.FileNotFoundException: C:\Users\bamboo\AppData\Local\Temp\RNDTEST-SOFTWARE-JDK11\surefire7650670692521780251\..%5C..%5C..%5C..%5C..%5C..%5C..%5Cbamboo%5Cxml-data%5Cbuild-dir%5CRNDTEST-SOFTWARE-JDK11%5Cjunit4-ant%5Ctarget%5Ctest-classes\junit4.xml (The system cannot find the path specified)
Collapse Failed TestJvmLogging sysouts History
JDK 11 < 1 sec
org.apache.tools.ant.BuildException: java.io.FileNotFoundException: C:\Users\bamboo\AppData\Local\Temp\RNDTEST-SOFTWARE-JDK11\surefire7650670692521780251\..%5C..%5C..%5C..%5C..%5C..%5C..%5Cbamboo%5Cxml-data%5Cbuild-dir%5CRNDTEST-SOFTWARE-JDK11%5Cjunit4-ant%5Ctarget%5Ctest-classes\junit4.xml (The system cannot find the path specified)
Caused by: java.io.FileNotFoundException: C:\Users\bamboo\AppData\Local\Temp\RNDTEST-SOFTWARE-JDK11\surefire7650670692521780251\..%5C..%5C..%5C..%5C..%5C..%5C..%5Cbamboo%5Cxml-data%5Cbuild-dir%5CRNDTEST-SOFTWARE-JDK11%5Cjunit4-ant%5Ctarget%5Ctest-classes\junit4.xml (The system cannot find the path specified)
Collapse Failed TestMiscJUnit4Attributes afterClassError History
JDK 10 < 1 sec
org.apache.tools.ant.BuildException: java.io.FileNotFoundException: C:\Users\bamboo\AppData\Local\Temp\RNDTEST-SOFTWARE-RRJ10\surefire12705780684809620788\..%5C..%5C..%5C..%5C..%5C..%5C..%5Cbamboo%5Cxml-data%5Cbuild-dir%5CRNDTEST-SOFTWARE-RRJ10%5Cjunit4-ant%5Ctarget%5Ctest-classes\junit4.xml (The system cannot find the path specified)
Caused by: java.io.FileNotFoundException: C:\Users\bamboo\AppData\Local\Temp\RNDTEST-SOFTWARE-RRJ10\surefire12705780684809620788\..%5C..%5C..%5C..%5C..%5C..%5C..%5Cbamboo%5Cxml-data%5Cbuild-dir%5CRNDTEST-SOFTWARE-RRJ10%5Cjunit4-ant%5Ctarget%5Ctest-classes\junit4.xml (The system cannot find the path specified)
Collapse Failed TestMiscJUnit4Attributes assertions History
JDK 10 < 1 sec
org.apache.tools.ant.BuildException: java.io.FileNotFoundException: C:\Users\bamboo\AppData\Local\Temp\RNDTEST-SOFTWARE-RRJ10\surefire12705780684809620788\..%5C..%5C..%5C..%5C..%5C..%5C..%5Cbamboo%5Cxml-data%5Cbuild-dir%5CRNDTEST-SOFTWARE-RRJ10%5Cjunit4-ant%5Ctarget%5Ctest-classes\junit4.xml (The system cannot find the path specified)
Caused by: java.io.FileNotFoundException: C:\Users\bamboo\AppData\Local\Temp\RNDTEST-SOFTWARE-RRJ10\surefire12705780684809620788\..%5C..%5C..%5C..%5C..%5C..%5C..%5Cbamboo%5Cxml-data%5Cbuild-dir%5CRNDTEST-SOFTWARE-RRJ10%5Cjunit4-ant%5Ctarget%5Ctest-classes\junit4.xml (The system cannot find the path specified)
Collapse Failed TestMiscJUnit4Attributes jvmarg History
JDK 10 < 1 sec
org.apache.tools.ant.BuildException: java.io.FileNotFoundException: C:\Users\bamboo\AppData\Local\Temp\RNDTEST-SOFTWARE-RRJ10\surefire12705780684809620788\..%5C..%5C..%5C..%5C..%5C..%5C..%5Cbamboo%5Cxml-data%5Cbuild-dir%5CRNDTEST-SOFTWARE-RRJ10%5Cjunit4-ant%5Ctarget%5Ctest-classes\junit4.xml (The system cannot find the path specified)
Caused by: java.io.FileNotFoundException: C:\Users\bamboo\AppData\Local\Temp\RNDTEST-SOFTWARE-RRJ10\surefire12705780684809620788\..%5C..%5C..%5C..%5C..%5C..%5C..%5Cbamboo%5Cxml-data%5Cbuild-dir%5CRNDTEST-SOFTWARE-RRJ10%5Cjunit4-ant%5Ctarget%5Ctest-classes\junit4.xml (The system cannot find the path specified)
Collapse Failed TestMiscJUnit4Attributes hierarchicalSuiteDescription History
JDK 10 < 1 sec
org.apache.tools.ant.BuildException: java.io.FileNotFoundException: C:\Users\bamboo\AppData\Local\Temp\RNDTEST-SOFTWARE-RRJ10\surefire12705780684809620788\..%5C..%5C..%5C..%5C..%5C..%5C..%5Cbamboo%5Cxml-data%5Cbuild-dir%5CRNDTEST-SOFTWARE-RRJ10%5Cjunit4-ant%5Ctarget%5Ctest-classes\junit4.xml (The system cannot find the path specified)
Caused by: java.io.FileNotFoundException: C:\Users\bamboo\AppData\Local\Temp\RNDTEST-SOFTWARE-RRJ10\surefire12705780684809620788\..%5C..%5C..%5C..%5C..%5C..%5C..%5Cbamboo%5Cxml-data%5Cbuild-dir%5CRNDTEST-SOFTWARE-RRJ10%5Cjunit4-ant%5Ctarget%5Ctest-classes\junit4.xml (The system cannot find the path specified)
Collapse Failed TestMiscJUnit4Attributes beforeClassError History
JDK 10 < 1 sec
org.apache.tools.ant.BuildException: java.io.FileNotFoundException: C:\Users\bamboo\AppData\Local\Temp\RNDTEST-SOFTWARE-RRJ10\surefire12705780684809620788\..%5C..%5C..%5C..%5C..%5C..%5C..%5Cbamboo%5Cxml-data%5Cbuild-dir%5CRNDTEST-SOFTWARE-RRJ10%5Cjunit4-ant%5Ctarget%5Ctest-classes\junit4.xml (The system cannot find the path specified)
Caused by: java.io.FileNotFoundException: C:\Users\bamboo\AppData\Local\Temp\RNDTEST-SOFTWARE-RRJ10\surefire12705780684809620788\..%5C..%5C..%5C..%5C..%5C..%5C..%5Cbamboo%5Cxml-data%5Cbuild-dir%5CRNDTEST-SOFTWARE-RRJ10%5Cjunit4-ant%5Ctarget%5Ctest-classes\junit4.xml (The system cannot find the path specified)
Collapse Failed TestMiscJUnit4Attributes customprefix History
JDK 10 < 1 sec
org.apache.tools.ant.BuildException: java.io.FileNotFoundException: C:\Users\bamboo\AppData\Local\Temp\RNDTEST-SOFTWARE-RRJ10\surefire12705780684809620788\..%5C..%5C..%5C..%5C..%5C..%5C..%5Cbamboo%5Cxml-data%5Cbuild-dir%5CRNDTEST-SOFTWARE-RRJ10%5Cjunit4-ant%5Ctarget%5Ctest-classes\junit4.xml (The system cannot find the path specified)
Caused by: java.io.FileNotFoundException: C:\Users\bamboo\AppData\Local\Temp\RNDTEST-SOFTWARE-RRJ10\surefire12705780684809620788\..%5C..%5C..%5C..%5C..%5C..%5C..%5Cbamboo%5Cxml-data%5Cbuild-dir%5CRNDTEST-SOFTWARE-RRJ10%5Cjunit4-ant%5Ctarget%5Ctest-classes\junit4.xml (The system cannot find the path specified)
Collapse Failed TestMiscJUnit4Attributes balancing History
JDK 10 < 1 sec
org.apache.tools.ant.BuildException: java.io.FileNotFoundException: C:\Users\bamboo\AppData\Local\Temp\RNDTEST-SOFTWARE-RRJ10\surefire12705780684809620788\..%5C..%5C..%5C..%5C..%5C..%5C..%5Cbamboo%5Cxml-data%5Cbuild-dir%5CRNDTEST-SOFTWARE-RRJ10%5Cjunit4-ant%5Ctarget%5Ctest-classes\junit4.xml (The system cannot find the path specified)
Caused by: java.io.FileNotFoundException: C:\Users\bamboo\AppData\Local\Temp\RNDTEST-SOFTWARE-RRJ10\surefire12705780684809620788\..%5C..%5C..%5C..%5C..%5C..%5C..%5Cbamboo%5Cxml-data%5Cbuild-dir%5CRNDTEST-SOFTWARE-RRJ10%5Cjunit4-ant%5Ctarget%5Ctest-classes\junit4.xml (The system cannot find the path specified)
Collapse Failed TestMiscJUnit4Attributes mergehints History
JDK 10 < 1 sec
org.apache.tools.ant.BuildException: java.io.FileNotFoundException: C:\Users\bamboo\AppData\Local\Temp\RNDTEST-SOFTWARE-RRJ10\surefire12705780684809620788\..%5C..%5C..%5C..%5C..%5C..%5C..%5Cbamboo%5Cxml-data%5Cbuild-dir%5CRNDTEST-SOFTWARE-RRJ10%5Cjunit4-ant%5Ctarget%5Ctest-classes\junit4.xml (The system cannot find the path specified)
Caused by: java.io.FileNotFoundException: C:\Users\bamboo\AppData\Local\Temp\RNDTEST-SOFTWARE-RRJ10\surefire12705780684809620788\..%5C..%5C..%5C..%5C..%5C..%5C..%5Cbamboo%5Cxml-data%5Cbuild-dir%5CRNDTEST-SOFTWARE-RRJ10%5Cjunit4-ant%5Ctarget%5Ctest-classes\junit4.xml (The system cannot find the path specified)
Collapse Failed TestMiscJUnit4Attributes seedpassing History
JDK 10 < 1 sec
org.apache.tools.ant.BuildException: java.io.FileNotFoundException: C:\Users\bamboo\AppData\Local\Temp\RNDTEST-SOFTWARE-RRJ10\surefire12705780684809620788\..%5C..%5C..%5C..%5C..%5C..%5C..%5Cbamboo%5Cxml-data%5Cbuild-dir%5CRNDTEST-SOFTWARE-RRJ10%5Cjunit4-ant%5Ctarget%5Ctest-classes\junit4.xml (The system cannot find the path specified)
Caused by: java.io.FileNotFoundException: C:\Users\bamboo\AppData\Local\Temp\RNDTEST-SOFTWARE-RRJ10\surefire12705780684809620788\..%5C..%5C..%5C..%5C..%5C..%5C..%5Cbamboo%5Cxml-data%5Cbuild-dir%5CRNDTEST-SOFTWARE-RRJ10%5Cjunit4-ant%5Ctarget%5Ctest-classes\junit4.xml (The system cannot find the path specified)
Collapse Failed TestMiscJUnit4Attributes reproducestring History
JDK 10 < 1 sec
org.apache.tools.ant.BuildException: java.io.FileNotFoundException: C:\Users\bamboo\AppData\Local\Temp\RNDTEST-SOFTWARE-RRJ10\surefire12705780684809620788\..%5C..%5C..%5C..%5C..%5C..%5C..%5Cbamboo%5Cxml-data%5Cbuild-dir%5CRNDTEST-SOFTWARE-RRJ10%5Cjunit4-ant%5Ctarget%5Ctest-classes\junit4.xml (The system cannot find the path specified)
Caused by: java.io.FileNotFoundException: C:\Users\bamboo\AppData\Local\Temp\RNDTEST-SOFTWARE-RRJ10\surefire12705780684809620788\..%5C..%5C..%5C..%5C..%5C..%5C..%5Cbamboo%5Cxml-data%5Cbuild-dir%5CRNDTEST-SOFTWARE-RRJ10%5Cjunit4-ant%5Ctarget%5Ctest-classes\junit4.xml (The system cannot find the path specified)
Collapse Failed TestMiscJUnit4Attributes balancing_nohints History
JDK 10 < 1 sec
org.apache.tools.ant.BuildException: java.io.FileNotFoundException: C:\Users\bamboo\AppData\Local\Temp\RNDTEST-SOFTWARE-RRJ10\surefire12705780684809620788\..%5C..%5C..%5C..%5C..%5C..%5C..%5Cbamboo%5Cxml-data%5Cbuild-dir%5CRNDTEST-SOFTWARE-RRJ10%5Cjunit4-ant%5Ctarget%5Ctest-classes\junit4.xml (The system cannot find the path specified)
Caused by: java.io.FileNotFoundException: C:\Users\bamboo\AppData\Local\Temp\RNDTEST-SOFTWARE-RRJ10\surefire12705780684809620788\..%5C..%5C..%5C..%5C..%5C..%5C..%5Cbamboo%5Cxml-data%5Cbuild-dir%5CRNDTEST-SOFTWARE-RRJ10%5Cjunit4-ant%5Ctarget%5Ctest-classes\junit4.xml (The system cannot find the path specified)
Collapse Failed TestMiscJUnit4Attributes seedpassingInvalid History
JDK 10 < 1 sec
org.apache.tools.ant.BuildException: java.io.FileNotFoundException: C:\Users\bamboo\AppData\Local\Temp\RNDTEST-SOFTWARE-RRJ10\surefire12705780684809620788\..%5C..%5C..%5C..%5C..%5C..%5C..%5Cbamboo%5Cxml-data%5Cbuild-dir%5CRNDTEST-SOFTWARE-RRJ10%5Cjunit4-ant%5Ctarget%5Ctest-classes\junit4.xml (The system cannot find the path specified)
Caused by: java.io.FileNotFoundException: C:\Users\bamboo\AppData\Local\Temp\RNDTEST-SOFTWARE-RRJ10\surefire12705780684809620788\..%5C..%5C..%5C..%5C..%5C..%5C..%5Cbamboo%5Cxml-data%5Cbuild-dir%5CRNDTEST-SOFTWARE-RRJ10%5Cjunit4-ant%5Ctarget%5Ctest-classes\junit4.xml (The system cannot find the path specified)
Collapse Failed TestMiscJUnit4Attributes ignoredSuite History
JDK 10 < 1 sec
org.apache.tools.ant.BuildException: java.io.FileNotFoundException: C:\Users\bamboo\AppData\Local\Temp\RNDTEST-SOFTWARE-RRJ10\surefire12705780684809620788\..%5C..%5C..%5C..%5C..%5C..%5C..%5Cbamboo%5Cxml-data%5Cbuild-dir%5CRNDTEST-SOFTWARE-RRJ10%5Cjunit4-ant%5Ctarget%5Ctest-classes\junit4.xml (The system cannot find the path specified)
Caused by: java.io.FileNotFoundException: C:\Users\bamboo\AppData\Local\Temp\RNDTEST-SOFTWARE-RRJ10\surefire12705780684809620788\..%5C..%5C..%5C..%5C..%5C..%5C..%5Cbamboo%5Cxml-data%5Cbuild-dir%5CRNDTEST-SOFTWARE-RRJ10%5Cjunit4-ant%5Ctarget%5Ctest-classes\junit4.xml (The system cannot find the path specified)
Collapse Failed TestMiscJUnit4Attributes maxmem History
JDK 10 < 1 sec
org.apache.tools.ant.BuildException: java.io.FileNotFoundException: C:\Users\bamboo\AppData\Local\Temp\RNDTEST-SOFTWARE-RRJ10\surefire12705780684809620788\..%5C..%5C..%5C..%5C..%5C..%5C..%5Cbamboo%5Cxml-data%5Cbuild-dir%5CRNDTEST-SOFTWARE-RRJ10%5Cjunit4-ant%5Ctarget%5Ctest-classes\junit4.xml (The system cannot find the path specified)
Caused by: java.io.FileNotFoundException: C:\Users\bamboo\AppData\Local\Temp\RNDTEST-SOFTWARE-RRJ10\surefire12705780684809620788\..%5C..%5C..%5C..%5C..%5C..%5C..%5Cbamboo%5Cxml-data%5Cbuild-dir%5CRNDTEST-SOFTWARE-RRJ10%5Cjunit4-ant%5Ctarget%5Ctest-classes\junit4.xml (The system cannot find the path specified)
Collapse Failed TestMiscJUnit4Attributes dir History
JDK 10 < 1 sec
org.apache.tools.ant.BuildException: java.io.FileNotFoundException: C:\Users\bamboo\AppData\Local\Temp\RNDTEST-SOFTWARE-RRJ10\surefire12705780684809620788\..%5C..%5C..%5C..%5C..%5C..%5C..%5Cbamboo%5Cxml-data%5Cbuild-dir%5CRNDTEST-SOFTWARE-RRJ10%5Cjunit4-ant%5Ctarget%5Ctest-classes\junit4.xml (The system cannot find the path specified)
Caused by: java.io.FileNotFoundException: C:\Users\bamboo\AppData\Local\Temp\RNDTEST-SOFTWARE-RRJ10\surefire12705780684809620788\..%5C..%5C..%5C..%5C..%5C..%5C..%5Cbamboo%5Cxml-data%5Cbuild-dir%5CRNDTEST-SOFTWARE-RRJ10%5Cjunit4-ant%5Ctarget%5Ctest-classes\junit4.xml (The system cannot find the path specified)
Collapse Failed TestMiscJUnit4Attributes statuses History
JDK 10 < 1 sec
org.apache.tools.ant.BuildException: java.io.FileNotFoundException: C:\Users\bamboo\AppData\Local\Temp\RNDTEST-SOFTWARE-RRJ10\surefire12705780684809620788\..%5C..%5C..%5C..%5C..%5C..%5C..%5Cbamboo%5Cxml-data%5Cbuild-dir%5CRNDTEST-SOFTWARE-RRJ10%5Cjunit4-ant%5Ctarget%5Ctest-classes\junit4.xml (The system cannot find the path specified)
Caused by: java.io.FileNotFoundException: C:\Users\bamboo\AppData\Local\Temp\RNDTEST-SOFTWARE-RRJ10\surefire12705780684809620788\..%5C..%5C..%5C..%5C..%5C..%5C..%5Cbamboo%5Cxml-data%5Cbuild-dir%5CRNDTEST-SOFTWARE-RRJ10%5Cjunit4-ant%5Ctarget%5Ctest-classes\junit4.xml (The system cannot find the path specified)
Collapse Failed TestMiscJUnit4Attributes statuses History
JDK 11 < 1 sec
org.apache.tools.ant.BuildException: java.io.FileNotFoundException: C:\Users\bamboo\AppData\Local\Temp\RNDTEST-SOFTWARE-JDK11\surefire7650670692521780251\..%5C..%5C..%5C..%5C..%5C..%5C..%5Cbamboo%5Cxml-data%5Cbuild-dir%5CRNDTEST-SOFTWARE-JDK11%5Cjunit4-ant%5Ctarget%5Ctest-classes\junit4.xml (The system cannot find the path specified)
Caused by: java.io.FileNotFoundException: C:\Users\bamboo\AppData\Local\Temp\RNDTEST-SOFTWARE-JDK11\surefire7650670692521780251\..%5C..%5C..%5C..%5C..%5C..%5C..%5Cbamboo%5Cxml-data%5Cbuild-dir%5CRNDTEST-SOFTWARE-JDK11%5Cjunit4-ant%5Ctarget%5Ctest-classes\junit4.xml (The system cannot find the path specified)
Collapse Failed TestMiscJUnit4Attributes balancing History
JDK 11 < 1 sec
org.apache.tools.ant.BuildException: java.io.FileNotFoundException: C:\Users\bamboo\AppData\Local\Temp\RNDTEST-SOFTWARE-JDK11\surefire7650670692521780251\..%5C..%5C..%5C..%5C..%5C..%5C..%5Cbamboo%5Cxml-data%5Cbuild-dir%5CRNDTEST-SOFTWARE-JDK11%5Cjunit4-ant%5Ctarget%5Ctest-classes\junit4.xml (The system cannot find the path specified)
Caused by: java.io.FileNotFoundException: C:\Users\bamboo\AppData\Local\Temp\RNDTEST-SOFTWARE-JDK11\surefire7650670692521780251\..%5C..%5C..%5C..%5C..%5C..%5C..%5Cbamboo%5Cxml-data%5Cbuild-dir%5CRNDTEST-SOFTWARE-JDK11%5Cjunit4-ant%5Ctarget%5Ctest-classes\junit4.xml (The system cannot find the path specified)
Collapse Failed TestMiscJUnit4Attributes mergehints History
JDK 11 < 1 sec
org.apache.tools.ant.BuildException: java.io.FileNotFoundException: C:\Users\bamboo\AppData\Local\Temp\RNDTEST-SOFTWARE-JDK11\surefire7650670692521780251\..%5C..%5C..%5C..%5C..%5C..%5C..%5Cbamboo%5Cxml-data%5Cbuild-dir%5CRNDTEST-SOFTWARE-JDK11%5Cjunit4-ant%5Ctarget%5Ctest-classes\junit4.xml (The system cannot find the path specified)
Caused by: java.io.FileNotFoundException: C:\Users\bamboo\AppData\Local\Temp\RNDTEST-SOFTWARE-JDK11\surefire7650670692521780251\..%5C..%5C..%5C..%5C..%5C..%5C..%5Cbamboo%5Cxml-data%5Cbuild-dir%5CRNDTEST-SOFTWARE-JDK11%5Cjunit4-ant%5Ctarget%5Ctest-classes\junit4.xml (The system cannot find the path specified)
Collapse Failed TestMiscJUnit4Attributes seedpassing History
JDK 11 < 1 sec
org.apache.tools.ant.BuildException: java.io.FileNotFoundException: C:\Users\bamboo\AppData\Local\Temp\RNDTEST-SOFTWARE-JDK11\surefire7650670692521780251\..%5C..%5C..%5C..%5C..%5C..%5C..%5Cbamboo%5Cxml-data%5Cbuild-dir%5CRNDTEST-SOFTWARE-JDK11%5Cjunit4-ant%5Ctarget%5Ctest-classes\junit4.xml (The system cannot find the path specified)
Caused by: java.io.FileNotFoundException: C:\Users\bamboo\AppData\Local\Temp\RNDTEST-SOFTWARE-JDK11\surefire7650670692521780251\..%5C..%5C..%5C..%5C..%5C..%5C..%5Cbamboo%5Cxml-data%5Cbuild-dir%5CRNDTEST-SOFTWARE-JDK11%5Cjunit4-ant%5Ctarget%5Ctest-classes\junit4.xml (The system cannot find the path specified)
Collapse Failed TestMiscJUnit4Attributes reproducestring History
JDK 11 < 1 sec
org.apache.tools.ant.BuildException: java.io.FileNotFoundException: C:\Users\bamboo\AppData\Local\Temp\RNDTEST-SOFTWARE-JDK11\surefire7650670692521780251\..%5C..%5C..%5C..%5C..%5C..%5C..%5Cbamboo%5Cxml-data%5Cbuild-dir%5CRNDTEST-SOFTWARE-JDK11%5Cjunit4-ant%5Ctarget%5Ctest-classes\junit4.xml (The system cannot find the path specified)
Caused by: java.io.FileNotFoundException: C:\Users\bamboo\AppData\Local\Temp\RNDTEST-SOFTWARE-JDK11\surefire7650670692521780251\..%5C..%5C..%5C..%5C..%5C..%5C..%5Cbamboo%5Cxml-data%5Cbuild-dir%5CRNDTEST-SOFTWARE-JDK11%5Cjunit4-ant%5Ctarget%5Ctest-classes\junit4.xml (The system cannot find the path specified)
Collapse Failed TestMiscJUnit4Attributes maxmem History
JDK 11 < 1 sec
org.apache.tools.ant.BuildException: java.io.FileNotFoundException: C:\Users\bamboo\AppData\Local\Temp\RNDTEST-SOFTWARE-JDK11\surefire7650670692521780251\..%5C..%5C..%5C..%5C..%5C..%5C..%5Cbamboo%5Cxml-data%5Cbuild-dir%5CRNDTEST-SOFTWARE-JDK11%5Cjunit4-ant%5Ctarget%5Ctest-classes\junit4.xml (The system cannot find the path specified)
Caused by: java.io.FileNotFoundException: C:\Users\bamboo\AppData\Local\Temp\RNDTEST-SOFTWARE-JDK11\surefire7650670692521780251\..%5C..%5C..%5C..%5C..%5C..%5C..%5Cbamboo%5Cxml-data%5Cbuild-dir%5CRNDTEST-SOFTWARE-JDK11%5Cjunit4-ant%5Ctarget%5Ctest-classes\junit4.xml (The system cannot find the path specified)
Collapse Failed TestMiscJUnit4Attributes dir History
JDK 11 < 1 sec
org.apache.tools.ant.BuildException: java.io.FileNotFoundException: C:\Users\bamboo\AppData\Local\Temp\RNDTEST-SOFTWARE-JDK11\surefire7650670692521780251\..%5C..%5C..%5C..%5C..%5C..%5C..%5Cbamboo%5Cxml-data%5Cbuild-dir%5CRNDTEST-SOFTWARE-JDK11%5Cjunit4-ant%5Ctarget%5Ctest-classes\junit4.xml (The system cannot find the path specified)
Caused by: java.io.FileNotFoundException: C:\Users\bamboo\AppData\Local\Temp\RNDTEST-SOFTWARE-JDK11\surefire7650670692521780251\..%5C..%5C..%5C..%5C..%5C..%5C..%5Cbamboo%5Cxml-data%5Cbuild-dir%5CRNDTEST-SOFTWARE-JDK11%5Cjunit4-ant%5Ctarget%5Ctest-classes\junit4.xml (The system cannot find the path specified)
Collapse Failed TestMiscJUnit4Attributes beforeClassError History
JDK 11 < 1 sec
org.apache.tools.ant.BuildException: java.io.FileNotFoundException: C:\Users\bamboo\AppData\Local\Temp\RNDTEST-SOFTWARE-JDK11\surefire7650670692521780251\..%5C..%5C..%5C..%5C..%5C..%5C..%5Cbamboo%5Cxml-data%5Cbuild-dir%5CRNDTEST-SOFTWARE-JDK11%5Cjunit4-ant%5Ctarget%5Ctest-classes\junit4.xml (The system cannot find the path specified)
Caused by: java.io.FileNotFoundException: C:\Users\bamboo\AppData\Local\Temp\RNDTEST-SOFTWARE-JDK11\surefire7650670692521780251\..%5C..%5C..%5C..%5C..%5C..%5C..%5Cbamboo%5Cxml-data%5Cbuild-dir%5CRNDTEST-SOFTWARE-JDK11%5Cjunit4-ant%5Ctarget%5Ctest-classes\junit4.xml (The system cannot find the path specified)
Collapse Failed TestMiscJUnit4Attributes ignoredSuite History
JDK 11 < 1 sec
org.apache.tools.ant.BuildException: java.io.FileNotFoundException: C:\Users\bamboo\AppData\Local\Temp\RNDTEST-SOFTWARE-JDK11\surefire7650670692521780251\..%5C..%5C..%5C..%5C..%5C..%5C..%5Cbamboo%5Cxml-data%5Cbuild-dir%5CRNDTEST-SOFTWARE-JDK11%5Cjunit4-ant%5Ctarget%5Ctest-classes\junit4.xml (The system cannot find the path specified)
Caused by: java.io.FileNotFoundException: C:\Users\bamboo\AppData\Local\Temp\RNDTEST-SOFTWARE-JDK11\surefire7650670692521780251\..%5C..%5C..%5C..%5C..%5C..%5C..%5Cbamboo%5Cxml-data%5Cbuild-dir%5CRNDTEST-SOFTWARE-JDK11%5Cjunit4-ant%5Ctarget%5Ctest-classes\junit4.xml (The system cannot find the path specified)
Collapse Failed TestMiscJUnit4Attributes seedpassingInvalid History
JDK 11 < 1 sec
org.apache.tools.ant.BuildException: java.io.FileNotFoundException: C:\Users\bamboo\AppData\Local\Temp\RNDTEST-SOFTWARE-JDK11\surefire7650670692521780251\..%5C..%5C..%5C..%5C..%5C..%5C..%5Cbamboo%5Cxml-data%5Cbuild-dir%5CRNDTEST-SOFTWARE-JDK11%5Cjunit4-ant%5Ctarget%5Ctest-classes\junit4.xml (The system cannot find the path specified)
Caused by: java.io.FileNotFoundException: C:\Users\bamboo\AppData\Local\Temp\RNDTEST-SOFTWARE-JDK11\surefire7650670692521780251\..%5C..%5C..%5C..%5C..%5C..%5C..%5Cbamboo%5Cxml-data%5Cbuild-dir%5CRNDTEST-SOFTWARE-JDK11%5Cjunit4-ant%5Ctarget%5Ctest-classes\junit4.xml (The system cannot find the path specified)
Collapse Failed TestMiscJUnit4Attributes hierarchicalSuiteDescription History
JDK 11 < 1 sec
org.apache.tools.ant.BuildException: java.io.FileNotFoundException: C:\Users\bamboo\AppData\Local\Temp\RNDTEST-SOFTWARE-JDK11\surefire7650670692521780251\..%5C..%5C..%5C..%5C..%5C..%5C..%5Cbamboo%5Cxml-data%5Cbuild-dir%5CRNDTEST-SOFTWARE-JDK11%5Cjunit4-ant%5Ctarget%5Ctest-classes\junit4.xml (The system cannot find the path specified)
Caused by: java.io.FileNotFoundException: C:\Users\bamboo\AppData\Local\Temp\RNDTEST-SOFTWARE-JDK11\surefire7650670692521780251\..%5C..%5C..%5C..%5C..%5C..%5C..%5Cbamboo%5Cxml-data%5Cbuild-dir%5CRNDTEST-SOFTWARE-JDK11%5Cjunit4-ant%5Ctarget%5Ctest-classes\junit4.xml (The system cannot find the path specified)
Collapse Failed TestMiscJUnit4Attributes balancing_nohints History
JDK 11 < 1 sec
org.apache.tools.ant.BuildException: java.io.FileNotFoundException: C:\Users\bamboo\AppData\Local\Temp\RNDTEST-SOFTWARE-JDK11\surefire7650670692521780251\..%5C..%5C..%5C..%5C..%5C..%5C..%5Cbamboo%5Cxml-data%5Cbuild-dir%5CRNDTEST-SOFTWARE-JDK11%5Cjunit4-ant%5Ctarget%5Ctest-classes\junit4.xml (The system cannot find the path specified)
Caused by: java.io.FileNotFoundException: C:\Users\bamboo\AppData\Local\Temp\RNDTEST-SOFTWARE-JDK11\surefire7650670692521780251\..%5C..%5C..%5C..%5C..%5C..%5C..%5Cbamboo%5Cxml-data%5Cbuild-dir%5CRNDTEST-SOFTWARE-JDK11%5Cjunit4-ant%5Ctarget%5Ctest-classes\junit4.xml (The system cannot find the path specified)
Collapse Failed TestMiscJUnit4Attributes jvmarg History
JDK 11 < 1 sec
org.apache.tools.ant.BuildException: java.io.FileNotFoundException: C:\Users\bamboo\AppData\Local\Temp\RNDTEST-SOFTWARE-JDK11\surefire7650670692521780251\..%5C..%5C..%5C..%5C..%5C..%5C..%5Cbamboo%5Cxml-data%5Cbuild-dir%5CRNDTEST-SOFTWARE-JDK11%5Cjunit4-ant%5Ctarget%5Ctest-classes\junit4.xml (The system cannot find the path specified)
Caused by: java.io.FileNotFoundException: C:\Users\bamboo\AppData\Local\Temp\RNDTEST-SOFTWARE-JDK11\surefire7650670692521780251\..%5C..%5C..%5C..%5C..%5C..%5C..%5Cbamboo%5Cxml-data%5Cbuild-dir%5CRNDTEST-SOFTWARE-JDK11%5Cjunit4-ant%5Ctarget%5Ctest-classes\junit4.xml (The system cannot find the path specified)
Collapse Failed TestMiscJUnit4Attributes customprefix History
JDK 11 < 1 sec
org.apache.tools.ant.BuildException: java.io.FileNotFoundException: C:\Users\bamboo\AppData\Local\Temp\RNDTEST-SOFTWARE-JDK11\surefire7650670692521780251\..%5C..%5C..%5C..%5C..%5C..%5C..%5Cbamboo%5Cxml-data%5Cbuild-dir%5CRNDTEST-SOFTWARE-JDK11%5Cjunit4-ant%5Ctarget%5Ctest-classes\junit4.xml (The system cannot find the path specified)
Caused by: java.io.FileNotFoundException: C:\Users\bamboo\AppData\Local\Temp\RNDTEST-SOFTWARE-JDK11\surefire7650670692521780251\..%5C..%5C..%5C..%5C..%5C..%5C..%5Cbamboo%5Cxml-data%5Cbuild-dir%5CRNDTEST-SOFTWARE-JDK11%5Cjunit4-ant%5Ctarget%5Ctest-classes\junit4.xml (The system cannot find the path specified)
Collapse Failed TestMiscJUnit4Attributes assertions History
JDK 11 < 1 sec
org.apache.tools.ant.BuildException: java.io.FileNotFoundException: C:\Users\bamboo\AppData\Local\Temp\RNDTEST-SOFTWARE-JDK11\surefire7650670692521780251\..%5C..%5C..%5C..%5C..%5C..%5C..%5Cbamboo%5Cxml-data%5Cbuild-dir%5CRNDTEST-SOFTWARE-JDK11%5Cjunit4-ant%5Ctarget%5Ctest-classes\junit4.xml (The system cannot find the path specified)
Caused by: java.io.FileNotFoundException: C:\Users\bamboo\AppData\Local\Temp\RNDTEST-SOFTWARE-JDK11\surefire7650670692521780251\..%5C..%5C..%5C..%5C..%5C..%5C..%5Cbamboo%5Cxml-data%5Cbuild-dir%5CRNDTEST-SOFTWARE-JDK11%5Cjunit4-ant%5Ctarget%5Ctest-classes\junit4.xml (The system cannot find the path specified)
Collapse Failed TestMiscJUnit4Attributes afterClassError History
JDK 11 < 1 sec
org.apache.tools.ant.BuildException: java.io.FileNotFoundException: C:\Users\bamboo\AppData\Local\Temp\RNDTEST-SOFTWARE-JDK11\surefire7650670692521780251\..%5C..%5C..%5C..%5C..%5C..%5C..%5Cbamboo%5Cxml-data%5Cbuild-dir%5CRNDTEST-SOFTWARE-JDK11%5Cjunit4-ant%5Ctarget%5Ctest-classes\junit4.xml (The system cannot find the path specified)
Caused by: java.io.FileNotFoundException: C:\Users\bamboo\AppData\Local\Temp\RNDTEST-SOFTWARE-JDK11\surefire7650670692521780251\..%5C..%5C..%5C..%5C..%5C..%5C..%5Cbamboo%5Cxml-data%5Cbuild-dir%5CRNDTEST-SOFTWARE-JDK11%5Cjunit4-ant%5Ctarget%5Ctest-classes\junit4.xml (The system cannot find the path specified)
Collapse Failed TestOnNonEmptyWorkDirectory actionWipe History
JDK 10 < 1 sec
org.apache.tools.ant.BuildException: java.io.FileNotFoundException: C:\Users\bamboo\AppData\Local\Temp\RNDTEST-SOFTWARE-RRJ10\surefire12705780684809620788\..%5C..%5C..%5C..%5C..%5C..%5C..%5Cbamboo%5Cxml-data%5Cbuild-dir%5CRNDTEST-SOFTWARE-RRJ10%5Cjunit4-ant%5Ctarget%5Ctest-classes\junit4.xml (The system cannot find the path specified)
Caused by: java.io.FileNotFoundException: C:\Users\bamboo\AppData\Local\Temp\RNDTEST-SOFTWARE-RRJ10\surefire12705780684809620788\..%5C..%5C..%5C..%5C..%5C..%5C..%5Cbamboo%5Cxml-data%5Cbuild-dir%5CRNDTEST-SOFTWARE-RRJ10%5Cjunit4-ant%5Ctarget%5Ctest-classes\junit4.xml (The system cannot find the path specified)
Collapse Failed TestOnNonEmptyWorkDirectory actionIgnore History
JDK 10 < 1 sec
org.apache.tools.ant.BuildException: java.io.FileNotFoundException: C:\Users\bamboo\AppData\Local\Temp\RNDTEST-SOFTWARE-RRJ10\surefire12705780684809620788\..%5C..%5C..%5C..%5C..%5C..%5C..%5Cbamboo%5Cxml-data%5Cbuild-dir%5CRNDTEST-SOFTWARE-RRJ10%5Cjunit4-ant%5Ctarget%5Ctest-classes\junit4.xml (The system cannot find the path specified)
Caused by: java.io.FileNotFoundException: C:\Users\bamboo\AppData\Local\Temp\RNDTEST-SOFTWARE-RRJ10\surefire12705780684809620788\..%5C..%5C..%5C..%5C..%5C..%5C..%5Cbamboo%5Cxml-data%5Cbuild-dir%5CRNDTEST-SOFTWARE-RRJ10%5Cjunit4-ant%5Ctarget%5Ctest-classes\junit4.xml (The system cannot find the path specified)
Collapse Failed TestOnNonEmptyWorkDirectory actionFail History
JDK 10 < 1 sec
org.apache.tools.ant.BuildException: java.io.FileNotFoundException: C:\Users\bamboo\AppData\Local\Temp\RNDTEST-SOFTWARE-RRJ10\surefire12705780684809620788\..%5C..%5C..%5C..%5C..%5C..%5C..%5Cbamboo%5Cxml-data%5Cbuild-dir%5CRNDTEST-SOFTWARE-RRJ10%5Cjunit4-ant%5Ctarget%5Ctest-classes\junit4.xml (The system cannot find the path specified)
Caused by: java.io.FileNotFoundException: C:\Users\bamboo\AppData\Local\Temp\RNDTEST-SOFTWARE-RRJ10\surefire12705780684809620788\..%5C..%5C..%5C..%5C..%5C..%5C..%5Cbamboo%5Cxml-data%5Cbuild-dir%5CRNDTEST-SOFTWARE-RRJ10%5Cjunit4-ant%5Ctarget%5Ctest-classes\junit4.xml (The system cannot find the path specified)
Collapse Failed TestOnNonEmptyWorkDirectory tmpDirUnderCwd History
JDK 10 < 1 sec
org.apache.tools.ant.BuildException: java.io.FileNotFoundException: C:\Users\bamboo\AppData\Local\Temp\RNDTEST-SOFTWARE-RRJ10\surefire12705780684809620788\..%5C..%5C..%5C..%5C..%5C..%5C..%5Cbamboo%5Cxml-data%5Cbuild-dir%5CRNDTEST-SOFTWARE-RRJ10%5Cjunit4-ant%5Ctarget%5Ctest-classes\junit4.xml (The system cannot find the path specified)
Caused by: java.io.FileNotFoundException: C:\Users\bamboo\AppData\Local\Temp\RNDTEST-SOFTWARE-RRJ10\surefire12705780684809620788\..%5C..%5C..%5C..%5C..%5C..%5C..%5Cbamboo%5Cxml-data%5Cbuild-dir%5CRNDTEST-SOFTWARE-RRJ10%5Cjunit4-ant%5Ctarget%5Ctest-classes\junit4.xml (The system cannot find the path specified)
Collapse Failed TestOnNonEmptyWorkDirectory actionWipe History
JDK 11 < 1 sec
org.apache.tools.ant.BuildException: java.io.FileNotFoundException: C:\Users\bamboo\AppData\Local\Temp\RNDTEST-SOFTWARE-JDK11\surefire7650670692521780251\..%5C..%5C..%5C..%5C..%5C..%5C..%5Cbamboo%5Cxml-data%5Cbuild-dir%5CRNDTEST-SOFTWARE-JDK11%5Cjunit4-ant%5Ctarget%5Ctest-classes\junit4.xml (The system cannot find the path specified)
Caused by: java.io.FileNotFoundException: C:\Users\bamboo\AppData\Local\Temp\RNDTEST-SOFTWARE-JDK11\surefire7650670692521780251\..%5C..%5C..%5C..%5C..%5C..%5C..%5Cbamboo%5Cxml-data%5Cbuild-dir%5CRNDTEST-SOFTWARE-JDK11%5Cjunit4-ant%5Ctarget%5Ctest-classes\junit4.xml (The system cannot find the path specified)
Collapse Failed TestOnNonEmptyWorkDirectory actionFail History
JDK 11 < 1 sec
org.apache.tools.ant.BuildException: java.io.FileNotFoundException: C:\Users\bamboo\AppData\Local\Temp\RNDTEST-SOFTWARE-JDK11\surefire7650670692521780251\..%5C..%5C..%5C..%5C..%5C..%5C..%5Cbamboo%5Cxml-data%5Cbuild-dir%5CRNDTEST-SOFTWARE-JDK11%5Cjunit4-ant%5Ctarget%5Ctest-classes\junit4.xml (The system cannot find the path specified)
Caused by: java.io.FileNotFoundException: C:\Users\bamboo\AppData\Local\Temp\RNDTEST-SOFTWARE-JDK11\surefire7650670692521780251\..%5C..%5C..%5C..%5C..%5C..%5C..%5Cbamboo%5Cxml-data%5Cbuild-dir%5CRNDTEST-SOFTWARE-JDK11%5Cjunit4-ant%5Ctarget%5Ctest-classes\junit4.xml (The system cannot find the path specified)
Collapse Failed TestOnNonEmptyWorkDirectory tmpDirUnderCwd History
JDK 11 < 1 sec
org.apache.tools.ant.BuildException: java.io.FileNotFoundException: C:\Users\bamboo\AppData\Local\Temp\RNDTEST-SOFTWARE-JDK11\surefire7650670692521780251\..%5C..%5C..%5C..%5C..%5C..%5C..%5Cbamboo%5Cxml-data%5Cbuild-dir%5CRNDTEST-SOFTWARE-JDK11%5Cjunit4-ant%5Ctarget%5Ctest-classes\junit4.xml (The system cannot find the path specified)
Caused by: java.io.FileNotFoundException: C:\Users\bamboo\AppData\Local\Temp\RNDTEST-SOFTWARE-JDK11\surefire7650670692521780251\..%5C..%5C..%5C..%5C..%5C..%5C..%5Cbamboo%5Cxml-data%5Cbuild-dir%5CRNDTEST-SOFTWARE-JDK11%5Cjunit4-ant%5Ctarget%5Ctest-classes\junit4.xml (The system cannot find the path specified)
Collapse Failed TestOnNonEmptyWorkDirectory actionIgnore History
JDK 11 < 1 sec
org.apache.tools.ant.BuildException: java.io.FileNotFoundException: C:\Users\bamboo\AppData\Local\Temp\RNDTEST-SOFTWARE-JDK11\surefire7650670692521780251\..%5C..%5C..%5C..%5C..%5C..%5C..%5Cbamboo%5Cxml-data%5Cbuild-dir%5CRNDTEST-SOFTWARE-JDK11%5Cjunit4-ant%5Ctarget%5Ctest-classes\junit4.xml (The system cannot find the path specified)
Caused by: java.io.FileNotFoundException: C:\Users\bamboo\AppData\Local\Temp\RNDTEST-SOFTWARE-JDK11\surefire7650670692521780251\..%5C..%5C..%5C..%5C..%5C..%5C..%5Cbamboo%5Cxml-data%5Cbuild-dir%5CRNDTEST-SOFTWARE-JDK11%5Cjunit4-ant%5Ctarget%5Ctest-classes\junit4.xml (The system cannot find the path specified)
Collapse Failed TestOutputCapture staticScopeOutput History
JDK 10 < 1 sec
org.apache.tools.ant.BuildException: java.io.FileNotFoundException: C:\Users\bamboo\AppData\Local\Temp\RNDTEST-SOFTWARE-RRJ10\surefire12705780684809620788\..%5C..%5C..%5C..%5C..%5C..%5C..%5Cbamboo%5Cxml-data%5Cbuild-dir%5CRNDTEST-SOFTWARE-RRJ10%5Cjunit4-ant%5Ctarget%5Ctest-classes\junit4.xml (The system cannot find the path specified)
Caused by: java.io.FileNotFoundException: C:\Users\bamboo\AppData\Local\Temp\RNDTEST-SOFTWARE-RRJ10\surefire12705780684809620788\..%5C..%5C..%5C..%5C..%5C..%5C..%5Cbamboo%5Cxml-data%5Cbuild-dir%5CRNDTEST-SOFTWARE-RRJ10%5Cjunit4-ant%5Ctarget%5Ctest-classes\junit4.xml (The system cannot find the path specified)
Collapse Failed TestOutputCapture outofordersysouts History
JDK 10 < 1 sec
org.apache.tools.ant.BuildException: java.io.FileNotFoundException: C:\Users\bamboo\AppData\Local\Temp\RNDTEST-SOFTWARE-RRJ10\surefire12705780684809620788\..%5C..%5C..%5C..%5C..%5C..%5C..%5Cbamboo%5Cxml-data%5Cbuild-dir%5CRNDTEST-SOFTWARE-RRJ10%5Cjunit4-ant%5Ctarget%5Ctest-classes\junit4.xml (The system cannot find the path specified)
Caused by: java.io.FileNotFoundException: C:\Users\bamboo\AppData\Local\Temp\RNDTEST-SOFTWARE-RRJ10\surefire12705780684809620788\..%5C..%5C..%5C..%5C..%5C..%5C..%5Cbamboo%5Cxml-data%5Cbuild-dir%5CRNDTEST-SOFTWARE-RRJ10%5Cjunit4-ant%5Ctarget%5Ctest-classes\junit4.xml (The system cannot find the path specified)
Collapse Failed TestOutputCapture sysstreams History
JDK 10 < 1 sec
org.apache.tools.ant.BuildException: java.io.FileNotFoundException: C:\Users\bamboo\AppData\Local\Temp\RNDTEST-SOFTWARE-RRJ10\surefire12705780684809620788\..%5C..%5C..%5C..%5C..%5C..%5C..%5Cbamboo%5Cxml-data%5Cbuild-dir%5CRNDTEST-SOFTWARE-RRJ10%5Cjunit4-ant%5Ctarget%5Ctest-classes\junit4.xml (The system cannot find the path specified)
Caused by: java.io.FileNotFoundException: C:\Users\bamboo\AppData\Local\Temp\RNDTEST-SOFTWARE-RRJ10\surefire12705780684809620788\..%5C..%5C..%5C..%5C..%5C..%5C..%5Cbamboo%5Cxml-data%5Cbuild-dir%5CRNDTEST-SOFTWARE-RRJ10%5Cjunit4-ant%5Ctarget%5Ctest-classes\junit4.xml (The system cannot find the path specified)
Collapse Failed TestOutputCapture sysstreams History
JDK 11 < 1 sec
org.apache.tools.ant.BuildException: java.io.FileNotFoundException: C:\Users\bamboo\AppData\Local\Temp\RNDTEST-SOFTWARE-JDK11\surefire7650670692521780251\..%5C..%5C..%5C..%5C..%5C..%5C..%5Cbamboo%5Cxml-data%5Cbuild-dir%5CRNDTEST-SOFTWARE-JDK11%5Cjunit4-ant%5Ctarget%5Ctest-classes\junit4.xml (The system cannot find the path specified)
Caused by: java.io.FileNotFoundException: C:\Users\bamboo\AppData\Local\Temp\RNDTEST-SOFTWARE-JDK11\surefire7650670692521780251\..%5C..%5C..%5C..%5C..%5C..%5C..%5Cbamboo%5Cxml-data%5Cbuild-dir%5CRNDTEST-SOFTWARE-JDK11%5Cjunit4-ant%5Ctarget%5Ctest-classes\junit4.xml (The system cannot find the path specified)
Collapse Failed TestOutputCapture staticScopeOutput History
JDK 11 < 1 sec
org.apache.tools.ant.BuildException: java.io.FileNotFoundException: C:\Users\bamboo\AppData\Local\Temp\RNDTEST-SOFTWARE-JDK11\surefire7650670692521780251\..%5C..%5C..%5C..%5C..%5C..%5C..%5Cbamboo%5Cxml-data%5Cbuild-dir%5CRNDTEST-SOFTWARE-JDK11%5Cjunit4-ant%5Ctarget%5Ctest-classes\junit4.xml (The system cannot find the path specified)
Caused by: java.io.FileNotFoundException: C:\Users\bamboo\AppData\Local\Temp\RNDTEST-SOFTWARE-JDK11\surefire7650670692521780251\..%5C..%5C..%5C..%5C..%5C..%5C..%5Cbamboo%5Cxml-data%5Cbuild-dir%5CRNDTEST-SOFTWARE-JDK11%5Cjunit4-ant%5Ctarget%5Ctest-classes\junit4.xml (The system cannot find the path specified)
Collapse Failed TestOutputCapture outofordersysouts History
JDK 11 < 1 sec
org.apache.tools.ant.BuildException: java.io.FileNotFoundException: C:\Users\bamboo\AppData\Local\Temp\RNDTEST-SOFTWARE-JDK11\surefire7650670692521780251\..%5C..%5C..%5C..%5C..%5C..%5C..%5Cbamboo%5Cxml-data%5Cbuild-dir%5CRNDTEST-SOFTWARE-JDK11%5Cjunit4-ant%5Ctarget%5Ctest-classes\junit4.xml (The system cannot find the path specified)
Caused by: java.io.FileNotFoundException: C:\Users\bamboo\AppData\Local\Temp\RNDTEST-SOFTWARE-JDK11\surefire7650670692521780251\..%5C..%5C..%5C..%5C..%5C..%5C..%5Cbamboo%5Cxml-data%5Cbuild-dir%5CRNDTEST-SOFTWARE-JDK11%5Cjunit4-ant%5Ctarget%5Ctest-classes\junit4.xml (The system cannot find the path specified)
Collapse Failed TestPickSeed pickSeed History
JDK 10 < 1 sec
org.apache.tools.ant.BuildException: java.io.FileNotFoundException: C:\Users\bamboo\AppData\Local\Temp\RNDTEST-SOFTWARE-RRJ10\surefire12705780684809620788\..%5C..%5C..%5C..%5C..%5C..%5C..%5Cbamboo%5Cxml-data%5Cbuild-dir%5CRNDTEST-SOFTWARE-RRJ10%5Cjunit4-ant%5Ctarget%5Ctest-classes\junit4.xml (The system cannot find the path specified)
Caused by: java.io.FileNotFoundException: C:\Users\bamboo\AppData\Local\Temp\RNDTEST-SOFTWARE-RRJ10\surefire12705780684809620788\..%5C..%5C..%5C..%5C..%5C..%5C..%5Cbamboo%5Cxml-data%5Cbuild-dir%5CRNDTEST-SOFTWARE-RRJ10%5Cjunit4-ant%5Ctarget%5Ctest-classes\junit4.xml (The system cannot find the path specified)
Collapse Failed TestPickSeed pickSeed History
JDK 11 < 1 sec
org.apache.tools.ant.BuildException: java.io.FileNotFoundException: C:\Users\bamboo\AppData\Local\Temp\RNDTEST-SOFTWARE-JDK11\surefire7650670692521780251\..%5C..%5C..%5C..%5C..%5C..%5C..%5Cbamboo%5Cxml-data%5Cbuild-dir%5CRNDTEST-SOFTWARE-JDK11%5Cjunit4-ant%5Ctarget%5Ctest-classes\junit4.xml (The system cannot find the path specified)
Caused by: java.io.FileNotFoundException: C:\Users\bamboo\AppData\Local\Temp\RNDTEST-SOFTWARE-JDK11\surefire7650670692521780251\..%5C..%5C..%5C..%5C..%5C..%5C..%5Cbamboo%5Cxml-data%5Cbuild-dir%5CRNDTEST-SOFTWARE-JDK11%5Cjunit4-ant%5Ctarget%5Ctest-classes\junit4.xml (The system cannot find the path specified)
Collapse Failed TestPreconditions oldjunit History
JDK 10 < 1 sec
org.apache.tools.ant.BuildException: java.io.FileNotFoundException: C:\Users\bamboo\AppData\Local\Temp\RNDTEST-SOFTWARE-RRJ10\surefire12705780684809620788\..%5C..%5C..%5C..%5C..%5C..%5C..%5Cbamboo%5Cxml-data%5Cbuild-dir%5CRNDTEST-SOFTWARE-RRJ10%5Cjunit4-ant%5Ctarget%5Ctest-classes\junit4.xml (The system cannot find the path specified)
Caused by: java.io.FileNotFoundException: C:\Users\bamboo\AppData\Local\Temp\RNDTEST-SOFTWARE-RRJ10\surefire12705780684809620788\..%5C..%5C..%5C..%5C..%5C..%5C..%5Cbamboo%5Cxml-data%5Cbuild-dir%5CRNDTEST-SOFTWARE-RRJ10%5Cjunit4-ant%5Ctarget%5Ctest-classes\junit4.xml (The system cannot find the path specified)
Collapse Failed TestPreconditions nojunit History
JDK 10 < 1 sec
org.apache.tools.ant.BuildException: java.io.FileNotFoundException: C:\Users\bamboo\AppData\Local\Temp\RNDTEST-SOFTWARE-RRJ10\surefire12705780684809620788\..%5C..%5C..%5C..%5C..%5C..%5C..%5Cbamboo%5Cxml-data%5Cbuild-dir%5CRNDTEST-SOFTWARE-RRJ10%5Cjunit4-ant%5Ctarget%5Ctest-classes\junit4.xml (The system cannot find the path specified)
Caused by: java.io.FileNotFoundException: C:\Users\bamboo\AppData\Local\Temp\RNDTEST-SOFTWARE-RRJ10\surefire12705780684809620788\..%5C..%5C..%5C..%5C..%5C..%5C..%5Cbamboo%5Cxml-data%5Cbuild-dir%5CRNDTEST-SOFTWARE-RRJ10%5Cjunit4-ant%5Ctarget%5Ctest-classes\junit4.xml (The system cannot find the path specified)
Skipped tests 48
Status Test Failing since View job
Skipped TestAltJavaVendors altVendors History
JDK 1.8
Skipped TestAltJavaVendors altVendors History
JDK 1.8 IBM
Skipped TestAltJavaVendors altVendors History
JDK 9
Skipped TestOomCode oom History
JDK 10
Skipped TestOomCode oom History
JDK 11
Skipped TestOomCode oom History
JDK 1.8
Skipped TestOomCode oom History
JDK 1.8 IBM
Skipped TestOomCode oom History
JDK 9
Skipped TestOomPermGen oom History
JDK 10
Skipped TestOomPermGen oom History
JDK 11
Skipped TestOomPermGen oom History
JDK 1.8
Skipped TestOomPermGen oom History
JDK 1.8 IBM
Skipped TestOomPermGen oom History
JDK 9
Skipped TestStatusesIDE com.carrotsearch.ant.tasks.junit4.spikes.TestStatusesIDE History
JDK 10
Skipped TestStatusesIDE com.carrotsearch.ant.tasks.junit4.spikes.TestStatusesIDE History
JDK 11
Skipped TestStatusesIDE com.carrotsearch.ant.tasks.junit4.spikes.TestStatusesIDE History
JDK 1.8
Skipped TestStatusesIDE com.carrotsearch.ant.tasks.junit4.spikes.TestStatusesIDE History
JDK 1.8 IBM
Skipped TestStatusesIDE com.carrotsearch.ant.tasks.junit4.spikes.TestStatusesIDE History
JDK 9
Skipped TestMethodFilteringInIDEs testIgnoredByAssumption {seed=[DEADBEEF:A308044A602FC515]} History
JDK 10
Skipped TestMethodFilteringInIDEs testIgnoredByAnnotation {seed=[DEADBEEF:19095214BD83D06F]} History
JDK 10
Skipped TestMethodFilteringInIDEs testIgnoredByAnnotation {seed=[DEADBEEF:AD5FEEE889411B43]} History
JDK 10
Skipped TestMethodFilteringInIDEs testIgnoredByAssumption {seed=[DEADBEEF:175EB8B654ED0E39]} History
JDK 10
Skipped TestMethodFilteringInIDEs testIgnoredByAnnotation {seed=[DEADBEEF:19095214BD83D06F]} History
JDK 11
Skipped TestMethodFilteringInIDEs testIgnoredByAnnotation {seed=[DEADBEEF:AD5FEEE889411B43]} History
JDK 11
Skipped TestMethodFilteringInIDEs testIgnoredByAssumption {seed=[DEADBEEF:A308044A602FC515]} History
JDK 11
Skipped TestMethodFilteringInIDEs testIgnoredByAssumption {seed=[DEADBEEF:175EB8B654ED0E39]} History
JDK 11
Skipped TestMethodFilteringInIDEs testIgnoredByAnnotation {seed=[DEADBEEF:19095214BD83D06F]} History
JDK 1.8
Skipped TestMethodFilteringInIDEs testIgnoredByAssumption {seed=[DEADBEEF:A308044A602FC515]} History
JDK 1.8
Skipped TestMethodFilteringInIDEs testIgnoredByAnnotation {seed=[DEADBEEF:AD5FEEE889411B43]} History
JDK 1.8
Skipped TestMethodFilteringInIDEs testIgnoredByAssumption {seed=[DEADBEEF:175EB8B654ED0E39]} History
JDK 1.8
Skipped TestMethodFilteringInIDEs testIgnoredByAnnotation {seed=[DEADBEEF:AD5FEEE889411B43]} History
JDK 1.8 IBM
Skipped TestMethodFilteringInIDEs testIgnoredByAnnotation {seed=[DEADBEEF:19095214BD83D06F]} History
JDK 1.8 IBM
Skipped TestMethodFilteringInIDEs testIgnoredByAssumption {seed=[DEADBEEF:A308044A602FC515]} History
JDK 1.8 IBM
Skipped TestMethodFilteringInIDEs testIgnoredByAssumption {seed=[DEADBEEF:175EB8B654ED0E39]} History
JDK 1.8 IBM
Skipped TestMethodFilteringInIDEs testIgnoredByAnnotation {seed=[DEADBEEF:AD5FEEE889411B43]} History
JDK 9
Skipped TestMethodFilteringInIDEs testIgnoredByAnnotation {seed=[DEADBEEF:19095214BD83D06F]} History
JDK 9
Skipped TestMethodFilteringInIDEs testIgnoredByAssumption {seed=[DEADBEEF:175EB8B654ED0E39]} History
JDK 9
Skipped TestMethodFilteringInIDEs testIgnoredByAssumption {seed=[DEADBEEF:A308044A602FC515]} History
JDK 9
Skipped TestStaticFieldsInvariantRule testJava9Jigsaw History
JDK 10
Skipped TestStaticFieldsInvariantRule testJava9Jigsaw History
JDK 11
Skipped TestStaticFieldsInvariantRule testJava9Jigsaw History
JDK 1.8
Skipped TestStaticFieldsInvariantRule testJava9Jigsaw History
JDK 1.8 IBM
Skipped TestStaticFieldsInvariantRule testJava9Jigsaw History
JDK 9
Skipped TestContextRandom testFixedSeedSubthreads History
JDK 10
Skipped TestContextRandom testFixedSeedSubthreads History
JDK 11
Skipped TestContextRandom testFixedSeedSubthreads History
JDK 1.8
Skipped TestContextRandom testFixedSeedSubthreads History
JDK 1.8 IBM
Skipped TestContextRandom testFixedSeedSubthreads History
JDK 9