Build #228

Build: #228 failed Changes by Dawid Weiss

Stages & jobs

  1. Compile and test

  2. Package

Logs

The following logs have been generated by the jobs in this plan.
  • Expand all
  • Collapse all
Job Logs
Collapse JDK 10 Compile and test Download or View
20-Nov-2018 10:46:29 [INFO] RandomizedTesting JUnit4 Maven Plugin .............. SKIPPED
20-Nov-2018 10:46:29 [INFO] RandomizedTesting JUnit4 Maven Plugin Tests ........ SKIPPED
20-Nov-2018 10:46:29 [INFO] RandomizedTesting Examples ......................... SKIPPED
20-Nov-2018 10:46:29 [INFO] RandomizedTesting ANT Examples ..................... SKIPPED
20-Nov-2018 10:46:29 [INFO] RandomizedTesting Security Manager Example 2.7.1-SNAPSHOT SKIPPED
20-Nov-2018 10:46:29 [INFO] ------------------------------------------------------------------------
20-Nov-2018 10:46:29 [INFO] BUILD FAILURE
20-Nov-2018 10:46:29 [INFO] ------------------------------------------------------------------------
20-Nov-2018 10:46:29 [INFO] Total time: 53.992 s
20-Nov-2018 10:46:29 [INFO] Finished at: 2018-11-20T10:46:29+01:00
20-Nov-2018 10:46:29 [INFO] ------------------------------------------------------------------------
20-Nov-2018 10:46:29 [ERROR] Failed to execute goal org.apache.maven.plugins:maven-surefire-plugin:3.0.0-M1:test (surefire-it) on project junit4-ant: There are test failures.
20-Nov-2018 10:46:29 [ERROR]
20-Nov-2018 10:46:29 [ERROR] Please refer to C:\bamboo\xml-data\build-dir\RNDTEST-SOFTWARE-RRJ10\junit4-ant\target\surefire-reports for the individual test results.
20-Nov-2018 10:46:29 [ERROR] Please refer to dump files (if any exist) [date].dump, [date]-jvmRun[N].dump and [date].dumpstream.
20-Nov-2018 10:46:29 [ERROR] -> [Help 1]
20-Nov-2018 10:46:29 [ERROR]
20-Nov-2018 10:46:29 [ERROR] To see the full stack trace of the errors, re-run Maven with the -e switch.
20-Nov-2018 10:46:29 [ERROR] Re-run Maven using the -X switch to enable full debug logging.
20-Nov-2018 10:46:29 [ERROR]
20-Nov-2018 10:46:29 [ERROR] For more information about the errors and possible solutions, please read the following articles:
20-Nov-2018 10:46:29 [ERROR] [Help 1] http://cwiki.apache.org/confluence/display/MAVEN/MojoFailureException
20-Nov-2018 10:46:29 [ERROR]
20-Nov-2018 10:46:29 [ERROR] After correcting the problems, you can resume the build with the command
20-Nov-2018 10:46:29 [ERROR]   mvn <goals> -rf :junit4-ant
Collapse JDK 11 Compile and test Download or View
20-Nov-2018 10:46:29 [INFO] RandomizedTesting JUnit4 Maven Plugin .............. SKIPPED
20-Nov-2018 10:46:29 [INFO] RandomizedTesting JUnit4 Maven Plugin Tests ........ SKIPPED
20-Nov-2018 10:46:29 [INFO] RandomizedTesting Examples ......................... SKIPPED
20-Nov-2018 10:46:29 [INFO] RandomizedTesting ANT Examples ..................... SKIPPED
20-Nov-2018 10:46:29 [INFO] RandomizedTesting Security Manager Example 2.7.1-SNAPSHOT SKIPPED
20-Nov-2018 10:46:29 [INFO] ------------------------------------------------------------------------
20-Nov-2018 10:46:29 [INFO] BUILD FAILURE
20-Nov-2018 10:46:29 [INFO] ------------------------------------------------------------------------
20-Nov-2018 10:46:29 [INFO] Total time: 53.898 s
20-Nov-2018 10:46:29 [INFO] Finished at: 2018-11-20T10:46:29+01:00
20-Nov-2018 10:46:29 [INFO] ------------------------------------------------------------------------
20-Nov-2018 10:46:29 [ERROR] Failed to execute goal org.apache.maven.plugins:maven-surefire-plugin:3.0.0-M1:test (surefire-it) on project junit4-ant: There are test failures.
20-Nov-2018 10:46:29 [ERROR]
20-Nov-2018 10:46:29 [ERROR] Please refer to C:\bamboo\xml-data\build-dir\RNDTEST-SOFTWARE-JDK11\junit4-ant\target\surefire-reports for the individual test results.
20-Nov-2018 10:46:29 [ERROR] Please refer to dump files (if any exist) [date].dump, [date]-jvmRun[N].dump and [date].dumpstream.
20-Nov-2018 10:46:29 [ERROR] -> [Help 1]
20-Nov-2018 10:46:29 [ERROR]
20-Nov-2018 10:46:29 [ERROR] To see the full stack trace of the errors, re-run Maven with the -e switch.
20-Nov-2018 10:46:29 [ERROR] Re-run Maven using the -X switch to enable full debug logging.
20-Nov-2018 10:46:29 [ERROR]
20-Nov-2018 10:46:29 [ERROR] For more information about the errors and possible solutions, please read the following articles:
20-Nov-2018 10:46:29 [ERROR] [Help 1] http://cwiki.apache.org/confluence/display/MAVEN/MojoFailureException
20-Nov-2018 10:46:29 [ERROR]
20-Nov-2018 10:46:29 [ERROR] After correcting the problems, you can resume the build with the command
20-Nov-2018 10:46:29 [ERROR]   mvn <goals> -rf :junit4-ant