Build #184

Build: #184 failed Changes by Dawid Weiss

Stages & jobs

  1. Compile and test

  2. Package

Logs

The following logs have been generated by the jobs in this plan.
  • Expand all
  • Collapse all
Job Logs
Collapse JDK 1.7 Compile and test Download or View
08-May-2018 10:55:55 [INFO] RandomizedTesting JUnit4 Maven Plugin .............. SKIPPED
08-May-2018 10:55:55 [INFO] RandomizedTesting JUnit4 Maven Plugin Tests ........ SKIPPED
08-May-2018 10:55:55 [INFO] RandomizedTesting Examples ......................... SKIPPED
08-May-2018 10:55:55 [INFO] RandomizedTesting ANT Examples ..................... SKIPPED
08-May-2018 10:55:55 [INFO] RandomizedTesting Security Manager Example ......... SKIPPED
08-May-2018 10:55:55 [INFO] ------------------------------------------------------------------------
08-May-2018 10:55:55 [INFO] BUILD FAILURE
08-May-2018 10:55:55 [INFO] ------------------------------------------------------------------------
08-May-2018 10:55:55 [INFO] Total time: 43.823 s
08-May-2018 10:55:55 [INFO] Finished at: 2018-05-08T09:55:55+01:00
08-May-2018 10:55:55 [INFO] Final Memory: 25M/962M
08-May-2018 10:55:55 [INFO] ------------------------------------------------------------------------
08-May-2018 10:55:55 [ERROR] Failed to execute goal org.apache.maven.plugins:maven-surefire-plugin:2.19.1:test (default-test) on project randomizedtesting-runner: There are test failures.
08-May-2018 10:55:55 [ERROR]
08-May-2018 10:55:55 [ERROR] Please refer to /var/atlassian/application-data/bamboo/xml-data/build-dir/RNDTEST-SOFTWARE-JDK17/randomized-runner/target/surefire-reports for the individual test results.
08-May-2018 10:55:55 [ERROR] -> [Help 1]
08-May-2018 10:55:55 [ERROR]
08-May-2018 10:55:55 [ERROR] To see the full stack trace of the errors, re-run Maven with the -e switch.
08-May-2018 10:55:55 [ERROR] Re-run Maven using the -X switch to enable full debug logging.
08-May-2018 10:55:55 [ERROR]
08-May-2018 10:55:55 [ERROR] For more information about the errors and possible solutions, please read the following articles:
08-May-2018 10:55:55 [ERROR] [Help 1] http://cwiki.apache.org/confluence/display/MAVEN/MojoFailureException
08-May-2018 10:55:55 [ERROR]
08-May-2018 10:55:55 [ERROR] After correcting the problems, you can resume the build with the command
08-May-2018 10:55:55 [ERROR]   mvn <goals> -rf :randomizedtesting-runner
Collapse JDK 11 J9 Compile and test Download or View
08-May-2018 10:55:12 Unable to find executable at /home/bamboo/jvms/maven/bin/mvn. Will try to run it anyway.
Collapse JDK 9 Compile and test Download or View
08-May-2018 10:58:58 [INFO] RandomizedTesting JUnit4 Maven Plugin .............. SUCCESS [  4.216 s]
08-May-2018 10:58:58 [INFO] RandomizedTesting JUnit4 Maven Plugin Tests ........ SUCCESS [ 14.217 s]
08-May-2018 10:58:58 [INFO] RandomizedTesting Examples ......................... SUCCESS [  7.959 s]
08-May-2018 10:58:58 [INFO] RandomizedTesting ANT Examples ..................... FAILURE [  0.334 s]
08-May-2018 10:58:58 [INFO] RandomizedTesting Security Manager Example ......... SKIPPED
08-May-2018 10:58:58 [INFO] ------------------------------------------------------------------------
08-May-2018 10:58:58 [INFO] BUILD FAILURE
08-May-2018 10:58:58 [INFO] ------------------------------------------------------------------------
08-May-2018 10:58:58 [INFO] Total time: 02:52 min
08-May-2018 10:58:58 [INFO] Finished at: 2018-05-08T10:58:58+02:00
08-May-2018 10:58:58 [INFO] Final Memory: 51M/168M
08-May-2018 10:58:58 [INFO] ------------------------------------------------------------------------
08-May-2018 10:58:58 [ERROR] Failed to execute goal org.apache.maven.plugins:maven-antrun-plugin:1.8:run (ant-run-tests) on project randomizedtesting-examples-ant: An Ant BuildException has occured: The following error occurred while executing this line:
08-May-2018 10:58:58 [ERROR] /var/atlassian/application-data/bamboo/xml-data/build-dir/RNDTEST-SOFTWARE-JDK19/examples/ant/build.xml:63: java.lang.IllegalArgumentException
08-May-2018 10:58:58 [ERROR] around Ant part ...<ant antfile="/var/atlassian/application-data/bamboo/xml-data/build-dir/RNDTEST-SOFTWARE-JDK19/examples/ant/build.xml" inheritRefs="true" inheritAll="true" target="test"/>... @ 4:174 in /var/atlassian/application-data/bamboo/xml-data/build-dir/RNDTEST-SOFTWARE-JDK19/examples/ant/target/antrun/build-main.xml
08-May-2018 10:58:58 [ERROR] -> [Help 1]
08-May-2018 10:58:58 [ERROR]
08-May-2018 10:58:58 [ERROR] To see the full stack trace of the errors, re-run Maven with the -e switch.
08-May-2018 10:58:58 [ERROR] Re-run Maven using the -X switch to enable full debug logging.
08-May-2018 10:58:58 [ERROR]
08-May-2018 10:58:58 [ERROR] For more information about the errors and possible solutions, please read the following articles:
08-May-2018 10:58:58 [ERROR] [Help 1] http://cwiki.apache.org/confluence/display/MAVEN/MojoExecutionException
08-May-2018 10:58:58 [ERROR]
08-May-2018 10:58:58 [ERROR] After correcting the problems, you can resume the build with the command
08-May-2018 10:58:58 [ERROR]   mvn <goals> -rf :randomizedtesting-examples-ant