Build #133

Build: #133 failed Changes by Dawid Weiss

Stages & jobs

  1. Compile and test

  2. Package

Logs

The following logs have been generated by the jobs in this plan.
  • Expand all
  • Collapse all
Job Logs
Collapse JDK 1.7 Compile and test Download or View
07-Oct-2016 11:48:38 [INFO] RandomizedTesting JUnit4 Maven Plugin .............. SKIPPED
07-Oct-2016 11:48:38 [INFO] RandomizedTesting JUnit4 Maven Plugin Tests ........ SKIPPED
07-Oct-2016 11:48:38 [INFO] RandomizedTesting Examples ......................... SKIPPED
07-Oct-2016 11:48:38 [INFO] RandomizedTesting ANT Examples ..................... SKIPPED
07-Oct-2016 11:48:38 [INFO] RandomizedTesting Security Manager Example ......... SKIPPED
07-Oct-2016 11:48:38 [INFO] ------------------------------------------------------------------------
07-Oct-2016 11:48:38 [INFO] BUILD FAILURE
07-Oct-2016 11:48:38 [INFO] ------------------------------------------------------------------------
07-Oct-2016 11:48:38 [INFO] Total time: 39.911 s
07-Oct-2016 11:48:38 [INFO] Finished at: 2016-10-07T11:48:38+02:00
07-Oct-2016 11:48:38 [INFO] Final Memory: 16M/481M
07-Oct-2016 11:48:38 [INFO] ------------------------------------------------------------------------
07-Oct-2016 11:48:38 [ERROR] Failed to execute goal org.apache.maven.plugins:maven-surefire-plugin:2.18.1:test (default-test) on project randomizedtesting-runner: There are test failures.
07-Oct-2016 11:48:38 [ERROR]
07-Oct-2016 11:48:38 [ERROR] Please refer to /mnt/work/bamboo-home/xml-data/build-dir/RNDTEST-SOFTWARE-JDK17/randomized-runner/target/surefire-reports for the individual test results.
07-Oct-2016 11:48:38 [ERROR] -> [Help 1]
07-Oct-2016 11:48:38 [ERROR]
07-Oct-2016 11:48:38 [ERROR] To see the full stack trace of the errors, re-run Maven with the -e switch.
07-Oct-2016 11:48:38 [ERROR] Re-run Maven using the -X switch to enable full debug logging.
07-Oct-2016 11:48:38 [ERROR]
07-Oct-2016 11:48:38 [ERROR] For more information about the errors and possible solutions, please read the following articles:
07-Oct-2016 11:48:38 [ERROR] [Help 1] http://cwiki.apache.org/confluence/display/MAVEN/MojoFailureException
07-Oct-2016 11:48:38 [ERROR]
07-Oct-2016 11:48:38 [ERROR] After correcting the problems, you can resume the build with the command
07-Oct-2016 11:48:38 [ERROR]   mvn <goals> -rf :randomizedtesting-runner
Collapse JDK 1.8 Compile and test Download or View
07-Oct-2016 11:48:34 [INFO] RandomizedTesting JUnit4 Maven Plugin .............. SKIPPED
07-Oct-2016 11:48:34 [INFO] RandomizedTesting JUnit4 Maven Plugin Tests ........ SKIPPED
07-Oct-2016 11:48:34 [INFO] RandomizedTesting Examples ......................... SKIPPED
07-Oct-2016 11:48:34 [INFO] RandomizedTesting ANT Examples ..................... SKIPPED
07-Oct-2016 11:48:34 [INFO] RandomizedTesting Security Manager Example ......... SKIPPED
07-Oct-2016 11:48:34 [INFO] ------------------------------------------------------------------------
07-Oct-2016 11:48:34 [INFO] BUILD FAILURE
07-Oct-2016 11:48:34 [INFO] ------------------------------------------------------------------------
07-Oct-2016 11:48:34 [INFO] Total time: 37.896 s
07-Oct-2016 11:48:34 [INFO] Finished at: 2016-10-07T11:48:34+02:00
07-Oct-2016 11:48:34 [INFO] Final Memory: 19M/413M
07-Oct-2016 11:48:34 [INFO] ------------------------------------------------------------------------
07-Oct-2016 11:48:34 [ERROR] Failed to execute goal org.apache.maven.plugins:maven-surefire-plugin:2.18.1:test (default-test) on project randomizedtesting-runner: There are test failures.
07-Oct-2016 11:48:34 [ERROR]
07-Oct-2016 11:48:34 [ERROR] Please refer to /mnt/work/bamboo-home/xml-data/build-dir/RNDTEST-SOFTWARE-JDK18/randomized-runner/target/surefire-reports for the individual test results.
07-Oct-2016 11:48:34 [ERROR] -> [Help 1]
07-Oct-2016 11:48:34 [ERROR]
07-Oct-2016 11:48:34 [ERROR] To see the full stack trace of the errors, re-run Maven with the -e switch.
07-Oct-2016 11:48:34 [ERROR] Re-run Maven using the -X switch to enable full debug logging.
07-Oct-2016 11:48:34 [ERROR]
07-Oct-2016 11:48:34 [ERROR] For more information about the errors and possible solutions, please read the following articles:
07-Oct-2016 11:48:34 [ERROR] [Help 1] http://cwiki.apache.org/confluence/display/MAVEN/MojoFailureException
07-Oct-2016 11:48:34 [ERROR]
07-Oct-2016 11:48:34 [ERROR] After correcting the problems, you can resume the build with the command
07-Oct-2016 11:48:34 [ERROR]   mvn <goals> -rf :randomizedtesting-runner
Collapse JDK 11 J9 Compile and test Download or View
07-Oct-2016 11:48:36 [INFO] RandomizedTesting JUnit4 Maven Plugin .............. SKIPPED
07-Oct-2016 11:48:36 [INFO] RandomizedTesting JUnit4 Maven Plugin Tests ........ SKIPPED
07-Oct-2016 11:48:36 [INFO] RandomizedTesting Examples ......................... SKIPPED
07-Oct-2016 11:48:36 [INFO] RandomizedTesting ANT Examples ..................... SKIPPED
07-Oct-2016 11:48:36 [INFO] RandomizedTesting Security Manager Example ......... SKIPPED
07-Oct-2016 11:48:36 [INFO] ------------------------------------------------------------------------
07-Oct-2016 11:48:36 [INFO] BUILD FAILURE
07-Oct-2016 11:48:36 [INFO] ------------------------------------------------------------------------
07-Oct-2016 11:48:36 [INFO] Total time: 40.979 s
07-Oct-2016 11:48:36 [INFO] Finished at: 2016-10-07T11:48:36+02:00
07-Oct-2016 11:48:36 [INFO] Final Memory: 18M/39M
07-Oct-2016 11:48:36 [INFO] ------------------------------------------------------------------------
07-Oct-2016 11:48:36 [ERROR] Failed to execute goal org.apache.maven.plugins:maven-surefire-plugin:2.18.1:test (default-test) on project randomizedtesting-runner: There are test failures.
07-Oct-2016 11:48:36 [ERROR]
07-Oct-2016 11:48:36 [ERROR] Please refer to /mnt/work/bamboo-home/xml-data/build-dir/RNDTEST-SOFTWARE-IBM17/randomized-runner/target/surefire-reports for the individual test results.
07-Oct-2016 11:48:36 [ERROR] -> [Help 1]
07-Oct-2016 11:48:36 [ERROR]
07-Oct-2016 11:48:36 [ERROR] To see the full stack trace of the errors, re-run Maven with the -e switch.
07-Oct-2016 11:48:36 [ERROR] Re-run Maven using the -X switch to enable full debug logging.
07-Oct-2016 11:48:36 [ERROR]
07-Oct-2016 11:48:36 [ERROR] For more information about the errors and possible solutions, please read the following articles:
07-Oct-2016 11:48:36 [ERROR] [Help 1] http://cwiki.apache.org/confluence/display/MAVEN/MojoFailureException
07-Oct-2016 11:48:36 [ERROR]
07-Oct-2016 11:48:36 [ERROR] After correcting the problems, you can resume the build with the command
07-Oct-2016 11:48:36 [ERROR]   mvn <goals> -rf :randomizedtesting-runner