Build: #3 failed Manual run by Dawid Weiss

Stages & jobs

  1. check linux

  2. check platforms

Logs

The following logs have been generated by the jobs in this plan.
  • Expand all
  • Collapse all
Job Logs
Collapse check-linux check linux Download or View
06-Jun-2019 12:24:39 > Task :clean
06-Jun-2019 12:24:40 > Task :spotlessJava
06-Jun-2019 12:24:40 > Task :spotlessJavaCheck
06-Jun-2019 12:24:40 > Task :spotlessCheck
06-Jun-2019 12:24:40 > Task :compileJava FAILED
06-Jun-2019 12:24:40
06-Jun-2019 12:24:40 FAILURE: Build failed with an exception.
06-Jun-2019 12:24:40
06-Jun-2019 12:24:40 * What went wrong:
06-Jun-2019 12:24:40 Execution failed for task ':compileJava'.
06-Jun-2019 12:24:40 > Could not target platform: 'Java SE 9' using tool chain: 'JDK 8 (1.8)'.
06-Jun-2019 12:24:40
06-Jun-2019 12:24:40 * Try:
06-Jun-2019 12:24:40 Run with --stacktrace option to get the stack trace. Run with --info or --debug option to get more log output. Run with --scan to get full insights.
06-Jun-2019 12:24:40
06-Jun-2019 12:24:40 * Get more help at https://help.gradle.org
06-Jun-2019 12:24:40
06-Jun-2019 12:24:40 BUILD FAILED in 19s
06-Jun-2019 12:24:40 3 actionable tasks: 3 executed