Build: #22 failed Changes by Dawid Weiss

Stages & jobs

  1. check linux

  2. check platforms

Build result summary

Details

Completed
Duration
10 seconds
Labels
None
Revision
f63583659ce0d663c69509c6532ab997a74c617a f63583659ce0d663c69509c6532ab997a74c617a
Total tests
5
Failing since
#18 (Changes by Dawid Weiss)
Fixed in
#23 (Changes by Dawid Weiss)

Tests

Responsible

Code commits

Author Commit Message Commit date
Dawid Weiss Dawid Weiss f63583659ce0d663c69509c6532ab997a74c617a f63583659ce0d663c69509c6532ab997a74c617a Set perms on generated sh

Tests

Existing test failures 2
Status Test Failing since View job Duration
java.lang.IllegalArgumentException: java.lang.IllegalArgumentException: Invalid mode
java.lang.IllegalArgumentException: Invalid mode
	at __randomizedtesting.SeedInfo.seed([5CE81AF61B9DA544:7947EF6F2FB90947]:0)
	at java.base/java.nio.file.attribute.PosixFilePermissions.fromString(PosixFilePermissions.java:128)
	at com.carrotsearch.procfork.TestAllPlatforms.testSpaceInPathAndArgument(TestAllPlatforms.java:52)
	at java.base/jdk.internal.reflect.NativeMethodAccessorImpl.invoke0(Native Method)
	at java.base/jdk.internal.reflect.NativeMethodAccessorImpl.invoke(NativeMethodAccessorImpl.java:62)
	at java.base/jdk.internal.reflect.DelegatingMethodAccessorImpl.invoke(DelegatingMethodAccessorImpl.java:43)
(14 more lines...)
java.lang.IllegalArgumentException: java.lang.IllegalArgumentException: Invalid mode
java.lang.IllegalArgumentException: Invalid mode
	at __randomizedtesting.SeedInfo.seed([5CE81AF61B9DA544:1F9A21567AD61777]:0)
	at java.base/java.nio.file.attribute.PosixFilePermissions.fromString(PosixFilePermissions.java:128)
	at com.carrotsearch.procfork.TestAllPlatforms.testSpaceInPathAndNoArguments(TestAllPlatforms.java:92)
	at java.base/jdk.internal.reflect.NativeMethodAccessorImpl.invoke0(Native Method)
	at java.base/jdk.internal.reflect.NativeMethodAccessorImpl.invoke(NativeMethodAccessorImpl.java:62)
	at java.base/jdk.internal.reflect.DelegatingMethodAccessorImpl.invoke(DelegatingMethodAccessorImpl.java:43)
(14 more lines...)