Build: #21 failed Manual run by Dawid Weiss

Stages & jobs

  1. check linux

  2. check platforms

Test results

  • 5 tests in total
  • 2 tests failed
  • 1 test was fixed
  • 2 seconds taken in total.
Existing test failures 2
Status Test Failing since View job Duration
java.lang.AssertionError: java.lang.AssertionError: 
Expecting:
  <"script.sh: 1: script.sh: /tmp/tests-20210329104316-756/0003 has-space/New Folder (2)/script.sh: Permission denied
">
to be equal to:
  <"1=one and two 2=three">
ignoring whitespace differences
java.lang.AssertionError: 
(25 more lines...)
java.lang.AssertionError: java.lang.AssertionError: 
Expecting:
  <"script.sh: 1: script.sh: /tmp/tests-20210329104316-756/0001 has-space/New Folder (2)/script.sh: Permission denied
">
to be equal to:
  <"args: ">
ignoring whitespace differences
java.lang.AssertionError: 
(25 more lines...)
Fixed tests 1
Status Test Failing since View job Duration
Successful TestAllPlatforms testEcho History
Failing since build #19 (Changes by Dawid Weiss) check-linux < 1 sec