Build: #20 failed Changes by Dawid Weiss

Stages & jobs

  1. check linux

  2. check platforms

Build result summary

Details

Completed
Duration
9 seconds
Labels
None
Revision
62c1a0c17fb80f5118e78f6cae6e7419a10710ba 62c1a0c17fb80f5118e78f6cae6e7419a10710ba
Total tests
5
Failing since
#18 (Changes by Dawid Weiss)
Fixed in
#23 (Changes by Dawid Weiss)

Tests

Responsible

Code commits

Author Commit Message Commit date
Dawid Weiss Dawid Weiss 62c1a0c17fb80f5118e78f6cae6e7419a10710ba 62c1a0c17fb80f5118e78f6cae6e7419a10710ba Bump version to 1.0.6-SNAPSHOT
Dawid Weiss Dawid Weiss 35c95118f4ecf1a3ffa24da8612615fa33c8e99b 35c95118f4ecf1a3ffa24da8612615fa33c8e99b Change sonatype deployment server.

Tests

Existing test failures 3
Status Test Failing since View job Duration
java.lang.AssertionError: java.lang.AssertionError: 
Expecting:
  <"
">
to be equal to:
  <"foo bar">
ignoring newlines (\n, \r\n).
java.lang.AssertionError: 
(25 more lines...)
java.lang.AssertionError: java.lang.AssertionError: 
Expecting:
  <"script.sh: 1: script.sh: /tmp/tests-20210329101751-247/0003 has-space/New Folder (2)/script.sh: Permission denied
">
to be equal to:
  <"1=one and two 2=three">
ignoring whitespace differences
java.lang.AssertionError: 
(25 more lines...)
java.lang.AssertionError: java.lang.AssertionError: 
Expecting:
  <"script.sh: 1: script.sh: /tmp/tests-20210329101751-247/0001 has-space/New Folder (2)/script.sh: Permission denied
">
to be equal to:
  <"args: ">
ignoring whitespace differences
java.lang.AssertionError: 
(25 more lines...)