Build: #19 failed Changes by Dawid Weiss

Stages & jobs

  1. check linux

  2. check platforms

Test results

  • 5 tests in total
  • 3 tests failed
  • 3 failures are new
  • 1 second taken in total.
New test failures 3
Status Test View job Duration
Collapse Failed TestAllPlatforms testEcho History
check-linux < 1 sec
java.lang.AssertionError: java.lang.AssertionError: 
Expecting:
  <"
">
to be equal to:
  <"foo bar">
ignoring newlines (\n, \r\n).
java.lang.AssertionError: 
(25 more lines...)
Collapse Failed TestAllPlatforms testSpaceInPathAndArgument History
check-linux < 1 sec
java.lang.AssertionError: java.lang.AssertionError: 
Expecting:
  <"script.sh: 1: script.sh: /tmp/tests-20210329101452-434/0003 has-space/New Folder (2)/script.sh: Permission denied
">
to be equal to:
  <"1=one and two 2=three">
ignoring whitespace differences
java.lang.AssertionError: 
(25 more lines...)
Collapse Failed TestAllPlatforms testSpaceInPathAndNoArguments History
check-linux < 1 sec
java.lang.AssertionError: java.lang.AssertionError: 
Expecting:
  <"script.sh: 1: script.sh: /tmp/tests-20210329101452-434/0001 has-space/New Folder (2)/script.sh: Permission denied
">
to be equal to:
  <"args: ">
ignoring whitespace differences
java.lang.AssertionError: 
(25 more lines...)