Build: #19 failed Changes by Dawid Weiss

Stages & jobs

  1. check linux

  2. check platforms

Build result summary

Details

Completed
Duration
11 seconds
Labels
None
Revision
26f61085bf88bb4413c313750f06f9d816e13fa4 26f61085bf88bb4413c313750f06f9d816e13fa4
Total tests
5
Failing since
#18 (Changes by Dawid Weiss)
Fixed in
#23 (Changes by Dawid Weiss)

Tests

Responsible

Code commits

Author Commit Message Commit date
Dawid Weiss Dawid Weiss 26f61085bf88bb4413c313750f06f9d816e13fa4 26f61085bf88bb4413c313750f06f9d816e13fa4 Bump version to 1.0.5
Dawid Weiss Dawid Weiss 4efc26186eb30f88e5205001c55b7a6a319c8923 4efc26186eb30f88e5205001c55b7a6a319c8923 #1 Windows shell launcher and spaces in both executable and arguments

Tests

New test failures 3
Status Test View job Duration
Collapse Failed TestAllPlatforms testEcho History
check-linux < 1 sec
java.lang.AssertionError: java.lang.AssertionError: 
Expecting:
  <"
">
to be equal to:
  <"foo bar">
ignoring newlines (\n, \r\n).
java.lang.AssertionError: 
(25 more lines...)
Collapse Failed TestAllPlatforms testSpaceInPathAndArgument History
check-linux < 1 sec
java.lang.AssertionError: java.lang.AssertionError: 
Expecting:
  <"script.sh: 1: script.sh: /tmp/tests-20210329101452-434/0003 has-space/New Folder (2)/script.sh: Permission denied
">
to be equal to:
  <"1=one and two 2=three">
ignoring whitespace differences
java.lang.AssertionError: 
(25 more lines...)
Collapse Failed TestAllPlatforms testSpaceInPathAndNoArguments History
check-linux < 1 sec
java.lang.AssertionError: java.lang.AssertionError: 
Expecting:
  <"script.sh: 1: script.sh: /tmp/tests-20210329101452-434/0001 has-space/New Folder (2)/script.sh: Permission denied
">
to be equal to:
  <"args: ">
ignoring whitespace differences
java.lang.AssertionError: 
(25 more lines...)