Carrot2 ES plugin integration

Build: #52 failed Manual run by Dawid Weiss

Logs

The following logs have been generated by the jobs in this plan.
  • Expand all
  • Collapse all
Job Logs
Collapse Default Job Default Stage Download or View
14-Nov-2016 12:49:11 [INFO] --- forbiddenapis:2.0:testCheck (check-forbidden-test-apis) @ elasticsearch-carrot2 ---
14-Nov-2016 12:49:11 [INFO] Scanning for classes to check...
14-Nov-2016 12:49:11 [INFO] Reading bundled API signatures: jdk-unsafe-1.7
14-Nov-2016 12:49:11 [INFO] Reading bundled API signatures: jdk-deprecated-1.7
14-Nov-2016 12:49:11 [INFO] Reading API signatures: /mnt/work/bamboo-home/xml-data/build-dir/MISC-ESC2-JOB1/target/dev-tools/forbidden/test-signatures.txt
14-Nov-2016 12:49:11 [INFO] Reading API signatures: /mnt/work/bamboo-home/xml-data/build-dir/MISC-ESC2-JOB1/target/dev-tools/forbidden/all-signatures.txt
14-Nov-2016 12:49:11 [INFO] Loading classes to check...
14-Nov-2016 12:49:11 [INFO] Scanning classes for violations...
14-Nov-2016 12:49:11 [ERROR] Forbidden annotation use: org.junit.Ignore [Use AwaitsFix instead]
14-Nov-2016 12:49:11 [ERROR]   in org.carrot2.elasticsearch.ClusteringActionRestIT (ClusteringActionRestIT.java, annotation on method declaration of 'testPostWithClusters()')
14-Nov-2016 12:49:11 [ERROR] Scanned 12 (and 384 related) class file(s) for forbidden API invocations (in 0.08s), 1 error(s).
14-Nov-2016 12:49:11 [INFO] ------------------------------------------------------------------------
14-Nov-2016 12:49:11 [INFO] BUILD FAILURE
14-Nov-2016 12:49:11 [INFO] ------------------------------------------------------------------------
14-Nov-2016 12:49:11 [INFO] Total time: 8.707 s
14-Nov-2016 12:49:11 [INFO] Finished at: 2016-11-14T12:49:11+01:00
14-Nov-2016 12:49:11 [INFO] Final Memory: 114M/1358M
14-Nov-2016 12:49:11 [INFO] ------------------------------------------------------------------------
14-Nov-2016 12:49:11 [ERROR] Failed to execute goal de.thetaphi:forbiddenapis:2.0:testCheck (check-forbidden-test-apis) on project elasticsearch-carrot2: Check for forbidden API calls failed, see log. -> [Help 1]
14-Nov-2016 12:49:11 [ERROR]
14-Nov-2016 12:49:11 [ERROR] To see the full stack trace of the errors, re-run Maven with the -e switch.
14-Nov-2016 12:49:11 [ERROR] Re-run Maven using the -X switch to enable full debug logging.
14-Nov-2016 12:49:11 [ERROR]
14-Nov-2016 12:49:11 [ERROR] For more information about the errors and possible solutions, please read the following articles:
14-Nov-2016 12:49:11 [ERROR] [Help 1] http://cwiki.apache.org/confluence/display/MAVEN/MojoExecutionException