Build #121

Build: #121 failed

Job: JDK 1.7 failed

Stages & jobs

  1. Compile and test

Build log

The build generated 110 lines of output. Download or view full build log

10-May-2019 20:44:02 Build Morfologik - Software - JDK 1.7 #121 (MFLGIK-SOFTWARE-JDK17-121) started building on agent Linux Agent 3
10-May-2019 20:44:02 Remote agent on host rho.carrotsearch.com
10-May-2019 20:44:02 Build working directory is /home/bamboo/xml-data/build-dir/MFLGIK-SOFTWARE-JDK17
10-May-2019 20:44:02 Executing build Morfologik - Software - JDK 1.7 #121 (MFLGIK-SOFTWARE-JDK17-121)
10-May-2019 20:44:02 Starting task 'Checkout Default Repository' of type 'com.atlassian.bamboo.plugins.vcs:task.vcs.checkout'
10-May-2019 20:44:02 Checking out into /home/bamboo/xml-data/build-dir/MFLGIK-SOFTWARE-JDK17
10-May-2019 20:44:02 Updating source code to revision: f2da3ab1cf8213a7870152640b569d18a17e4472
10-May-2019 20:44:03 Fetching 'refs/heads/master' from 'git://github.com/morfologik/morfologik-stemming.git'. Will try to do a shallow fetch.
10-May-2019 20:44:04 From git://github.com/morfologik/morfologik-stemming
10-May-2019 20:44:04 + 26be9e4...f2da3ab master     -> master  (forced update)
10-May-2019 20:44:04 Checking out revision f2da3ab1cf8213a7870152640b569d18a17e4472.
10-May-2019 20:44:04 Already on 'master'
10-May-2019 20:44:04 Updated source code to revision: f2da3ab1cf8213a7870152640b569d18a17e4472
10-May-2019 20:44:04 Finished task 'Checkout Default Repository' with result: Success
10-May-2019 20:44:04 Running pre-build action: VCS Version Collector
10-May-2019 20:44:04 Starting task 'Maven 3.x' of type 'com.atlassian.bamboo.plugins.maven:task.builder.mvn3'
10-May-2019 20:44:04
Beginning to execute external process for build 'Morfologik - Software - JDK 1.7 #121 (MFLGIK-SOFTWARE-JDK17-121)'
... running command line:
/home/bamboo/jvms/maven/bin/mvn --batch-mode -Djava.io.tmpdir=/tmp/MFLGIK-SOFTWARE-JDK17 -Dmaven.repo.local=/home/bamboo/bamboo-agent-home-3/.m2/AGENT-61898766/repository clean verify javadoc:javadoc
... in: /home/bamboo/xml-data/build-dir/MFLGIK-SOFTWARE-JDK17
... using extra environment variables:
bamboo_planRepository_1_branch=master
bamboo_capability_system_builder_ant_Ant_1_9=/home/bamboo/jvms/ant1.9
bamboo_carrotsearch_secure_staging_user=bamboo
bamboo_planRepository_1_branchDisplayName=master
bamboo_repository_revision_number=f2da3ab1cf8213a7870152640b569d18a17e4472
MAVEN2_HOME=/home/bamboo/jvms/maven
bamboo_capability_system_builder_node_Node_js_8=/usr/bin/node
bamboo_buildKey=MFLGIK-SOFTWARE-JDK17
bamboo_capability_system_builder_command_rsync=/usr/bin/rsync
bamboo_repository_5210124_revision_number=f2da3ab1cf8213a7870152640b569d18a17e4472
bamboo_repository_5210124_git_repositoryUrl=git://github.com/morfologik/morfologik-stemming.git
bamboo_shortJobName=JDK 1.7
bamboo_buildResultsUrl=https://builds.carrot2.org/browse/MFLGIK-SOFTWARE-JDK17-121
bamboo_planRepository_repositoryUrl=git://github.com/morfologik/morfologik-stemming.git
bamboo_agentId=61898766
bamboo_carrotsearch_secure_staging_host=kappa.carrotsearch.com
bamboo_capability_system_jdk_JDK_9=/home/bamboo/jvms/jdk9
bamboo_planRepository_revision=f2da3ab1cf8213a7870152640b569d18a17e4472
bamboo_repository_5210124_git_branch=master
bamboo_planRepository_previousRevision=26be9e4e1f003361640c0355bed1701c73a54c9d
bamboo_repository_branch_name=master
bamboo_carrotsearch_download_official_port=2233
bamboo_repository_5210124_previous_revision_number=26be9e4e1f003361640c0355bed1701c73a54c9d
bamboo_capability_system_jdk_JDK_10=/home/bamboo/jvms/jdk10
bamboo_carrot2_website_ssh=carrotse@get.carrotsearch.com:~/sites/project.carrot2.org
bamboo_csssprites_download_path=/srv/vhosts/get.csssprites.org
bamboo_carrotsearch_labs_ssh_port=2233
bamboo_carrot2_download_user=bamboo
JAVA_HOME=/home/bamboo/jvms/jdk7
bamboo_capability_tools_dir=/home/bamboo/tools
bamboo_carrotsearch_download_staging_host=kappa.carrotsearch.com
bamboo_carrotsearch_download_official_path=~/sites/get.carrotsearch.com
bamboo_planRepository_branch=master
bamboo_carrotsearch_secure2_ssh=carrotse@get.carrotsearch.com:~/sites/secure.carrotsearch.com
bamboo_repository_5210124_branch_name=master
bamboo_capability_system_jdk_JDK_11=/home/bamboo/jvms/jdk11
bamboo_planRepository_1_type=gitv2
bamboo_planRepository_branchName=master
bamboo_capability_system_builder_ant_Ant_1_10=/home/bamboo/jvms/ant1.10
bamboo_hg_cache_directory=/home/bamboo/xml-data/build-dir/_hg-repositories-cache
bamboo_planRepository_1_username=
bamboo_planRepository_type=gitv2
bamboo_carrot2_download_host=kappa.carrotsearch.com
bamboo_git_cache_directory=/home/bamboo/xml-data/build-dir/_git-repositories-cache
bamboo_carrotsearch_download_staging_user=bamboo
useMavenReturnCode=false
bamboo_capability_system_builder_ant_Ant=/home/bamboo/jvms/ant1.9
bamboo_capability_system_builder_mvn3_Maven_3=/home/bamboo/jvms/maven
bamboo_tmp_directory=/home/bamboo/bamboo-agent-home-3/temp
bamboo_repository_5210124_name=Git
bamboo_planKey=MFLGIK-SOFTWARE
bamboo_planRepository_username=
bamboo_carrotsearch_website_ssh=carrotse@get.carrotsearch.com:~/sites/www.carrotsearch.com
bamboo_planRepository_1_branchName=master
bamboo_resultsUrl=https://builds.carrot2.org/browse/MFLGIK-SOFTWARE-JDK17-121
bamboo_capability_Linux=
bamboo_carrotsearch_labs_ssh=carrotse@get.carrotsearch.com:~/sites/labs.carrotsearch.com
bamboo_build_working_directory=/home/bamboo/xml-data/build-dir/MFLGIK-SOFTWARE-JDK17
bamboo_planRepository_1_name=Git
bamboo_shortPlanName=Software
bamboo_planRepository_name=Git
bamboo_buildNumber=121
bamboo_carrotsearch_secure_staging_path=/srv/vhosts/staging-secure.carrotsearch.com
bamboo_carrotsearch_secure_ssh_port=2233
bamboo_planName=Morfologik - Software
bamboo_capability_system_builder_command_git=/usr/bin/git
bamboo_shortPlanKey=SOFTWARE
bamboo_shortJobKey=JDK17
bamboo_buildTimeStamp=2019-05-10T20:44:01.985+02:00
bamboo_repository_previous_revision_number=26be9e4e1f003361640c0355bed1701c73a54c9d
M2_HOME=/home/bamboo/jvms/maven
bamboo_capability_Quiet=
bamboo_repository_git_branch=master
bamboo_buildResultKey=MFLGIK-SOFTWARE-JDK17-121
bamboo_buildPlanName=Morfologik - Software - JDK 1.7
bamboo_planRepository_1_revision=f2da3ab1cf8213a7870152640b569d18a17e4472
bamboo_repository_name=Git
bamboo_carrot2_website_ssh_port=2233
bamboo_csssprites_download_host=kappa.carrotsearch.com
bamboo_repository_5210124_git_username=
bamboo_buildFailed=false
bamboo_agentWorkingDirectory=/home/bamboo/xml-data/build-dir
bamboo_carrotsearch_download_official_host=get.carrotsearch.com
bamboo_capability_system_git_executable=/usr/bin/git
bamboo_l4g_mvn_opts=-Xmx1g
bamboo_repository_git_username=
bamboo_planRepository_1_previousRevision=26be9e4e1f003361640c0355bed1701c73a54c9d
bamboo_capability_system_jdk_JDK_1_8_IBM=/home/bamboo/jvms/jdk8-ibm
bamboo_carrotsearch_download_staging_path=/srv/vhosts/staging-get.carrotsearch.com
bamboo_planRepository_branchDisplayName=master
bamboo_capability_corpora_dir=/home/bamboo/corpora
bamboo_csssprites_download_user=bamboo
bamboo_plan_storageTag=MFLGIK-SOFTWARE
bamboo_carrot2_download_path=/srv/vhosts/get.carrot2.org
bamboo_repository_git_repositoryUrl=git://github.com/morfologik/morfologik-stemming.git
bamboo_carrotsearch_download_official_user=carrotse
bamboo_working_directory=/home/bamboo/xml-data/build-dir/MFLGIK-SOFTWARE-JDK17
bamboo_planRepository_1_repositoryUrl=git://github.com/morfologik/morfologik-stemming.git
bamboo_capability_system_jdk_JDK_1_8=/home/bamboo/jvms/jdk8
bamboo_capability_system_builder_command_zip=/usr/bin/zip
bamboo_capability_system_jdk_JDK_1_7=/home/bamboo/jvms/jdk7
bamboo_carrotsearch_secure_ssh=carrotse@get.carrotsearch.com:~/sites/secure.carrotsearch.com
bamboo_carrotsearch_website_ssh_port=2233
PATH=/home/bamboo/jvms/jdk7/bin:/bin:/usr/local/bin:/usr/bin:/bin:/usr/local/games:/usr/games
10-May-2019 20:44:08 [INFO] Scanning for projects...
10-May-2019 20:44:11 [INFO] ------------------------------------------------------------------------
10-May-2019 20:44:11 [INFO] Reactor Build Order:
10-May-2019 20:44:11 [INFO]
10-May-2019 20:44:11 [INFO] Morfologik (parent POM)                                            [pom]
10-May-2019 20:44:11 [INFO] Morfologik FSA (Traversal)                                      [bundle]
10-May-2019 20:44:11 [INFO] Morfologik FSA (Builder)                                        [bundle]
10-May-2019 20:44:11 [INFO] Morfologik Stemming APIs                                        [bundle]
10-May-2019 20:44:11 [INFO] Morfologik Stemming (Polish Dictionary)                         [bundle]
10-May-2019 20:44:11 [INFO] Morfologik Speller                                              [bundle]
10-May-2019 20:44:11 [INFO] Morfologik Command Line Tools                                      [jar]
10-May-2019 20:44:17 [INFO] Downloading from central: https://repo.maven.apache.org/maven2/org/apache/maven/plugins/maven-enforcer-plugin/1.4.1/maven-enforcer-plugin-1.4.1.pom
10-May-2019 20:44:17 [WARNING] Failed to retrieve plugin descriptor for org.apache.maven.plugins:maven-enforcer-plugin:1.4.1: Plugin org.apache.maven.plugins:maven-enforcer-plugin:1.4.1 or one of its dependencies could not be resolved: Failed to read artifact descriptor for org.apache.maven.plugins:maven-enforcer-plugin:jar:1.4.1
10-May-2019 20:44:17 [INFO] Downloading from central: https://repo.maven.apache.org/maven2/org/apache/maven/plugins/maven-clean-plugin/2.6.1/maven-clean-plugin-2.6.1.pom
10-May-2019 20:44:17 [WARNING] Failed to retrieve plugin descriptor for org.apache.maven.plugins:maven-clean-plugin:2.6.1: Plugin org.apache.maven.plugins:maven-clean-plugin:2.6.1 or one of its dependencies could not be resolved: Failed to read artifact descriptor for org.apache.maven.plugins:maven-clean-plugin:jar:2.6.1
10-May-2019 20:44:17 [INFO] Downloading from central: https://repo.maven.apache.org/maven2/org/apache/maven/plugins/maven-install-plugin/2.5.2/maven-install-plugin-2.5.2.pom
10-May-2019 20:44:17 [WARNING] Failed to retrieve plugin descriptor for org.apache.maven.plugins:maven-install-plugin:2.5.2: Plugin org.apache.maven.plugins:maven-install-plugin:2.5.2 or one of its dependencies could not be resolved: Failed to read artifact descriptor for org.apache.maven.plugins:maven-install-plugin:jar:2.5.2
10-May-2019 20:44:17 [INFO] Downloading from central: https://repo.maven.apache.org/maven2/org/apache/maven/plugins/maven-deploy-plugin/2.8.2/maven-deploy-plugin-2.8.2.pom
10-May-2019 20:44:17 [WARNING] Failed to retrieve plugin descriptor for org.apache.maven.plugins:maven-deploy-plugin:2.8.2: Plugin org.apache.maven.plugins:maven-deploy-plugin:2.8.2 or one of its dependencies could not be resolved: Failed to read artifact descriptor for org.apache.maven.plugins:maven-deploy-plugin:jar:2.8.2
10-May-2019 20:44:17 [INFO] Downloading from central: https://repo.maven.apache.org/maven2/org/apache/maven/plugins/maven-site-plugin/3.3/maven-site-plugin-3.3.pom
10-May-2019 20:44:17 [WARNING] Failed to retrieve plugin descriptor for org.apache.maven.plugins:maven-site-plugin:3.3: Plugin org.apache.maven.plugins:maven-site-plugin:3.3 or one of its dependencies could not be resolved: Failed to read artifact descriptor for org.apache.maven.plugins:maven-site-plugin:jar:3.3
10-May-2019 20:44:17 [WARNING] Failed to retrieve plugin descriptor for org.apache.maven.plugins:maven-clean-plugin:2.6.1: Plugin org.apache.maven.plugins:maven-clean-plugin:2.6.1 or one of its dependencies could not be resolved: Failed to read artifact descriptor for org.apache.maven.plugins:maven-clean-plugin:jar:2.6.1
10-May-2019 20:44:18 [WARNING] Failed to retrieve plugin descriptor for org.apache.maven.plugins:maven-deploy-plugin:2.8.2: Plugin org.apache.maven.plugins:maven-deploy-plugin:2.8.2 or one of its dependencies could not be resolved: Failed to read artifact descriptor for org.apache.maven.plugins:maven-deploy-plugin:jar:2.8.2
10-May-2019 20:44:18 [INFO] Downloading from central: https://repo.maven.apache.org/maven2/org/apache/maven/plugins/maven-source-plugin/2.4/maven-source-plugin-2.4.pom
10-May-2019 20:44:18 [WARNING] Failed to retrieve plugin descriptor for org.apache.maven.plugins:maven-source-plugin:2.4: Plugin org.apache.maven.plugins:maven-source-plugin:2.4 or one of its dependencies could not be resolved: Failed to read artifact descriptor for org.apache.maven.plugins:maven-source-plugin:jar:2.4
10-May-2019 20:44:18 [INFO] Downloading from central: https://repo.maven.apache.org/maven2/org/apache/maven/plugins/maven-javadoc-plugin/2.10.3/maven-javadoc-plugin-2.10.3.pom
10-May-2019 20:44:18 [WARNING] Failed to retrieve plugin descriptor for org.apache.maven.plugins:maven-javadoc-plugin:2.10.3: Plugin org.apache.maven.plugins:maven-javadoc-plugin:2.10.3 or one of its dependencies could not be resolved: Failed to read artifact descriptor for org.apache.maven.plugins:maven-javadoc-plugin:jar:2.10.3
10-May-2019 20:44:18 [INFO] Downloading from central: https://repo.maven.apache.org/maven2/org/apache/maven/plugins/maven-assembly-plugin/2.6/maven-assembly-plugin-2.6.pom
10-May-2019 20:44:18 [WARNING] Failed to retrieve plugin descriptor for org.apache.maven.plugins:maven-assembly-plugin:2.6: Plugin org.apache.maven.plugins:maven-assembly-plugin:2.6 or one of its dependencies could not be resolved: Failed to read artifact descriptor for org.apache.maven.plugins:maven-assembly-plugin:jar:2.6
10-May-2019 20:44:18 [INFO] Downloading from central: https://repo.maven.apache.org/maven2/org/apache/maven/plugins/maven-jar-plugin/2.5/maven-jar-plugin-2.5.pom
10-May-2019 20:44:18 [WARNING] Failed to retrieve plugin descriptor for org.apache.maven.plugins:maven-jar-plugin:2.5: Plugin org.apache.maven.plugins:maven-jar-plugin:2.5 or one of its dependencies could not be resolved: Failed to read artifact descriptor for org.apache.maven.plugins:maven-jar-plugin:jar:2.5
10-May-2019 20:44:18 [WARNING] Failed to retrieve plugin descriptor for org.apache.maven.plugins:maven-install-plugin:2.5.2: Plugin org.apache.maven.plugins:maven-install-plugin:2.5.2 or one of its dependencies could not be resolved: Failed to read artifact descriptor for org.apache.maven.plugins:maven-install-plugin:jar:2.5.2
10-May-2019 20:44:18 [INFO] Downloading from central: https://repo.maven.apache.org/maven2/org/apache/maven/plugins/maven-resources-plugin/2.7/maven-resources-plugin-2.7.pom
10-May-2019 20:44:18 [WARNING] Failed to retrieve plugin descriptor for org.apache.maven.plugins:maven-resources-plugin:2.7: Plugin org.apache.maven.plugins:maven-resources-plugin:2.7 or one of its dependencies could not be resolved: Failed to read artifact descriptor for org.apache.maven.plugins:maven-resources-plugin:jar:2.7
10-May-2019 20:44:18 [INFO] Downloading from central: https://repo.maven.apache.org/maven2/org/apache/maven/plugins/maven-release-plugin/2.5.3/maven-release-plugin-2.5.3.pom
10-May-2019 20:44:18 [WARNING] Failed to retrieve plugin descriptor for org.apache.maven.plugins:maven-release-plugin:2.5.3: Plugin org.apache.maven.plugins:maven-release-plugin:2.5.3 or one of its dependencies could not be resolved: Failed to read artifact descriptor for org.apache.maven.plugins:maven-release-plugin:jar:2.5.3
10-May-2019 20:44:18 [INFO] Downloading from central: https://repo.maven.apache.org/maven2/org/apache/maven/plugins/maven-compiler-plugin/3.3/maven-compiler-plugin-3.3.pom
10-May-2019 20:44:18 [WARNING] Failed to retrieve plugin descriptor for org.apache.maven.plugins:maven-compiler-plugin:3.3: Plugin org.apache.maven.plugins:maven-compiler-plugin:3.3 or one of its dependencies could not be resolved: Failed to read artifact descriptor for org.apache.maven.plugins:maven-compiler-plugin:jar:3.3
10-May-2019 20:44:18 [INFO] Downloading from central: https://repo.maven.apache.org/maven2/org/apache/maven/plugins/maven-gpg-plugin/1.6/maven-gpg-plugin-1.6.pom
10-May-2019 20:44:18 [WARNING] Failed to retrieve plugin descriptor for org.apache.maven.plugins:maven-gpg-plugin:1.6: Plugin org.apache.maven.plugins:maven-gpg-plugin:1.6 or one of its dependencies could not be resolved: Failed to read artifact descriptor for org.apache.maven.plugins:maven-gpg-plugin:jar:1.6
10-May-2019 20:44:18 [INFO] Downloading from central: https://repo.maven.apache.org/maven2/org/apache/maven/plugins/maven-surefire-plugin/2.18.1/maven-surefire-plugin-2.18.1.pom
10-May-2019 20:44:19 [WARNING] Failed to retrieve plugin descriptor for org.apache.maven.plugins:maven-surefire-plugin:2.18.1: Plugin org.apache.maven.plugins:maven-surefire-plugin:2.18.1 or one of its dependencies could not be resolved: Failed to read artifact descriptor for org.apache.maven.plugins:maven-surefire-plugin:jar:2.18.1
10-May-2019 20:44:19 [WARNING] Failed to retrieve plugin descriptor for org.apache.maven.plugins:maven-enforcer-plugin:1.4.1: Plugin org.apache.maven.plugins:maven-enforcer-plugin:1.4.1 or one of its dependencies could not be resolved: Failed to read artifact descriptor for org.apache.maven.plugins:maven-enforcer-plugin:jar:1.4.1
10-May-2019 20:44:19 [INFO] Downloading from central: https://repo.maven.apache.org/maven2/org/codehaus/mojo/maven-metadata.xml
10-May-2019 20:44:19 [INFO] Downloading from central: https://repo.maven.apache.org/maven2/org/apache/maven/plugins/maven-metadata.xml
10-May-2019 20:44:19 [WARNING] Could not transfer metadata org.apache.maven.plugins/maven-metadata.xml from/to central (https://repo.maven.apache.org/maven2): Received fatal alert: protocol_version
10-May-2019 20:44:19 [WARNING] Could not transfer metadata org.codehaus.mojo/maven-metadata.xml from/to central (https://repo.maven.apache.org/maven2): Received fatal alert: protocol_version
10-May-2019 20:44:19 [WARNING] Failure to transfer org.apache.maven.plugins/maven-metadata.xml from https://repo.maven.apache.org/maven2 was cached in the local repository, resolution will not be reattempted until the update interval of central has elapsed or updates are forced. Original error: Could not transfer metadata org.apache.maven.plugins/maven-metadata.xml from/to central (https://repo.maven.apache.org/maven2): Received fatal alert: protocol_version
10-May-2019 20:44:19 [WARNING] Failure to transfer org.codehaus.mojo/maven-metadata.xml from https://repo.maven.apache.org/maven2 was cached in the local repository, resolution will not be reattempted until the update interval of central has elapsed or updates are forced. Original error: Could not transfer metadata org.codehaus.mojo/maven-metadata.xml from/to central (https://repo.maven.apache.org/maven2): Received fatal alert: protocol_version
10-May-2019 20:44:19 [INFO] ------------------------------------------------------------------------
10-May-2019 20:44:19 [INFO] Reactor Summary:
10-May-2019 20:44:19 [INFO]
10-May-2019 20:44:19 [INFO] Morfologik (parent POM) 2.1.6-SNAPSHOT ............. SKIPPED
10-May-2019 20:44:19 [INFO] Morfologik FSA (Traversal) ......................... SKIPPED
10-May-2019 20:44:19 [INFO] Morfologik FSA (Builder) ........................... SKIPPED
10-May-2019 20:44:19 [INFO] Morfologik Stemming APIs ........................... SKIPPED
10-May-2019 20:44:19 [INFO] Morfologik Stemming (Polish Dictionary) ............ SKIPPED
10-May-2019 20:44:19 [INFO] Morfologik Speller ................................. SKIPPED
10-May-2019 20:44:19 [INFO] Morfologik Command Line Tools 2.1.6-SNAPSHOT ....... SKIPPED
10-May-2019 20:44:19 [INFO] ------------------------------------------------------------------------
10-May-2019 20:44:19 [INFO] BUILD FAILURE
10-May-2019 20:44:19 [INFO] ------------------------------------------------------------------------
10-May-2019 20:44:19 [INFO] Total time: 10.771 s
10-May-2019 20:44:19 [INFO] Finished at: 2019-05-10T19:44:19+01:00
10-May-2019 20:44:19 [INFO] ------------------------------------------------------------------------
10-May-2019 20:44:19 [ERROR] No plugin found for prefix 'javadoc' in the current project and in the plugin groups [org.apache.maven.plugins, org.codehaus.mojo] available from the repositories [local (/home/bamboo/bamboo-agent-home-3/.m2/AGENT-61898766/repository), central (https://repo.maven.apache.org/maven2)] -> [Help 1]
10-May-2019 20:44:19 [ERROR]
10-May-2019 20:44:19 [ERROR] To see the full stack trace of the errors, re-run Maven with the -e switch.
10-May-2019 20:44:19 [ERROR] Re-run Maven using the -X switch to enable full debug logging.
10-May-2019 20:44:19 [ERROR]
10-May-2019 20:44:19 [ERROR] For more information about the errors and possible solutions, please read the following articles:
10-May-2019 20:44:19 [ERROR] [Help 1] http://cwiki.apache.org/confluence/display/MAVEN/NoPluginFoundForPrefixException
10-May-2019 20:44:19 Failing task since return code of [/home/bamboo/jvms/maven/bin/mvn --batch-mode -Djava.io.tmpdir=/tmp/MFLGIK-SOFTWARE-JDK17 -Dmaven.repo.local=/home/bamboo/bamboo-agent-home-3/.m2/AGENT-61898766/repository clean verify javadoc:javadoc] was 1 while expected 0
10-May-2019 20:44:19 Parsing test results under /home/bamboo/xml-data/build-dir/MFLGIK-SOFTWARE-JDK17...
10-May-2019 20:44:19 Finished task 'Maven 3.x' with result: Failed
10-May-2019 20:44:19 Running post build plugin 'Docker Container Cleanup'
10-May-2019 20:44:19 Running post build plugin 'NCover Results Collector'
10-May-2019 20:44:19 Running post build plugin 'Clover Results Collector'
10-May-2019 20:44:19 Running post build plugin 'npm Cache Cleanup'
10-May-2019 20:44:19 Running post build plugin 'Artifact Copier'
10-May-2019 20:44:19 Finalising the build...
10-May-2019 20:44:19 Stopping timer.
10-May-2019 20:44:19 Build MFLGIK-SOFTWARE-JDK17-121 completed.
10-May-2019 20:44:19 Running on server: post build plugin 'NCover Results Collector'
10-May-2019 20:44:19 Running on server: post build plugin 'Build Hanging Detection Configuration'
10-May-2019 20:44:19 Running on server: post build plugin 'Clover Delta Calculator'
10-May-2019 20:44:19 Running on server: post build plugin 'Maven Dependencies Postprocessor'
10-May-2019 20:44:19 All post build plugins have finished
10-May-2019 20:44:19 Generating build results summary...
10-May-2019 20:44:19 Saving build results to disk...
10-May-2019 20:44:19 Logging substituted variables...
10-May-2019 20:44:19 Indexing build results...
10-May-2019 20:44:19 Finished building MFLGIK-SOFTWARE-JDK17-121.