Build #75

Build: #75 failed Changes by Dawid Weiss

Stages & jobs

  1. Compile and test

Build result summary

Details

Completed
Duration
19 seconds
Labels
None
Revision
b48255d3473f91c887ada2698bb1180f60596287 b48255d3473f91c887ada2698bb1180f60596287
Total tests
114
Fixed in
#76 (Changes by Dawid Weiss)

Tests

Responsible

Code commits

Author Commit Message Commit date
Dawid Weiss Dawid Weiss b48255d3473f91c887ada2698bb1180f60596287 b48255d3473f91c887ada2698bb1180f60596287 Code simplifications, using j.u.BitSet instead of HPPC's bitset.

Tests

New test failures 6
Status Test View job Duration
Collapse Failed CFSA2SerializerTest test_en_tst History
JDK 1.7 1 sec
java.lang.ArrayIndexOutOfBoundsException: 10589
	at __randomizedtesting.SeedInfo.seed([BB3B2091F68E0751:88DF330FCB2369C2]:0)
	at morfologik.fsa.builders.CFSA2Serializer.computeFirstStates(CFSA2Serializer.java:362)
	at morfologik.fsa.builders.CFSA2Serializer.linearize(CFSA2Serializer.java:227)
	at morfologik.fsa.builders.CFSA2Serializer.serialize(CFSA2Serializer.java:124)
	at morfologik.fsa.builders.SerializerTestBase.checkSerialization0(SerializerTestBase.java:162)
	at morfologik.fsa.builders.SerializerTestBase.checkSerialization(SerializerTestBase.java:155)
	at morfologik.fsa.builders.SerializerTestBase.testBuiltIn(SerializerTestBase.java:151)
(18 more lines...)
Collapse Failed CFSA2SerializerTest test_minimal2 History
JDK 1.7 < 1 sec
java.lang.ArrayIndexOutOfBoundsException: 4
	at __randomizedtesting.SeedInfo.seed([BB3B2091F68E0751:F2C383D951035AEB]:0)
	at morfologik.fsa.builders.CFSA2Serializer.computeFirstStates(CFSA2Serializer.java:362)
	at morfologik.fsa.builders.CFSA2Serializer.linearize(CFSA2Serializer.java:227)
	at morfologik.fsa.builders.CFSA2Serializer.serialize(CFSA2Serializer.java:124)
	at morfologik.fsa.builders.SerializerTestBase.checkSerialization0(SerializerTestBase.java:162)
	at morfologik.fsa.builders.SerializerTestBase.checkSerialization(SerializerTestBase.java:155)
	at morfologik.fsa.builders.SerializerTestBase.testBuiltIn(SerializerTestBase.java:151)
(18 more lines...)
Collapse Failed CFSA2SerializerTest test_en_tst History
JDK 1.8 1 sec
java.lang.ArrayIndexOutOfBoundsException: 10589
	at __randomizedtesting.SeedInfo.seed([4A71CAD3C802A017:7995D94DF5AFCE84]:0)
	at morfologik.fsa.builders.CFSA2Serializer.computeFirstStates(CFSA2Serializer.java:362)
	at morfologik.fsa.builders.CFSA2Serializer.linearize(CFSA2Serializer.java:227)
	at morfologik.fsa.builders.CFSA2Serializer.serialize(CFSA2Serializer.java:124)
	at morfologik.fsa.builders.SerializerTestBase.checkSerialization0(SerializerTestBase.java:162)
	at morfologik.fsa.builders.SerializerTestBase.checkSerialization(SerializerTestBase.java:155)
	at morfologik.fsa.builders.SerializerTestBase.testBuiltIn(SerializerTestBase.java:151)
(18 more lines...)
Collapse Failed CFSA2SerializerTest test_minimal2 History
JDK 1.8 < 1 sec
java.lang.ArrayIndexOutOfBoundsException: 4
	at __randomizedtesting.SeedInfo.seed([4A71CAD3C802A017:389699B6F8FFDAD]:0)
	at morfologik.fsa.builders.CFSA2Serializer.computeFirstStates(CFSA2Serializer.java:362)
	at morfologik.fsa.builders.CFSA2Serializer.linearize(CFSA2Serializer.java:227)
	at morfologik.fsa.builders.CFSA2Serializer.serialize(CFSA2Serializer.java:124)
	at morfologik.fsa.builders.SerializerTestBase.checkSerialization0(SerializerTestBase.java:162)
	at morfologik.fsa.builders.SerializerTestBase.checkSerialization(SerializerTestBase.java:155)
	at morfologik.fsa.builders.SerializerTestBase.testBuiltIn(SerializerTestBase.java:151)
(18 more lines...)
Collapse Failed CFSA2SerializerTest test_en_tst History
JDK 1.9 1 sec
java.lang.ArrayIndexOutOfBoundsException: 10589
	at __randomizedtesting.SeedInfo.seed([643ED011B55D1108:57DAC38F88F07F9B]:0)
	at morfologik.fsa.builders.CFSA2Serializer.computeFirstStates(CFSA2Serializer.java:362)
	at morfologik.fsa.builders.CFSA2Serializer.linearize(CFSA2Serializer.java:227)
	at morfologik.fsa.builders.CFSA2Serializer.serialize(CFSA2Serializer.java:124)
	at morfologik.fsa.builders.SerializerTestBase.checkSerialization0(SerializerTestBase.java:162)
	at morfologik.fsa.builders.SerializerTestBase.checkSerialization(SerializerTestBase.java:155)
	at morfologik.fsa.builders.SerializerTestBase.testBuiltIn(SerializerTestBase.java:151)
(18 more lines...)
Collapse Failed CFSA2SerializerTest test_minimal2 History
JDK 1.9 < 1 sec
java.lang.ArrayIndexOutOfBoundsException: 4
	at __randomizedtesting.SeedInfo.seed([643ED011B55D1108:2DC6735912D04CB2]:0)
	at morfologik.fsa.builders.CFSA2Serializer.computeFirstStates(CFSA2Serializer.java:362)
	at morfologik.fsa.builders.CFSA2Serializer.linearize(CFSA2Serializer.java:227)
	at morfologik.fsa.builders.CFSA2Serializer.serialize(CFSA2Serializer.java:124)
	at morfologik.fsa.builders.SerializerTestBase.checkSerialization0(SerializerTestBase.java:162)
	at morfologik.fsa.builders.SerializerTestBase.checkSerialization(SerializerTestBase.java:155)
	at morfologik.fsa.builders.SerializerTestBase.testBuiltIn(SerializerTestBase.java:151)
(18 more lines...)