Build #127

Build: #127 failed Changes by Daniel Naber <naber@danielnaber.de>

Stages & jobs

  1. Compile and test

Logs

The following logs have been generated by the jobs in this plan.
  • Expand all
  • Collapse all
Job Logs
Collapse JDK 1.8 Compile and test Download or View
20-Dec-2019 09:48:44 [INFO] Reactor Summary for Morfologik (parent POM) 2.1.7-SNAPSHOT:
20-Dec-2019 09:48:44 [INFO]
20-Dec-2019 09:48:44 [INFO] Morfologik (parent POM) ............................ SUCCESS [  0.937 s]
20-Dec-2019 09:48:44 [INFO] Morfologik FSA (Traversal) ......................... SUCCESS [  3.109 s]
20-Dec-2019 09:48:44 [INFO] Morfologik FSA (Builder) ........................... SUCCESS [  5.436 s]
20-Dec-2019 09:48:44 [INFO] Morfologik Stemming APIs ........................... SUCCESS [  3.187 s]
20-Dec-2019 09:48:44 [INFO] Morfologik Stemming (Polish Dictionary) ............ SUCCESS [  6.170 s]
20-Dec-2019 09:48:44 [INFO] Morfologik Speller ................................. SUCCESS [  2.000 s]
20-Dec-2019 09:48:44 [INFO] Morfologik Command Line Tools ...................... FAILURE [  3.437 s]
20-Dec-2019 09:48:44 [INFO] ------------------------------------------------------------------------
20-Dec-2019 09:48:44 [INFO] BUILD FAILURE
20-Dec-2019 09:48:44 [INFO] ------------------------------------------------------------------------
20-Dec-2019 09:48:44 [INFO] Total time:  25.338 s
20-Dec-2019 09:48:44 [INFO] Finished at: 2019-12-20T09:48:44+01:00
20-Dec-2019 09:48:44 [INFO] ------------------------------------------------------------------------
20-Dec-2019 09:48:44 [ERROR] Failed to execute goal com.carrotsearch.randomizedtesting:junit4-maven-plugin:2.5.2:junit4 (unit-tests) on project morfologik-tools: There were test failures: 2 suites, 303 tests, 2 errors [seed: CE89A21393698347] -> [Help 1]
20-Dec-2019 09:48:44 [ERROR]
20-Dec-2019 09:48:44 [ERROR] To see the full stack trace of the errors, re-run Maven with the -e switch.
20-Dec-2019 09:48:44 [ERROR] Re-run Maven using the -X switch to enable full debug logging.
20-Dec-2019 09:48:44 [ERROR]
20-Dec-2019 09:48:44 [ERROR] For more information about the errors and possible solutions, please read the following articles:
20-Dec-2019 09:48:44 [ERROR] [Help 1] http://cwiki.apache.org/confluence/display/MAVEN/MojoExecutionException
20-Dec-2019 09:48:44 [ERROR]
20-Dec-2019 09:48:44 [ERROR] After correcting the problems, you can resume the build with the command
20-Dec-2019 09:48:44 [ERROR]   mvn <goals> -rf :morfologik-tools