Build #121

Build: #121 failed Changes by Dawid Weiss

Stages & jobs

  1. Compile and test

Logs

The following logs have been generated by the jobs in this plan.
  • Expand all
  • Collapse all
Job Logs
Collapse JDK 1.7 Compile and test Download or View
10-May-2019 20:44:19 [WARNING] Failure to transfer org.apache.maven.plugins/maven-metadata.xml from https://repo.maven.apache.org/maven2 was cached in the local repository, resolution will not be reattempted until the update interval of central has elapsed or updates are forced. Original error: Could not transfer metadata org.apache.maven.plugins/maven-metadata.xml from/to central (https://repo.maven.apache.org/maven2): Received fatal alert: protocol_version
10-May-2019 20:44:19 [WARNING] Failure to transfer org.codehaus.mojo/maven-metadata.xml from https://repo.maven.apache.org/maven2 was cached in the local repository, resolution will not be reattempted until the update interval of central has elapsed or updates are forced. Original error: Could not transfer metadata org.codehaus.mojo/maven-metadata.xml from/to central (https://repo.maven.apache.org/maven2): Received fatal alert: protocol_version
10-May-2019 20:44:19 [INFO] ------------------------------------------------------------------------
10-May-2019 20:44:19 [INFO] Reactor Summary:
10-May-2019 20:44:19 [INFO]
10-May-2019 20:44:19 [INFO] Morfologik (parent POM) 2.1.6-SNAPSHOT ............. SKIPPED
10-May-2019 20:44:19 [INFO] Morfologik FSA (Traversal) ......................... SKIPPED
10-May-2019 20:44:19 [INFO] Morfologik FSA (Builder) ........................... SKIPPED
10-May-2019 20:44:19 [INFO] Morfologik Stemming APIs ........................... SKIPPED
10-May-2019 20:44:19 [INFO] Morfologik Stemming (Polish Dictionary) ............ SKIPPED
10-May-2019 20:44:19 [INFO] Morfologik Speller ................................. SKIPPED
10-May-2019 20:44:19 [INFO] Morfologik Command Line Tools 2.1.6-SNAPSHOT ....... SKIPPED
10-May-2019 20:44:19 [INFO] ------------------------------------------------------------------------
10-May-2019 20:44:19 [INFO] BUILD FAILURE
10-May-2019 20:44:19 [INFO] ------------------------------------------------------------------------
10-May-2019 20:44:19 [INFO] Total time: 10.771 s
10-May-2019 20:44:19 [INFO] Finished at: 2019-05-10T19:44:19+01:00
10-May-2019 20:44:19 [INFO] ------------------------------------------------------------------------
10-May-2019 20:44:19 [ERROR] No plugin found for prefix 'javadoc' in the current project and in the plugin groups [org.apache.maven.plugins, org.codehaus.mojo] available from the repositories [local (/home/bamboo/bamboo-agent-home-3/.m2/AGENT-61898766/repository), central (https://repo.maven.apache.org/maven2)] -> [Help 1]
10-May-2019 20:44:19 [ERROR]
10-May-2019 20:44:19 [ERROR] To see the full stack trace of the errors, re-run Maven with the -e switch.
10-May-2019 20:44:19 [ERROR] Re-run Maven using the -X switch to enable full debug logging.
10-May-2019 20:44:19 [ERROR]
10-May-2019 20:44:19 [ERROR] For more information about the errors and possible solutions, please read the following articles:
10-May-2019 20:44:19 [ERROR] [Help 1] http://cwiki.apache.org/confluence/display/MAVEN/NoPluginFoundForPrefixException