Build #103

Build: #103 failed Manual run by Dawid Weiss

Stages & jobs

  1. Compile and test

Logs

The following logs have been generated by the jobs in this plan.
  • Expand all
  • Collapse all
Job Logs
Collapse JDK 1.9 Compile and test Download or View
11-Jul-2017 11:57:15 [ERROR] urls[39] = file:/mnt/work/bamboo-home/.m2/AGENT-131073/repository/org/codehaus/plexus/plexus-component-annotations/1.5.5/plexus-component-annotations-1.5.5.jar
11-Jul-2017 11:57:15 [ERROR] urls[40] = file:/mnt/work/bamboo-home/.m2/AGENT-131073/repository/commons-lang/commons-lang/2.4/commons-lang-2.4.jar
11-Jul-2017 11:57:15 [ERROR] urls[41] = file:/mnt/work/bamboo-home/.m2/AGENT-131073/repository/commons-io/commons-io/2.2/commons-io-2.2.jar
11-Jul-2017 11:57:15 [ERROR] urls[42] = file:/mnt/work/bamboo-home/.m2/AGENT-131073/repository/org/apache/httpcomponents/httpclient/4.2.3/httpclient-4.2.3.jar
11-Jul-2017 11:57:15 [ERROR] urls[43] = file:/mnt/work/bamboo-home/.m2/AGENT-131073/repository/org/apache/httpcomponents/httpcore/4.2.2/httpcore-4.2.2.jar
11-Jul-2017 11:57:15 [ERROR] urls[44] = file:/mnt/work/bamboo-home/.m2/AGENT-131073/repository/commons-codec/commons-codec/1.6/commons-codec-1.6.jar
11-Jul-2017 11:57:15 [ERROR] urls[45] = file:/mnt/work/bamboo-home/.m2/AGENT-131073/repository/commons-logging/commons-logging/1.1.1/commons-logging-1.1.1.jar
11-Jul-2017 11:57:15 [ERROR] urls[46] = file:/mnt/work/bamboo-home/.m2/AGENT-131073/repository/log4j/log4j/1.2.14/log4j-1.2.14.jar
11-Jul-2017 11:57:15 [ERROR] urls[47] = file:/mnt/work/bamboo-home/.m2/AGENT-131073/repository/com/thoughtworks/qdox/qdox/1.12.1/qdox-1.12.1.jar
11-Jul-2017 11:57:15 [ERROR] urls[48] = file:/mnt/work/bamboo-home/.m2/AGENT-131073/repository/junit/junit/3.8.1/junit-3.8.1.jar
11-Jul-2017 11:57:15 [ERROR] urls[49] = file:/mnt/work/bamboo-home/.m2/AGENT-131073/repository/org/codehaus/plexus/plexus-archiver/2.9/plexus-archiver-2.9.jar
11-Jul-2017 11:57:15 [ERROR] urls[50] = file:/mnt/work/bamboo-home/.m2/AGENT-131073/repository/org/codehaus/plexus/plexus-io/2.4/plexus-io-2.4.jar
11-Jul-2017 11:57:15 [ERROR] urls[51] = file:/mnt/work/bamboo-home/.m2/AGENT-131073/repository/org/apache/commons/commons-compress/1.9/commons-compress-1.9.jar
11-Jul-2017 11:57:15 [ERROR] urls[52] = file:/mnt/work/bamboo-home/.m2/AGENT-131073/repository/org/codehaus/plexus/plexus-utils/3.0.20/plexus-utils-3.0.20.jar
11-Jul-2017 11:57:15 [ERROR] Number of foreign imports: 1
11-Jul-2017 11:57:15 [ERROR] import: Entry[import  from realm ClassRealm[maven.api, parent: null]]
11-Jul-2017 11:57:15 [ERROR]
11-Jul-2017 11:57:15 [ERROR] -----------------------------------------------------: begin 0, end 3, length 1
11-Jul-2017 11:57:15 [ERROR] -> [Help 1]
11-Jul-2017 11:57:15 [ERROR]
11-Jul-2017 11:57:15 [ERROR] To see the full stack trace of the errors, re-run Maven with the -e switch.
11-Jul-2017 11:57:15 [ERROR] Re-run Maven using the -X switch to enable full debug logging.
11-Jul-2017 11:57:15 [ERROR]
11-Jul-2017 11:57:15 [ERROR] For more information about the errors and possible solutions, please read the following articles:
11-Jul-2017 11:57:15 [ERROR] [Help 1] http://cwiki.apache.org/confluence/display/MAVEN/PluginContainerException