Build #60

Build: #60 failed Changes by Dawid Weiss

Stages & jobs

  1. Compile and test

  2. Package

Logs

The following logs have been generated by the jobs in this branch.
  • Expand all
  • Collapse all
Job Logs
Collapse JDK 1.7 Compile and test Download or View
22-Apr-2015 16:50:03         at org.apache.maven.DefaultMaven.execute(DefaultMaven.java:155)
22-Apr-2015 16:50:03         at org.apache.maven.cli.MavenCli.execute(MavenCli.java:584)
22-Apr-2015 16:50:03         at org.apache.maven.cli.MavenCli.doMain(MavenCli.java:216)
22-Apr-2015 16:50:03         at org.apache.maven.cli.MavenCli.main(MavenCli.java:160)
22-Apr-2015 16:50:03         at sun.reflect.NativeMethodAccessorImpl.invoke0(Native Method)
22-Apr-2015 16:50:03         at sun.reflect.NativeMethodAccessorImpl.invoke(NativeMethodAccessorImpl.java:57)
22-Apr-2015 16:50:03         at sun.reflect.DelegatingMethodAccessorImpl.invoke(DelegatingMethodAccessorImpl.java:43)
22-Apr-2015 16:50:03         at java.lang.reflect.Method.invoke(Method.java:606)
22-Apr-2015 16:50:03         at org.codehaus.plexus.classworlds.launcher.Launcher.launchEnhanced(Launcher.java:289)
22-Apr-2015 16:50:03         at org.codehaus.plexus.classworlds.launcher.Launcher.launch(Launcher.java:229)
22-Apr-2015 16:50:03         at org.codehaus.plexus.classworlds.launcher.Launcher.mainWithExitCode(Launcher.java:415)
22-Apr-2015 16:50:03         at org.codehaus.plexus.classworlds.launcher.Launcher.main(Launcher.java:356)
22-Apr-2015 16:50:03 Caused by: org.apache.maven.plugin.MojoExecutionException: There were test failures: 118 suites, 3450 tests, 1 failure
22-Apr-2015 16:50:03         at com.carrotsearch.maven.plugins.junit4.JUnit4Mojo.execute(JUnit4Mojo.java:527)
22-Apr-2015 16:50:03         at org.apache.maven.plugin.DefaultBuildPluginManager.executeMojo(DefaultBuildPluginManager.java:132)
22-Apr-2015 16:50:03         at org.apache.maven.lifecycle.internal.MojoExecutor.execute(MojoExecutor.java:208)
22-Apr-2015 16:50:03         ... 19 more
22-Apr-2015 16:50:03 [ERROR]
22-Apr-2015 16:50:03 [ERROR] Re-run Maven using the -X switch to enable full debug logging.
22-Apr-2015 16:50:03 [ERROR]
22-Apr-2015 16:50:03 [ERROR] For more information about the errors and possible solutions, please read the following articles:
22-Apr-2015 16:50:03 [ERROR] [Help 1] http://cwiki.apache.org/confluence/display/MAVEN/MojoExecutionException
22-Apr-2015 16:50:03 [ERROR]
22-Apr-2015 16:50:03 [ERROR] After correcting the problems, you can resume the build with the command
22-Apr-2015 16:50:03 [ERROR]   mvn <goals> -rf :hppc