Build #56

Build: #56 failed Changes by Dawid Weiss

Stages & jobs

  1. Compile and test

  2. Package

Build result summary

Details

Completed
Duration
46 seconds
Labels
None
Revision
8d000930cb62814b61694a52545627e7edfe755b 8d000930cb62814b61694a52545627e7edfe755b
Total tests
6900
Fixed in
#57 (Changes by Dawid Weiss)

Tests

Responsible

Code commits

Author Commit Message Commit date
Dawid Weiss Dawid Weiss 8d000930cb62814b61694a52545627e7edfe755b 8d000930cb62814b61694a52545627e7edfe755b HPPC-98: Change the default bit mixing function from MurmurHash to PhiMix (golden ratio)
Dawid Weiss Dawid Weiss baf308b9b87faa56864401c512bab82f04aa449f baf308b9b87faa56864401c512bab82f04aa449f Opened up internals a bit.
Dawid Weiss Dawid Weiss 30e500cb883d1a54995ab421cd71b73c87d7d4f2 30e500cb883d1a54995ab421cd71b73c87d7d4f2 Upgrade RandomizedTesting dependency.

Tests

New test failures 4
Status Test View job Duration
Collapse Failed HashCollisionsClusteringTest testHashSetClusteringAtFront2 History
JDK 1.7 3 secs
java.lang.AssertionError: Takes too long, something is wrong. Added 120 batches.
	at org.junit.Assert.fail(Assert.java:88)
	at com.carrotsearch.hppc.HashCollisionsClusteringTest.testHashSetClusteringAtFront2(HashCollisionsClusteringTest.java:127)
	at sun.reflect.NativeMethodAccessorImpl.invoke0(Native Method)
	at sun.reflect.NativeMethodAccessorImpl.invoke(NativeMethodAccessorImpl.java:57)
	at sun.reflect.DelegatingMethodAccessorImpl.invoke(DelegatingMethodAccessorImpl.java:43)
	at java.lang.reflect.Method.invoke(Method.java:606)
	at org.junit.runners.model.FrameworkMethod$1.runReflectiveCall(FrameworkMethod.java:50)
(15 more lines...)
Collapse Failed HashCollisionsClusteringTest testHashSetClusteringAtFront History
JDK 1.7 3 secs
java.lang.AssertionError: Takes too long, something is wrong. Added 89001 keys out of 943718
	at org.junit.Assert.fail(Assert.java:88)
	at com.carrotsearch.hppc.HashCollisionsClusteringTest.testHashSetClusteringAtFront(HashCollisionsClusteringTest.java:88)
	at sun.reflect.NativeMethodAccessorImpl.invoke0(Native Method)
	at sun.reflect.NativeMethodAccessorImpl.invoke(NativeMethodAccessorImpl.java:57)
	at sun.reflect.DelegatingMethodAccessorImpl.invoke(DelegatingMethodAccessorImpl.java:43)
	at java.lang.reflect.Method.invoke(Method.java:606)
	at org.junit.runners.model.FrameworkMethod$1.runReflectiveCall(FrameworkMethod.java:50)
(15 more lines...)
Collapse Failed HashCollisionsClusteringTest testHashSetClusteringAtFront2 History
JDK 1.8 3 secs
java.lang.AssertionError: Takes too long, something is wrong. Added 40 batches.
	at org.junit.Assert.fail(Assert.java:88)
	at com.carrotsearch.hppc.HashCollisionsClusteringTest.testHashSetClusteringAtFront2(HashCollisionsClusteringTest.java:127)
	at sun.reflect.NativeMethodAccessorImpl.invoke0(Native Method)
	at sun.reflect.NativeMethodAccessorImpl.invoke(NativeMethodAccessorImpl.java:62)
	at sun.reflect.DelegatingMethodAccessorImpl.invoke(DelegatingMethodAccessorImpl.java:43)
	at java.lang.reflect.Method.invoke(Method.java:497)
	at org.junit.runners.model.FrameworkMethod$1.runReflectiveCall(FrameworkMethod.java:50)
(15 more lines...)
Collapse Failed HashCollisionsClusteringTest testHashSetClusteringAtFront History
JDK 1.8 3 secs
java.lang.AssertionError: Takes too long, something is wrong. Added 62001 keys out of 943718
	at org.junit.Assert.fail(Assert.java:88)
	at com.carrotsearch.hppc.HashCollisionsClusteringTest.testHashSetClusteringAtFront(HashCollisionsClusteringTest.java:88)
	at sun.reflect.NativeMethodAccessorImpl.invoke0(Native Method)
	at sun.reflect.NativeMethodAccessorImpl.invoke(NativeMethodAccessorImpl.java:62)
	at sun.reflect.DelegatingMethodAccessorImpl.invoke(DelegatingMethodAccessorImpl.java:43)
	at java.lang.reflect.Method.invoke(Method.java:497)
	at org.junit.runners.model.FrameworkMethod$1.runReflectiveCall(FrameworkMethod.java:50)
(15 more lines...)

Jira issues

IssueDescriptionStatus
Unknown Issue TypeHPPC-98Could not obtain issue details from Jira