Build #42

Build: #42 failed Changes by Dawid Weiss

Stages & jobs

  1. Compile and test

  2. Package

Build result summary

Details

Completed
Duration
52 seconds
Labels
None
Revision
c68457282681af17f539510d355720d763f9b70c c68457282681af17f539510d355720d763f9b70c
Total tests
5776
Fixed in
#43 (Changes by Dawid Weiss)

Tests

Responsible

Code commits

Author Commit Message Commit date
Dawid Weiss Dawid Weiss c68457282681af17f539510d355720d763f9b70c c68457282681af17f539510d355720d763f9b70c HPPC-116: moved zero-element value to backing arrays, preparing for index-based methods.
Dawid Weiss Dawid Weiss 0ce14a5d3e6e3f5b1077546d425c7d35f4406139 0ce14a5d3e6e3f5b1077546d425c7d35f4406139 Fixed a potential NPE.
Dawid Weiss Dawid Weiss df3efa10e7b2e05c48a6c1ae7079095e11a382d7 df3efa10e7b2e05c48a6c1ae7079095e11a382d7 HPPC-116: added more tests verifying empty key.

Tests

New test failures 28
Status Test View job Duration
Collapse Failed ByteObjectOpenHashMapTest testIterable History
JDK 1.7 < 1 sec
java.lang.AssertionError: expected:<null> but was:<0>
	at __randomizedtesting.SeedInfo.seed([81BF8621B43DCD77:D8EC539156FE47FD]:0)
	at org.junit.Assert.fail(Assert.java:88)
	at org.junit.Assert.failNotEquals(Assert.java:834)
	at org.junit.Assert.assertEquals(Assert.java:118)
	at org.junit.Assert.assertEquals(Assert.java:144)
	at com.carrotsearch.hppc.TestUtils.assertEquals2(TestUtils.java:413)
	at com.carrotsearch.hppc.ByteObjectOpenHashMapTest.checkEmptySlotsUninitialized(ByteObjectOpenHashMapTest.java:46)
(20 more lines...)
Collapse Failed ByteObjectOpenHashMapTest testMapValues History
JDK 1.7 < 1 sec
java.lang.AssertionError: expected:<null> but was:<0>
	at __randomizedtesting.SeedInfo.seed([81BF8621B43DCD77:BBEA5CD38761A683]:0)
	at org.junit.Assert.fail(Assert.java:88)
	at org.junit.Assert.failNotEquals(Assert.java:834)
	at org.junit.Assert.assertEquals(Assert.java:118)
	at org.junit.Assert.assertEquals(Assert.java:144)
	at com.carrotsearch.hppc.TestUtils.assertEquals2(TestUtils.java:413)
	at com.carrotsearch.hppc.ByteObjectOpenHashMapTest.checkEmptySlotsUninitialized(ByteObjectOpenHashMapTest.java:46)
(20 more lines...)
Collapse Failed ByteObjectOpenHashMapTest testMapValues History
JDK 1.8 < 1 sec
java.lang.AssertionError: expected:<null> but was:<0>
	at __randomizedtesting.SeedInfo.seed([B51EA4DAEB36D68C:8F4B7E28D86ABD78]:0)
	at org.junit.Assert.fail(Assert.java:88)
	at org.junit.Assert.failNotEquals(Assert.java:834)
	at org.junit.Assert.assertEquals(Assert.java:118)
	at org.junit.Assert.assertEquals(Assert.java:144)
	at com.carrotsearch.hppc.TestUtils.assertEquals2(TestUtils.java:413)
	at com.carrotsearch.hppc.ByteObjectOpenHashMapTest.checkEmptySlotsUninitialized(ByteObjectOpenHashMapTest.java:46)
(21 more lines...)
Collapse Failed ByteObjectOpenHashMapTest testIterable History
JDK 1.8 < 1 sec
java.lang.AssertionError: expected:<null> but was:<0>
	at __randomizedtesting.SeedInfo.seed([B51EA4DAEB36D68C:EC4D716A09F55C06]:0)
	at org.junit.Assert.fail(Assert.java:88)
	at org.junit.Assert.failNotEquals(Assert.java:834)
	at org.junit.Assert.assertEquals(Assert.java:118)
	at org.junit.Assert.assertEquals(Assert.java:144)
	at com.carrotsearch.hppc.TestUtils.assertEquals2(TestUtils.java:413)
	at com.carrotsearch.hppc.ByteObjectOpenHashMapTest.checkEmptySlotsUninitialized(ByteObjectOpenHashMapTest.java:46)
(20 more lines...)
Collapse Failed CharObjectOpenHashMapTest testMapValues History
JDK 1.7 < 1 sec
java.lang.AssertionError: expected:<null> but was:<>
	at __randomizedtesting.SeedInfo.seed([81BF8621B43DCD77:BBEA5CD38761A683]:0)
	at org.junit.Assert.fail(Assert.java:88)
	at org.junit.Assert.failNotEquals(Assert.java:834)
	at org.junit.Assert.assertEquals(Assert.java:118)
	at org.junit.Assert.assertEquals(Assert.java:144)
	at com.carrotsearch.hppc.TestUtils.assertEquals2(TestUtils.java:413)
	at com.carrotsearch.hppc.CharObjectOpenHashMapTest.checkEmptySlotsUninitialized(CharObjectOpenHashMapTest.java:46)
(20 more lines...)
Collapse Failed CharObjectOpenHashMapTest testIterable History
JDK 1.7 < 1 sec
java.lang.AssertionError: expected:<null> but was:<>
	at __randomizedtesting.SeedInfo.seed([81BF8621B43DCD77:D8EC539156FE47FD]:0)
	at org.junit.Assert.fail(Assert.java:88)
	at org.junit.Assert.failNotEquals(Assert.java:834)
	at org.junit.Assert.assertEquals(Assert.java:118)
	at org.junit.Assert.assertEquals(Assert.java:144)
	at com.carrotsearch.hppc.TestUtils.assertEquals2(TestUtils.java:413)
	at com.carrotsearch.hppc.CharObjectOpenHashMapTest.checkEmptySlotsUninitialized(CharObjectOpenHashMapTest.java:46)
(20 more lines...)
Collapse Failed CharObjectOpenHashMapTest testMapValues History
JDK 1.8 < 1 sec
java.lang.AssertionError: expected:<null> but was:<>
	at __randomizedtesting.SeedInfo.seed([B51EA4DAEB36D68C:8F4B7E28D86ABD78]:0)
	at org.junit.Assert.fail(Assert.java:88)
	at org.junit.Assert.failNotEquals(Assert.java:834)
	at org.junit.Assert.assertEquals(Assert.java:118)
	at org.junit.Assert.assertEquals(Assert.java:144)
	at com.carrotsearch.hppc.TestUtils.assertEquals2(TestUtils.java:413)
	at com.carrotsearch.hppc.CharObjectOpenHashMapTest.checkEmptySlotsUninitialized(CharObjectOpenHashMapTest.java:46)
(21 more lines...)
Collapse Failed CharObjectOpenHashMapTest testIterable History
JDK 1.8 < 1 sec
java.lang.AssertionError: expected:<null> but was:<>
	at __randomizedtesting.SeedInfo.seed([B51EA4DAEB36D68C:EC4D716A09F55C06]:0)
	at org.junit.Assert.fail(Assert.java:88)
	at org.junit.Assert.failNotEquals(Assert.java:834)
	at org.junit.Assert.assertEquals(Assert.java:118)
	at org.junit.Assert.assertEquals(Assert.java:144)
	at com.carrotsearch.hppc.TestUtils.assertEquals2(TestUtils.java:413)
	at com.carrotsearch.hppc.CharObjectOpenHashMapTest.checkEmptySlotsUninitialized(CharObjectOpenHashMapTest.java:46)
(20 more lines...)
Collapse Failed DoubleObjectOpenHashMapTest testMapValues History
JDK 1.7 < 1 sec
java.lang.AssertionError: expected:<null> but was:<0.0>
	at __randomizedtesting.SeedInfo.seed([81BF8621B43DCD77:BBEA5CD38761A683]:0)
	at org.junit.Assert.fail(Assert.java:88)
	at org.junit.Assert.failNotEquals(Assert.java:834)
	at org.junit.Assert.assertEquals(Assert.java:118)
	at org.junit.Assert.assertEquals(Assert.java:144)
	at com.carrotsearch.hppc.TestUtils.assertEquals2(TestUtils.java:413)
	at com.carrotsearch.hppc.DoubleObjectOpenHashMapTest.checkEmptySlotsUninitialized(DoubleObjectOpenHashMapTest.java:46)
(20 more lines...)
Collapse Failed DoubleObjectOpenHashMapTest testIterable History
JDK 1.7 < 1 sec
java.lang.AssertionError: expected:<null> but was:<0.0>
	at __randomizedtesting.SeedInfo.seed([81BF8621B43DCD77:D8EC539156FE47FD]:0)
	at org.junit.Assert.fail(Assert.java:88)
	at org.junit.Assert.failNotEquals(Assert.java:834)
	at org.junit.Assert.assertEquals(Assert.java:118)
	at org.junit.Assert.assertEquals(Assert.java:144)
	at com.carrotsearch.hppc.TestUtils.assertEquals2(TestUtils.java:413)
	at com.carrotsearch.hppc.DoubleObjectOpenHashMapTest.checkEmptySlotsUninitialized(DoubleObjectOpenHashMapTest.java:46)
(20 more lines...)
Collapse Failed DoubleObjectOpenHashMapTest testIterable History
JDK 1.8 < 1 sec
java.lang.AssertionError: expected:<null> but was:<0.0>
	at __randomizedtesting.SeedInfo.seed([B51EA4DAEB36D68C:EC4D716A09F55C06]:0)
	at org.junit.Assert.fail(Assert.java:88)
	at org.junit.Assert.failNotEquals(Assert.java:834)
	at org.junit.Assert.assertEquals(Assert.java:118)
	at org.junit.Assert.assertEquals(Assert.java:144)
	at com.carrotsearch.hppc.TestUtils.assertEquals2(TestUtils.java:413)
	at com.carrotsearch.hppc.DoubleObjectOpenHashMapTest.checkEmptySlotsUninitialized(DoubleObjectOpenHashMapTest.java:46)
(20 more lines...)
Collapse Failed DoubleObjectOpenHashMapTest testMapValues History
JDK 1.8 < 1 sec
java.lang.AssertionError: expected:<null> but was:<0.0>
	at __randomizedtesting.SeedInfo.seed([B51EA4DAEB36D68C:8F4B7E28D86ABD78]:0)
	at org.junit.Assert.fail(Assert.java:88)
	at org.junit.Assert.failNotEquals(Assert.java:834)
	at org.junit.Assert.assertEquals(Assert.java:118)
	at org.junit.Assert.assertEquals(Assert.java:144)
	at com.carrotsearch.hppc.TestUtils.assertEquals2(TestUtils.java:413)
	at com.carrotsearch.hppc.DoubleObjectOpenHashMapTest.checkEmptySlotsUninitialized(DoubleObjectOpenHashMapTest.java:46)
(21 more lines...)
Collapse Failed FloatObjectOpenHashMapTest testIterable History
JDK 1.7 < 1 sec
java.lang.AssertionError: expected:<null> but was:<0.0>
	at __randomizedtesting.SeedInfo.seed([81BF8621B43DCD77:D8EC539156FE47FD]:0)
	at org.junit.Assert.fail(Assert.java:88)
	at org.junit.Assert.failNotEquals(Assert.java:834)
	at org.junit.Assert.assertEquals(Assert.java:118)
	at org.junit.Assert.assertEquals(Assert.java:144)
	at com.carrotsearch.hppc.TestUtils.assertEquals2(TestUtils.java:413)
	at com.carrotsearch.hppc.FloatObjectOpenHashMapTest.checkEmptySlotsUninitialized(FloatObjectOpenHashMapTest.java:46)
(20 more lines...)
Collapse Failed FloatObjectOpenHashMapTest testMapValues History
JDK 1.7 < 1 sec
java.lang.AssertionError: expected:<null> but was:<0.0>
	at __randomizedtesting.SeedInfo.seed([81BF8621B43DCD77:BBEA5CD38761A683]:0)
	at org.junit.Assert.fail(Assert.java:88)
	at org.junit.Assert.failNotEquals(Assert.java:834)
	at org.junit.Assert.assertEquals(Assert.java:118)
	at org.junit.Assert.assertEquals(Assert.java:144)
	at com.carrotsearch.hppc.TestUtils.assertEquals2(TestUtils.java:413)
	at com.carrotsearch.hppc.FloatObjectOpenHashMapTest.checkEmptySlotsUninitialized(FloatObjectOpenHashMapTest.java:46)
(20 more lines...)
Collapse Failed FloatObjectOpenHashMapTest testMapValues History
JDK 1.8 < 1 sec
java.lang.AssertionError: expected:<null> but was:<0.0>
	at __randomizedtesting.SeedInfo.seed([B51EA4DAEB36D68C:8F4B7E28D86ABD78]:0)
	at org.junit.Assert.fail(Assert.java:88)
	at org.junit.Assert.failNotEquals(Assert.java:834)
	at org.junit.Assert.assertEquals(Assert.java:118)
	at org.junit.Assert.assertEquals(Assert.java:144)
	at com.carrotsearch.hppc.TestUtils.assertEquals2(TestUtils.java:413)
	at com.carrotsearch.hppc.FloatObjectOpenHashMapTest.checkEmptySlotsUninitialized(FloatObjectOpenHashMapTest.java:46)
(21 more lines...)
Collapse Failed FloatObjectOpenHashMapTest testIterable History
JDK 1.8 < 1 sec
java.lang.AssertionError: expected:<null> but was:<0.0>
	at __randomizedtesting.SeedInfo.seed([B51EA4DAEB36D68C:EC4D716A09F55C06]:0)
	at org.junit.Assert.fail(Assert.java:88)
	at org.junit.Assert.failNotEquals(Assert.java:834)
	at org.junit.Assert.assertEquals(Assert.java:118)
	at org.junit.Assert.assertEquals(Assert.java:144)
	at com.carrotsearch.hppc.TestUtils.assertEquals2(TestUtils.java:413)
	at com.carrotsearch.hppc.FloatObjectOpenHashMapTest.checkEmptySlotsUninitialized(FloatObjectOpenHashMapTest.java:46)
(20 more lines...)
Collapse Failed IntObjectOpenHashMapTest testMapValues History
JDK 1.7 < 1 sec
java.lang.AssertionError: expected:<null> but was:<0>
	at __randomizedtesting.SeedInfo.seed([81BF8621B43DCD77:BBEA5CD38761A683]:0)
	at org.junit.Assert.fail(Assert.java:88)
	at org.junit.Assert.failNotEquals(Assert.java:834)
	at org.junit.Assert.assertEquals(Assert.java:118)
	at org.junit.Assert.assertEquals(Assert.java:144)
	at com.carrotsearch.hppc.TestUtils.assertEquals2(TestUtils.java:413)
	at com.carrotsearch.hppc.IntObjectOpenHashMapTest.checkEmptySlotsUninitialized(IntObjectOpenHashMapTest.java:46)
(20 more lines...)
Collapse Failed IntObjectOpenHashMapTest testIterable History
JDK 1.7 < 1 sec
java.lang.AssertionError: expected:<null> but was:<0>
	at __randomizedtesting.SeedInfo.seed([81BF8621B43DCD77:D8EC539156FE47FD]:0)
	at org.junit.Assert.fail(Assert.java:88)
	at org.junit.Assert.failNotEquals(Assert.java:834)
	at org.junit.Assert.assertEquals(Assert.java:118)
	at org.junit.Assert.assertEquals(Assert.java:144)
	at com.carrotsearch.hppc.TestUtils.assertEquals2(TestUtils.java:413)
	at com.carrotsearch.hppc.IntObjectOpenHashMapTest.checkEmptySlotsUninitialized(IntObjectOpenHashMapTest.java:46)
(20 more lines...)
Collapse Failed IntObjectOpenHashMapTest testMapValues History
JDK 1.8 < 1 sec
java.lang.AssertionError: expected:<null> but was:<0>
	at __randomizedtesting.SeedInfo.seed([B51EA4DAEB36D68C:8F4B7E28D86ABD78]:0)
	at org.junit.Assert.fail(Assert.java:88)
	at org.junit.Assert.failNotEquals(Assert.java:834)
	at org.junit.Assert.assertEquals(Assert.java:118)
	at org.junit.Assert.assertEquals(Assert.java:144)
	at com.carrotsearch.hppc.TestUtils.assertEquals2(TestUtils.java:413)
	at com.carrotsearch.hppc.IntObjectOpenHashMapTest.checkEmptySlotsUninitialized(IntObjectOpenHashMapTest.java:46)
(21 more lines...)
Collapse Failed IntObjectOpenHashMapTest testIterable History
JDK 1.8 < 1 sec
java.lang.AssertionError: expected:<null> but was:<0>
	at __randomizedtesting.SeedInfo.seed([B51EA4DAEB36D68C:EC4D716A09F55C06]:0)
	at org.junit.Assert.fail(Assert.java:88)
	at org.junit.Assert.failNotEquals(Assert.java:834)
	at org.junit.Assert.assertEquals(Assert.java:118)
	at org.junit.Assert.assertEquals(Assert.java:144)
	at com.carrotsearch.hppc.TestUtils.assertEquals2(TestUtils.java:413)
	at com.carrotsearch.hppc.IntObjectOpenHashMapTest.checkEmptySlotsUninitialized(IntObjectOpenHashMapTest.java:46)
(20 more lines...)
Collapse Failed LongObjectOpenHashMapTest testMapValues History
JDK 1.7 < 1 sec
java.lang.AssertionError: expected:<null> but was:<0>
	at __randomizedtesting.SeedInfo.seed([81BF8621B43DCD77:BBEA5CD38761A683]:0)
	at org.junit.Assert.fail(Assert.java:88)
	at org.junit.Assert.failNotEquals(Assert.java:834)
	at org.junit.Assert.assertEquals(Assert.java:118)
	at org.junit.Assert.assertEquals(Assert.java:144)
	at com.carrotsearch.hppc.TestUtils.assertEquals2(TestUtils.java:413)
	at com.carrotsearch.hppc.LongObjectOpenHashMapTest.checkEmptySlotsUninitialized(LongObjectOpenHashMapTest.java:46)
(20 more lines...)
Collapse Failed LongObjectOpenHashMapTest testIterable History
JDK 1.7 < 1 sec
java.lang.AssertionError: expected:<null> but was:<0>
	at __randomizedtesting.SeedInfo.seed([81BF8621B43DCD77:D8EC539156FE47FD]:0)
	at org.junit.Assert.fail(Assert.java:88)
	at org.junit.Assert.failNotEquals(Assert.java:834)
	at org.junit.Assert.assertEquals(Assert.java:118)
	at org.junit.Assert.assertEquals(Assert.java:144)
	at com.carrotsearch.hppc.TestUtils.assertEquals2(TestUtils.java:413)
	at com.carrotsearch.hppc.LongObjectOpenHashMapTest.checkEmptySlotsUninitialized(LongObjectOpenHashMapTest.java:46)
(20 more lines...)
Collapse Failed LongObjectOpenHashMapTest testIterable History
JDK 1.8 < 1 sec
java.lang.AssertionError: expected:<null> but was:<0>
	at __randomizedtesting.SeedInfo.seed([B51EA4DAEB36D68C:EC4D716A09F55C06]:0)
	at org.junit.Assert.fail(Assert.java:88)
	at org.junit.Assert.failNotEquals(Assert.java:834)
	at org.junit.Assert.assertEquals(Assert.java:118)
	at org.junit.Assert.assertEquals(Assert.java:144)
	at com.carrotsearch.hppc.TestUtils.assertEquals2(TestUtils.java:413)
	at com.carrotsearch.hppc.LongObjectOpenHashMapTest.checkEmptySlotsUninitialized(LongObjectOpenHashMapTest.java:46)
(20 more lines...)
Collapse Failed LongObjectOpenHashMapTest testMapValues History
JDK 1.8 < 1 sec
java.lang.AssertionError: expected:<null> but was:<0>
	at __randomizedtesting.SeedInfo.seed([B51EA4DAEB36D68C:8F4B7E28D86ABD78]:0)
	at org.junit.Assert.fail(Assert.java:88)
	at org.junit.Assert.failNotEquals(Assert.java:834)
	at org.junit.Assert.assertEquals(Assert.java:118)
	at org.junit.Assert.assertEquals(Assert.java:144)
	at com.carrotsearch.hppc.TestUtils.assertEquals2(TestUtils.java:413)
	at com.carrotsearch.hppc.LongObjectOpenHashMapTest.checkEmptySlotsUninitialized(LongObjectOpenHashMapTest.java:46)
(21 more lines...)
Collapse Failed ShortObjectOpenHashMapTest testIterable History
JDK 1.7 < 1 sec
java.lang.AssertionError: expected:<null> but was:<0>
	at __randomizedtesting.SeedInfo.seed([81BF8621B43DCD77:D8EC539156FE47FD]:0)
	at org.junit.Assert.fail(Assert.java:88)
	at org.junit.Assert.failNotEquals(Assert.java:834)
	at org.junit.Assert.assertEquals(Assert.java:118)
	at org.junit.Assert.assertEquals(Assert.java:144)
	at com.carrotsearch.hppc.TestUtils.assertEquals2(TestUtils.java:413)
	at com.carrotsearch.hppc.ShortObjectOpenHashMapTest.checkEmptySlotsUninitialized(ShortObjectOpenHashMapTest.java:46)
(20 more lines...)
Collapse Failed ShortObjectOpenHashMapTest testMapValues History
JDK 1.7 < 1 sec
java.lang.AssertionError: expected:<null> but was:<0>
	at __randomizedtesting.SeedInfo.seed([81BF8621B43DCD77:BBEA5CD38761A683]:0)
	at org.junit.Assert.fail(Assert.java:88)
	at org.junit.Assert.failNotEquals(Assert.java:834)
	at org.junit.Assert.assertEquals(Assert.java:118)
	at org.junit.Assert.assertEquals(Assert.java:144)
	at com.carrotsearch.hppc.TestUtils.assertEquals2(TestUtils.java:413)
	at com.carrotsearch.hppc.ShortObjectOpenHashMapTest.checkEmptySlotsUninitialized(ShortObjectOpenHashMapTest.java:46)
(20 more lines...)
Collapse Failed ShortObjectOpenHashMapTest testIterable History
JDK 1.8 < 1 sec
java.lang.AssertionError: expected:<null> but was:<0>
	at __randomizedtesting.SeedInfo.seed([B51EA4DAEB36D68C:EC4D716A09F55C06]:0)
	at org.junit.Assert.fail(Assert.java:88)
	at org.junit.Assert.failNotEquals(Assert.java:834)
	at org.junit.Assert.assertEquals(Assert.java:118)
	at org.junit.Assert.assertEquals(Assert.java:144)
	at com.carrotsearch.hppc.TestUtils.assertEquals2(TestUtils.java:413)
	at com.carrotsearch.hppc.ShortObjectOpenHashMapTest.checkEmptySlotsUninitialized(ShortObjectOpenHashMapTest.java:46)
(20 more lines...)
Collapse Failed ShortObjectOpenHashMapTest testMapValues History
JDK 1.8 < 1 sec
java.lang.AssertionError: expected:<null> but was:<0>
	at __randomizedtesting.SeedInfo.seed([B51EA4DAEB36D68C:8F4B7E28D86ABD78]:0)
	at org.junit.Assert.fail(Assert.java:88)
	at org.junit.Assert.failNotEquals(Assert.java:834)
	at org.junit.Assert.assertEquals(Assert.java:118)
	at org.junit.Assert.assertEquals(Assert.java:144)
	at com.carrotsearch.hppc.TestUtils.assertEquals2(TestUtils.java:413)
	at com.carrotsearch.hppc.ShortObjectOpenHashMapTest.checkEmptySlotsUninitialized(ShortObjectOpenHashMapTest.java:46)
(21 more lines...)

Jira issues

IssueDescriptionStatus
Unknown Issue TypeHPPC-116Could not obtain issue details from Jira