Build #27

Build: #27 failed

Job: JDK 1.8 failed

Stages & jobs

  1. Compile and test

  2. Package

Job result summary

Completed
Duration
34 seconds
Revision
65a4f2cdc119e473c7dcd30a5ee53652f6c32dd3 65a4f2cdc119e473c7dcd30a5ee53652f6c32dd3
Total tests
3382
Fixed in
#29 (Manual run by Dawid Weiss)

Tests

  • 3,382 tests in total
  • 4 tests failed
  • 4 failures are new
  • 42 seconds taken in total.
New test failures 4
Status Test Duration
Collapse Failed ObjectDoubleOpenIdentityHashMapTest testHashCodeEquals History
< 1 sec
java.lang.AssertionError: expected:<1238908127> but was:<-1660007778>
	at org.junit.Assert.fail(Assert.java:88)
	at org.junit.Assert.failNotEquals(Assert.java:743)
	at org.junit.Assert.assertEquals(Assert.java:118)
	at org.junit.Assert.assertEquals(Assert.java:555)
	at org.junit.Assert.assertEquals(Assert.java:542)
	at com.carrotsearch.hppc.ObjectDoubleOpenIdentityHashMapTest.testHashCodeEquals(ObjectDoubleOpenIdentityHashMapTest.java:515)
	at sun.reflect.NativeMethodAccessorImpl.invoke0(Native Method)
(20 more lines...)
Collapse Failed ObjectDoubleOpenIdentityHashMapTest testHashCodeEqualsDifferentPerturbance History
< 1 sec
java.lang.AssertionError: expected:<-177145841> but was:<1824675310>
	at org.junit.Assert.fail(Assert.java:88)
	at org.junit.Assert.failNotEquals(Assert.java:743)
	at org.junit.Assert.assertEquals(Assert.java:118)
	at org.junit.Assert.assertEquals(Assert.java:555)
	at org.junit.Assert.assertEquals(Assert.java:542)
	at com.carrotsearch.hppc.ObjectDoubleOpenIdentityHashMapTest.testHashCodeEqualsDifferentPerturbance(ObjectDoubleOpenIdentityHashMapTest.java:556)
	at sun.reflect.NativeMethodAccessorImpl.invoke0(Native Method)
(20 more lines...)
Collapse Failed ObjectFloatOpenIdentityHashMapTest testHashCodeEquals History
< 1 sec
java.lang.AssertionError: expected:<-1056283726> but was:<-725087620>
	at org.junit.Assert.fail(Assert.java:88)
	at org.junit.Assert.failNotEquals(Assert.java:743)
	at org.junit.Assert.assertEquals(Assert.java:118)
	at org.junit.Assert.assertEquals(Assert.java:555)
	at org.junit.Assert.assertEquals(Assert.java:542)
	at com.carrotsearch.hppc.ObjectFloatOpenIdentityHashMapTest.testHashCodeEquals(ObjectFloatOpenIdentityHashMapTest.java:515)
	at sun.reflect.NativeMethodAccessorImpl.invoke0(Native Method)
(20 more lines...)
Collapse Failed ObjectFloatOpenIdentityHashMapTest testHashCodeEqualsDifferentPerturbance History
< 1 sec
java.lang.AssertionError: expected:<-1736983274> but was:<-536642589>
	at org.junit.Assert.fail(Assert.java:88)
	at org.junit.Assert.failNotEquals(Assert.java:743)
	at org.junit.Assert.assertEquals(Assert.java:118)
	at org.junit.Assert.assertEquals(Assert.java:555)
	at org.junit.Assert.assertEquals(Assert.java:542)
	at com.carrotsearch.hppc.ObjectFloatOpenIdentityHashMapTest.testHashCodeEqualsDifferentPerturbance(ObjectFloatOpenIdentityHashMapTest.java:556)
	at sun.reflect.NativeMethodAccessorImpl.invoke0(Native Method)
(20 more lines...)