Build #135

Build: #135 failed

Job: JDK 1.8 failed

Stages & jobs

  1. Compile and test

  2. Package

Build log

The build generated 197 lines of output. Download or view full build log

29-Jul-2020 13:38:56 Build HPPC - Software - JDK 1.8 #135 (HPPC-SOFTWARE-JDK18-135) started building on agent Local Agent 1
29-Jul-2020 13:38:56
29-Jul-2020 13:38:56 Build working directory is /var/atlassian/application-data/bamboo/xml-data/build-dir/HPPC-SOFTWARE-JDK18
29-Jul-2020 13:38:56 Executing build HPPC - Software - JDK 1.8 #135 (HPPC-SOFTWARE-JDK18-135)
29-Jul-2020 13:38:56 Starting task 'Checkout Default Repository' of type 'com.atlassian.bamboo.plugins.vcs:task.vcs.checkout'
29-Jul-2020 13:38:56 Checking out into /var/atlassian/application-data/bamboo/xml-data/build-dir/HPPC-SOFTWARE-JDK18
29-Jul-2020 13:38:56 Updating source code to revision: 6930e90fee9b43703529d7effebcd3f1f8290b19
29-Jul-2020 13:38:56 Fetching 'refs/heads/master' from 'https://github.com/carrotsearch/hppc.git'.
29-Jul-2020 13:38:57 Checking out revision 6930e90fee9b43703529d7effebcd3f1f8290b19.
29-Jul-2020 13:38:57 From file:///var/atlassian/application-data/bamboo/xml-data/build-dir/_git-repositories-cache/5c2fa173826497297a1c22e98335ade952c10a19
29-Jul-2020 13:38:57    256fce8..6930e90  master     -> origin/master
29-Jul-2020 13:38:57 Already on 'master'
29-Jul-2020 13:38:57 Your branch is behind 'origin/master' by 6 commits, and can be fast-forwarded.
29-Jul-2020 13:38:57   (use "git pull" to update your local branch)
29-Jul-2020 13:38:57 HEAD is now at 6930e90 Run javadoc on check
29-Jul-2020 13:38:57 Updated source code to revision: 6930e90fee9b43703529d7effebcd3f1f8290b19
29-Jul-2020 13:38:57 Finished task 'Checkout Default Repository' with result: Success
29-Jul-2020 13:38:57 Running pre-build action: VCS Version Collector
29-Jul-2020 13:38:57 Starting task 'Maven 3.x' of type 'com.atlassian.bamboo.plugins.maven:task.builder.mvn3'
29-Jul-2020 13:38:57
Beginning to execute external process for build 'HPPC - Software - JDK 1.8 #135 (HPPC-SOFTWARE-JDK18-135)'
... running command line:
/home/bamboo/jvms/maven/bin/mvn --batch-mode -Djava.io.tmpdir=/opt/atlassian/bamboo/current/temp/HPPC-SOFTWARE-JDK18 -Dmaven.repo.local=/var/atlassian/application-data/bamboo/.m2/AGENT-131073/repository clean verify
... in: /var/atlassian/application-data/bamboo/xml-data/build-dir/HPPC-SOFTWARE-JDK18
... using extra environment variables:
bamboo_planRepository_1_branch=master
bamboo_carrotsearch_secure_staging_user=bamboo
bamboo_planRepository_1_branchDisplayName=master
bamboo_repository_revision_number=6930e90fee9b43703529d7effebcd3f1f8290b19
MAVEN2_HOME=/home/bamboo/jvms/maven
bamboo_capability_persistent_dir=/home/bamboo/persistent
bamboo_buildKey=HPPC-SOFTWARE-JDK18
bamboo_capability_system_builder_command_rsync=rsync
bamboo_shortJobName=JDK 1.8
bamboo_repository_65541_revision_number=6930e90fee9b43703529d7effebcd3f1f8290b19
bamboo_buildResultsUrl=https://builds.carrot2.org/browse/HPPC-SOFTWARE-JDK18-135
bamboo_planRepository_repositoryUrl=https://github.com/carrotsearch/hppc.git
bamboo_repository_65541_branch_name=master
bamboo_agentId=131073
bamboo_carrotsearch_secure_staging_host=kappa.carrotsearch.com
bamboo_capability_system_jdk_JDK_9=/home/bamboo/jvms/jdk9
bamboo_planRepository_revision=6930e90fee9b43703529d7effebcd3f1f8290b19
bamboo_planRepository_previousRevision=256fce8e20c00f47b3877bd88eeca839cc7c7882
bamboo_repository_branch_name=master
bamboo_carrotsearch_download_official_port=2233
bamboo_capability_system_jdk_JDK_10=/home/bamboo/jvms/jdk10
bamboo_carrot2_website_ssh=carrotse@get.carrotsearch.com:~/sites/project.carrot2.org
bamboo_csssprites_download_path=/srv/vhosts/get.csssprites.org
bamboo_carrotsearch_labs_ssh_port=2233
bamboo_carrot2_download_user=bamboo
JAVA_HOME=/home/bamboo/jvms/jdk8
bamboo_capability_tools_dir=/home/bamboo/tools
bamboo_carrotsearch_download_staging_host=kappa.carrotsearch.com
bamboo_repository_65541_name=github/carrotsearch/hppc
bamboo_carrotsearch_download_official_path=~/sites/get.carrotsearch.com
bamboo_planRepository_branch=master
bamboo_carrotsearch_secure2_ssh=carrotse@get.carrotsearch.com:~/sites/secure.carrotsearch.com
bamboo_capability_system_jdk_JDK_13=/home/bamboo/jvms/jdk13
bamboo_capability_system_jdk_JDK_14=/home/bamboo/jvms/jdk14
bamboo_capability_system_jdk_JDK_11=/home/bamboo/jvms/jdk11
bamboo_planRepository_1_type=gitv2
bamboo_planRepository_branchName=master
bamboo_capability_system_jdk_JDK_12=/home/bamboo/jvms/jdk12
bamboo_capability_system_jdk_JDK_11_J9=/home/bamboo/jvms/jdk11-j9
bamboo_capability_system_jdk_JDK=/home/bamboo/jvms/jdk8
bamboo_hg_cache_directory=/var/atlassian/application-data/bamboo/xml-data/build-dir/_hg-repositories-cache
bamboo_planRepository_1_username=
bamboo_planRepository_type=gitv2
bamboo_carrot2_download_host=kappa.carrotsearch.com
bamboo_git_cache_directory=/var/atlassian/application-data/bamboo/xml-data/build-dir/_git-repositories-cache
bamboo_carrotsearch_download_staging_user=bamboo
useMavenReturnCode=false
bamboo_capability_system_builder_node_Node_js=/usr/bin/nodejs
bamboo_capability_system_builder_ant_Ant=/home/bamboo/jvms/ant1.9
bamboo_capability_system_builder_mvn3_Maven_3=/home/bamboo/jvms/maven
bamboo_tmp_directory=/var/atlassian/application-data/bamboo/temp
bamboo_planKey=HPPC-SOFTWARE
bamboo_planRepository_username=
bamboo_carrotsearch_website_ssh=carrotse@get.carrotsearch.com:~/sites/www.carrotsearch.com
bamboo_capability_system_builder_command_yarn=/usr/bin/yarn
bamboo_planRepository_1_branchName=master
bamboo_repository_65541_previous_revision_number=256fce8e20c00f47b3877bd88eeca839cc7c7882
bamboo_repository_65541_git_branch=master
bamboo_resultsUrl=https://builds.carrot2.org/browse/HPPC-SOFTWARE-JDK18-135
bamboo_capability_Linux=
bamboo_carrotsearch_labs_ssh=carrotse@get.carrotsearch.com:~/sites/labs.carrotsearch.com
bamboo_build_working_directory=/var/atlassian/application-data/bamboo/xml-data/build-dir/HPPC-SOFTWARE-JDK18
bamboo_planRepository_1_name=github/carrotsearch/hppc
bamboo_shortPlanName=Software
bamboo_planRepository_name=github/carrotsearch/hppc
bamboo_buildNumber=135
bamboo_repository_65541_git_repositoryUrl=https://github.com/carrotsearch/hppc.git
bamboo_npm_authToken=ce5f381d-7f24-4a22-96d8-62af04f484bf
bamboo_carrotsearch_secure_staging_path=/srv/vhosts/staging-secure.carrotsearch.com
bamboo_carrotsearch_secure_ssh_port=2233
bamboo_planName=HPPC - Software
bamboo_capability_system_builder_command_git=git
bamboo_shortPlanKey=SOFTWARE
bamboo_shortJobKey=JDK18
bamboo_buildTimeStamp=2020-07-29T13:38:56.560+02:00
bamboo_repository_previous_revision_number=256fce8e20c00f47b3877bd88eeca839cc7c7882
M2_HOME=/home/bamboo/jvms/maven
bamboo_repository_git_branch=master
bamboo_buildResultKey=HPPC-SOFTWARE-JDK18-135
bamboo_repository_65541_git_username=
bamboo_buildPlanName=HPPC - Software - JDK 1.8
bamboo_planRepository_1_revision=6930e90fee9b43703529d7effebcd3f1f8290b19
bamboo_repository_name=github/carrotsearch/hppc
bamboo_carrot2_website_ssh_port=2233
bamboo_csssprites_download_host=kappa.carrotsearch.com
bamboo_buildFailed=false
bamboo_agentWorkingDirectory=/var/atlassian/application-data/bamboo/xml-data/build-dir
bamboo_carrotsearch_download_official_host=get.carrotsearch.com
bamboo_capability_system_git_executable=/usr/bin/git
bamboo_l4g_mvn_opts=-Xmx1g
bamboo_repository_git_username=
bamboo_planRepository_1_previousRevision=256fce8e20c00f47b3877bd88eeca839cc7c7882
bamboo_carrotsearch_download_staging_path=/srv/vhosts/staging-get.carrotsearch.com
bamboo_planRepository_branchDisplayName=master
bamboo_capability_corpora_dir=/home/bamboo/corpora
bamboo_csssprites_download_user=bamboo
bamboo_plan_storageTag=HPPC-SOFTWARE
bamboo_carrot2_download_path=/srv/vhosts/get.carrot2.org
bamboo_repository_git_repositoryUrl=https://github.com/carrotsearch/hppc.git
bamboo_carrotsearch_download_official_user=carrotse
bamboo_working_directory=/var/atlassian/application-data/bamboo/xml-data/build-dir/HPPC-SOFTWARE-JDK18
bamboo_planRepository_1_repositoryUrl=https://github.com/carrotsearch/hppc.git
bamboo_capability_system_jdk_JDK_1_8=/home/bamboo/jvms/jdk8
bamboo_capability_system_builder_command_zip=zip
bamboo_capability_system_jdk_JDK_1_9=/home/bamboo/jvms/jdk9
bamboo_capability_system_jdk_JDK_1_7=/home/bamboo/jvms/jdk7
bamboo_carrotsearch_secure_ssh=carrotse@get.carrotsearch.com:~/sites/secure.carrotsearch.com
bamboo_carrotsearch_website_ssh_port=2233
PATH=/home/bamboo/jvms/jdk8/bin:/usr/local/sbin:/usr/local/bin:/usr/sbin:/usr/bin:/sbin:/bin:/usr/games:/usr/local/games:/snap/bin
29-Jul-2020 13:38:58 [INFO] Scanning for projects...
29-Jul-2020 13:38:58 [INFO] ------------------------------------------------------------------------
29-Jul-2020 13:38:58 [INFO] BUILD FAILURE
29-Jul-2020 13:38:58 [INFO] ------------------------------------------------------------------------
29-Jul-2020 13:38:58 [INFO] Total time:  0.056 s
29-Jul-2020 13:38:58 [INFO] Finished at: 2020-07-29T13:38:58+02:00
29-Jul-2020 13:38:58 [INFO] ------------------------------------------------------------------------
29-Jul-2020 13:38:58 [ERROR] The goal you specified requires a project to execute but there is no POM in this directory (/var/atlassian/application-data/bamboo/xml-data/build-dir/HPPC-SOFTWARE-JDK18). Please verify you invoked Maven from the correct directory. -> [Help 1]
29-Jul-2020 13:38:58 [ERROR]
29-Jul-2020 13:38:58 [ERROR] To see the full stack trace of the errors, re-run Maven with the -e switch.
29-Jul-2020 13:38:58 [ERROR] Re-run Maven using the -X switch to enable full debug logging.
29-Jul-2020 13:38:58 [ERROR]
29-Jul-2020 13:38:58 [ERROR] For more information about the errors and possible solutions, please read the following articles:
29-Jul-2020 13:38:58 [ERROR] [Help 1] http://cwiki.apache.org/confluence/display/MAVEN/MissingProjectException
29-Jul-2020 13:38:58 Failing task since return code of [/home/bamboo/jvms/maven/bin/mvn --batch-mode -Djava.io.tmpdir=/opt/atlassian/bamboo/current/temp/HPPC-SOFTWARE-JDK18 -Dmaven.repo.local=/var/atlassian/application-data/bamboo/.m2/AGENT-131073/repository clean verify] was 1 while expected 0
29-Jul-2020 13:38:58 Parsing test results under /var/atlassian/application-data/bamboo/xml-data/build-dir/HPPC-SOFTWARE-JDK18...
29-Jul-2020 13:38:58 File /var/atlassian/application-data/bamboo/xml-data/build-dir/HPPC-SOFTWARE-JDK18/hppc-examples/target/surefire-reports/TEST-com.carrotsearch.hppc.examples.HppcExample_001_IteratingOverLists.xml was ignored because it was modified (2020-06-23 17:03:23.000) before task started (2020-07-29 13:38:56.766)
29-Jul-2020 13:38:58 File /var/atlassian/application-data/bamboo/xml-data/build-dir/HPPC-SOFTWARE-JDK18/hppc-examples/target/surefire-reports/TEST-com.carrotsearch.hppc.examples.HppcExample_002_IteratingOverDeques.xml was ignored because it was modified (2020-06-23 17:03:23.000) before task started (2020-07-29 13:38:56.766)
29-Jul-2020 13:38:58 File /var/atlassian/application-data/bamboo/xml-data/build-dir/HPPC-SOFTWARE-JDK18/hppc-examples/target/surefire-reports/TEST-com.carrotsearch.hppc.examples.HppcExample_003_IteratingOverSets.xml was ignored because it was modified (2020-06-23 17:03:23.000) before task started (2020-07-29 13:38:56.766)
29-Jul-2020 13:38:58 File /var/atlassian/application-data/bamboo/xml-data/build-dir/HPPC-SOFTWARE-JDK18/hppc-examples/target/surefire-reports/TEST-com.carrotsearch.hppc.examples.HppcExample_004_IteratingOverMaps.xml was ignored because it was modified (2020-06-23 17:03:23.000) before task started (2020-07-29 13:38:56.766)
29-Jul-2020 13:38:58 File /var/atlassian/application-data/bamboo/xml-data/build-dir/HPPC-SOFTWARE-JDK18/hppc-examples/target/surefire-reports/TEST-com.carrotsearch.hppc.examples.HppcExample_005_ForEachValues.xml was ignored because it was modified (2020-06-23 17:03:23.000) before task started (2020-07-29 13:38:56.766)
29-Jul-2020 13:38:58 File /var/atlassian/application-data/bamboo/xml-data/build-dir/HPPC-SOFTWARE-JDK18/hppc-examples/target/surefire-reports/TEST-com.carrotsearch.hppc.examples.HppcExample_005_IteratingOverObjectBuffers.xml was ignored because it was modified (2020-06-23 17:03:23.000) before task started (2020-07-29 13:38:56.766)
29-Jul-2020 13:38:58 File /var/atlassian/application-data/bamboo/xml-data/build-dir/HPPC-SOFTWARE-JDK18/hppc-examples/target/surefire-reports/TEST-com.carrotsearch.hppc.examples.HppcExample_006_HashAndScatterMaps.xml was ignored because it was modified (2020-06-23 17:03:28.000) before task started (2020-07-29 13:38:56.766)
29-Jul-2020 13:38:58 File /var/atlassian/application-data/bamboo/xml-data/build-dir/HPPC-SOFTWARE-JDK18/hppc/target/surefire-reports/TEST-com.carrotsearch.hppc.APIExpectationsTest.xml was ignored because it was modified (2020-06-23 17:03:13.000) before task started (2020-07-29 13:38:56.766)
29-Jul-2020 13:38:58 File /var/atlassian/application-data/bamboo/xml-data/build-dir/HPPC-SOFTWARE-JDK18/hppc/target/surefire-reports/TEST-com.carrotsearch.hppc.BitSetTest.xml was ignored because it was modified (2020-06-23 17:03:12.000) before task started (2020-07-29 13:38:56.766)
29-Jul-2020 13:38:58 File /var/atlassian/application-data/bamboo/xml-data/build-dir/HPPC-SOFTWARE-JDK18/hppc/target/surefire-reports/TEST-com.carrotsearch.hppc.BoundedProportionalArraySizingStrategyTest.xml was ignored because it was modified (2020-06-23 17:03:13.000) before task started (2020-07-29 13:38:56.766)
29-Jul-2020 13:38:58 File /var/atlassian/application-data/bamboo/xml-data/build-dir/HPPC-SOFTWARE-JDK18/hppc/target/surefire-reports/TEST-com.carrotsearch.hppc.ByteArrayDequeTest.xml was ignored because it was modified (2020-06-23 17:03:12.000) before task started (2020-07-29 13:38:56.766)
29-Jul-2020 13:38:58 File /var/atlassian/application-data/bamboo/xml-data/build-dir/HPPC-SOFTWARE-JDK18/hppc/target/surefire-reports/TEST-com.carrotsearch.hppc.ByteArrayListTest.xml was ignored because it was modified (2020-06-23 17:03:12.000) before task started (2020-07-29 13:38:56.766)
29-Jul-2020 13:38:58 File /var/atlassian/application-data/bamboo/xml-data/build-dir/HPPC-SOFTWARE-JDK18/hppc/target/surefire-reports/TEST-com.carrotsearch.hppc.ByteStackTest.xml was ignored because it was modified (2020-06-23 17:03:11.000) before task started (2020-07-29 13:38:56.766)
29-Jul-2020 13:38:58 File /var/atlassian/application-data/bamboo/xml-data/build-dir/HPPC-SOFTWARE-JDK18/hppc/target/surefire-reports/TEST-com.carrotsearch.hppc.CharArrayDequeTest.xml was ignored because it was modified (2020-06-23 17:03:11.000) before task started (2020-07-29 13:38:56.766)
29-Jul-2020 13:38:58 File /var/atlassian/application-data/bamboo/xml-data/build-dir/HPPC-SOFTWARE-JDK18/hppc/target/surefire-reports/TEST-com.carrotsearch.hppc.CharArrayListTest.xml was ignored because it was modified (2020-06-23 17:03:12.000) before task started (2020-07-29 13:38:56.766)
29-Jul-2020 13:38:58 File /var/atlassian/application-data/bamboo/xml-data/build-dir/HPPC-SOFTWARE-JDK18/hppc/target/surefire-reports/TEST-com.carrotsearch.hppc.CharByteHashMapTest.xml was ignored because it was modified (2020-06-23 17:03:13.000) before task started (2020-07-29 13:38:56.766)
29-Jul-2020 13:38:58 File /var/atlassian/application-data/bamboo/xml-data/build-dir/HPPC-SOFTWARE-JDK18/hppc/target/surefire-reports/TEST-com.carrotsearch.hppc.CharByteScatterMapTest.xml was ignored because it was modified (2020-06-23 17:03:12.000) before task started (2020-07-29 13:38:56.766)
29-Jul-2020 13:38:58 File /var/atlassian/application-data/bamboo/xml-data/build-dir/HPPC-SOFTWARE-JDK18/hppc/target/surefire-reports/TEST-com.carrotsearch.hppc.CharCharHashMapTest.xml was ignored because it was modified (2020-06-23 17:03:13.000) before task started (2020-07-29 13:38:56.766)
29-Jul-2020 13:38:58 File /var/atlassian/application-data/bamboo/xml-data/build-dir/HPPC-SOFTWARE-JDK18/hppc/target/surefire-reports/TEST-com.carrotsearch.hppc.CharCharScatterMapTest.xml was ignored because it was modified (2020-06-23 17:03:12.000) before task started (2020-07-29 13:38:56.766)
29-Jul-2020 13:38:58 File /var/atlassian/application-data/bamboo/xml-data/build-dir/HPPC-SOFTWARE-JDK18/hppc/target/surefire-reports/TEST-com.carrotsearch.hppc.CharDoubleHashMapTest.xml was ignored because it was modified (2020-06-23 17:03:14.000) before task started (2020-07-29 13:38:56.766)
29-Jul-2020 13:38:58 File /var/atlassian/application-data/bamboo/xml-data/build-dir/HPPC-SOFTWARE-JDK18/hppc/target/surefire-reports/TEST-com.carrotsearch.hppc.CharDoubleScatterMapTest.xml was ignored because it was modified (2020-06-23 17:03:13.000) before task started (2020-07-29 13:38:56.766)
29-Jul-2020 13:38:58 File /var/atlassian/application-data/bamboo/xml-data/build-dir/HPPC-SOFTWARE-JDK18/hppc/target/surefire-reports/TEST-com.carrotsearch.hppc.CharFloatHashMapTest.xml was ignored because it was modified (2020-06-23 17:03:15.000) before task started (2020-07-29 13:38:56.766)
29-Jul-2020 13:38:58 File /var/atlassian/application-data/bamboo/xml-data/build-dir/HPPC-SOFTWARE-JDK18/hppc/target/surefire-reports/TEST-com.carrotsearch.hppc.CharFloatScatterMapTest.xml was ignored because it was modified (2020-06-23 17:03:11.000) before task started (2020-07-29 13:38:56.766)
29-Jul-2020 13:38:58 File /var/atlassian/application-data/bamboo/xml-data/build-dir/HPPC-SOFTWARE-JDK18/hppc/target/surefire-reports/TEST-com.carrotsearch.hppc.CharHashSetTest.xml was ignored because it was modified (2020-06-23 17:03:14.000) before task started (2020-07-29 13:38:56.766)
29-Jul-2020 13:38:58 File /var/atlassian/application-data/bamboo/xml-data/build-dir/HPPC-SOFTWARE-JDK18/hppc/target/surefire-reports/TEST-com.carrotsearch.hppc.CharIntHashMapTest.xml was ignored because it was modified (2020-06-23 17:03:14.000) before task started (2020-07-29 13:38:56.766)
29-Jul-2020 13:38:58 File /var/atlassian/application-data/bamboo/xml-data/build-dir/HPPC-SOFTWARE-JDK18/hppc/target/surefire-reports/TEST-com.carrotsearch.hppc.CharIntScatterMapTest.xml was ignored because it was modified (2020-06-23 17:03:14.000) before task started (2020-07-29 13:38:56.766)
29-Jul-2020 13:38:58 File /var/atlassian/application-data/bamboo/xml-data/build-dir/HPPC-SOFTWARE-JDK18/hppc/target/surefire-reports/TEST-com.carrotsearch.hppc.CharLongHashMapTest.xml was ignored because it was modified (2020-06-23 17:03:13.000) before task started (2020-07-29 13:38:56.766)
29-Jul-2020 13:38:58 File /var/atlassian/application-data/bamboo/xml-data/build-dir/HPPC-SOFTWARE-JDK18/hppc/target/surefire-reports/TEST-com.carrotsearch.hppc.CharLongScatterMapTest.xml was ignored because it was modified (2020-06-23 17:03:14.000) before task started (2020-07-29 13:38:56.766)
29-Jul-2020 13:38:58 File /var/atlassian/application-data/bamboo/xml-data/build-dir/HPPC-SOFTWARE-JDK18/hppc/target/surefire-reports/TEST-com.carrotsearch.hppc.CharObjectHashMapTest.xml was ignored because it was modified (2020-06-23 17:03:14.000) before task started (2020-07-29 13:38:56.766)
29-Jul-2020 13:38:58 File /var/atlassian/application-data/bamboo/xml-data/build-dir/HPPC-SOFTWARE-JDK18/hppc/target/surefire-reports/TEST-com.carrotsearch.hppc.CharObjectScatterMapTest.xml was ignored because it was modified (2020-06-23 17:03:14.000) before task started (2020-07-29 13:38:56.766)
29-Jul-2020 13:38:58 File /var/atlassian/application-data/bamboo/xml-data/build-dir/HPPC-SOFTWARE-JDK18/hppc/target/surefire-reports/TEST-com.carrotsearch.hppc.CharScatterSetTest.xml was ignored because it was modified (2020-06-23 17:03:13.000) before task started (2020-07-29 13:38:56.766)
29-Jul-2020 13:38:58 File /var/atlassian/application-data/bamboo/xml-data/build-dir/HPPC-SOFTWARE-JDK18/hppc/target/surefire-reports/TEST-com.carrotsearch.hppc.CharShortHashMapTest.xml was ignored because it was modified (2020-06-23 17:03:13.000) before task started (2020-07-29 13:38:56.766)
29-Jul-2020 13:38:58 File /var/atlassian/application-data/bamboo/xml-data/build-dir/HPPC-SOFTWARE-JDK18/hppc/target/surefire-reports/TEST-com.carrotsearch.hppc.CharShortScatterMapTest.xml was ignored because it was modified (2020-06-23 17:03:13.000) before task started (2020-07-29 13:38:56.766)
29-Jul-2020 13:38:58 File /var/atlassian/application-data/bamboo/xml-data/build-dir/HPPC-SOFTWARE-JDK18/hppc/target/surefire-reports/TEST-com.carrotsearch.hppc.CharStackTest.xml was ignored because it was modified (2020-06-23 17:03:13.000) before task started (2020-07-29 13:38:56.766)
29-Jul-2020 13:38:58 File /var/atlassian/application-data/bamboo/xml-data/build-dir/HPPC-SOFTWARE-JDK18/hppc/target/surefire-reports/TEST-com.carrotsearch.hppc.ContainersTest.xml was ignored because it was modified (2020-06-23 17:03:13.000) before task started (2020-07-29 13:38:56.766)
29-Jul-2020 13:38:58 File /var/atlassian/application-data/bamboo/xml-data/build-dir/HPPC-SOFTWARE-JDK18/hppc/target/surefire-reports/TEST-com.carrotsearch.hppc.DoubleArrayDequeTest.xml was ignored because it was modified (2020-06-23 17:03:13.000) before task started (2020-07-29 13:38:56.766)
29-Jul-2020 13:38:58 File /var/atlassian/application-data/bamboo/xml-data/build-dir/HPPC-SOFTWARE-JDK18/hppc/target/surefire-reports/TEST-com.carrotsearch.hppc.DoubleArrayListTest.xml was ignored because it was modified (2020-06-23 17:03:13.000) before task started (2020-07-29 13:38:56.766)
29-Jul-2020 13:38:58 File /var/atlassian/application-data/bamboo/xml-data/build-dir/HPPC-SOFTWARE-JDK18/hppc/target/surefire-reports/TEST-com.carrotsearch.hppc.DoubleStackTest.xml was ignored because it was modified (2020-06-23 17:03:13.000) before task started (2020-07-29 13:38:56.766)
29-Jul-2020 13:38:58 File /var/atlassian/application-data/bamboo/xml-data/build-dir/HPPC-SOFTWARE-JDK18/hppc/target/surefire-reports/TEST-com.carrotsearch.hppc.EntryShiftingOnRemovalTest.xml was ignored because it was modified (2020-06-23 17:03:14.000) before task started (2020-07-29 13:38:56.766)
29-Jul-2020 13:38:58 File /var/atlassian/application-data/bamboo/xml-data/build-dir/HPPC-SOFTWARE-JDK18/hppc/target/surefire-reports/TEST-com.carrotsearch.hppc.FloatArrayDequeTest.xml was ignored because it was modified (2020-06-23 17:03:12.000) before task started (2020-07-29 13:38:56.766)
29-Jul-2020 13:38:58 File /var/atlassian/application-data/bamboo/xml-data/build-dir/HPPC-SOFTWARE-JDK18/hppc/target/surefire-reports/TEST-com.carrotsearch.hppc.FloatArrayListTest.xml was ignored because it was modified (2020-06-23 17:03:11.000) before task started (2020-07-29 13:38:56.766)
29-Jul-2020 13:38:58 File /var/atlassian/application-data/bamboo/xml-data/build-dir/HPPC-SOFTWARE-JDK18/hppc/target/surefire-reports/TEST-com.carrotsearch.hppc.FloatStackTest.xml was ignored because it was modified (2020-06-23 17:03:12.000) before task started (2020-07-29 13:38:56.766)
29-Jul-2020 13:38:58 File /var/atlassian/application-data/bamboo/xml-data/build-dir/HPPC-SOFTWARE-JDK18/hppc/target/surefire-reports/TEST-com.carrotsearch.hppc.HashCollisionsClusteringTest.xml was ignored because it was modified (2020-06-23 17:03:18.000) before task started (2020-07-29 13:38:56.766)
29-Jul-2020 13:38:58 File /var/atlassian/application-data/bamboo/xml-data/build-dir/HPPC-SOFTWARE-JDK18/hppc/target/surefire-reports/TEST-com.carrotsearch.hppc.HashContainersTest.xml was ignored because it was modified (2020-06-23 17:03:13.000) before task started (2020-07-29 13:38:56.766)
29-Jul-2020 13:38:58 File /var/atlassian/application-data/bamboo/xml-data/build-dir/HPPC-SOFTWARE-JDK18/hppc/target/surefire-reports/TEST-com.carrotsearch.hppc.IdentityMapsTest.xml was ignored because it was modified (2020-06-23 17:03:13.000) before task started (2020-07-29 13:38:56.766)
29-Jul-2020 13:38:58 File /var/atlassian/application-data/bamboo/xml-data/build-dir/HPPC-SOFTWARE-JDK18/hppc/target/surefire-reports/TEST-com.carrotsearch.hppc.IdentitySetsTest.xml was ignored because it was modified (2020-06-23 17:03:13.000) before task started (2020-07-29 13:38:56.766)
29-Jul-2020 13:38:58 File /var/atlassian/application-data/bamboo/xml-data/build-dir/HPPC-SOFTWARE-JDK18/hppc/target/surefire-reports/TEST-com.carrotsearch.hppc.IntArrayDequeTest.xml was ignored because it was modified (2020-06-23 17:03:13.000) before task started (2020-07-29 13:38:56.766)
29-Jul-2020 13:38:58 File /var/atlassian/application-data/bamboo/xml-data/build-dir/HPPC-SOFTWARE-JDK18/hppc/target/surefire-reports/TEST-com.carrotsearch.hppc.IntArrayListTest.xml was ignored because it was modified (2020-06-23 17:03:13.000) before task started (2020-07-29 13:38:56.766)
29-Jul-2020 13:38:58 File /var/atlassian/application-data/bamboo/xml-data/build-dir/HPPC-SOFTWARE-JDK18/hppc/target/surefire-reports/TEST-com.carrotsearch.hppc.IntByteHashMapTest.xml was ignored because it was modified (2020-06-23 17:03:12.000) before task started (2020-07-29 13:38:56.766)
29-Jul-2020 13:38:58 File /var/atlassian/application-data/bamboo/xml-data/build-dir/HPPC-SOFTWARE-JDK18/hppc/target/surefire-reports/TEST-com.carrotsearch.hppc.IntByteScatterMapTest.xml was ignored because it was modified (2020-06-23 17:03:13.000) before task started (2020-07-29 13:38:56.766)
29-Jul-2020 13:38:58 File /var/atlassian/application-data/bamboo/xml-data/build-dir/HPPC-SOFTWARE-JDK18/hppc/target/surefire-reports/TEST-com.carrotsearch.hppc.IntCharHashMapTest.xml was ignored because it was modified (2020-06-23 17:03:14.000) before task started (2020-07-29 13:38:56.766)
29-Jul-2020 13:38:58 File /var/atlassian/application-data/bamboo/xml-data/build-dir/HPPC-SOFTWARE-JDK18/hppc/target/surefire-reports/TEST-com.carrotsearch.hppc.IntCharScatterMapTest.xml was ignored because it was modified (2020-06-23 17:03:14.000) before task started (2020-07-29 13:38:56.766)
29-Jul-2020 13:38:58 File /var/atlassian/application-data/bamboo/xml-data/build-dir/HPPC-SOFTWARE-JDK18/hppc/target/surefire-reports/TEST-com.carrotsearch.hppc.IntDoubleHashMapTest.xml was ignored because it was modified (2020-06-23 17:03:15.000) before task started (2020-07-29 13:38:56.766)
29-Jul-2020 13:38:58 File /var/atlassian/application-data/bamboo/xml-data/build-dir/HPPC-SOFTWARE-JDK18/hppc/target/surefire-reports/TEST-com.carrotsearch.hppc.IntDoubleScatterMapTest.xml was ignored because it was modified (2020-06-23 17:03:15.000) before task started (2020-07-29 13:38:56.766)
29-Jul-2020 13:38:58 File /var/atlassian/application-data/bamboo/xml-data/build-dir/HPPC-SOFTWARE-JDK18/hppc/target/surefire-reports/TEST-com.carrotsearch.hppc.IntFloatHashMapTest.xml was ignored because it was modified (2020-06-23 17:03:12.000) before task started (2020-07-29 13:38:56.766)
29-Jul-2020 13:38:58 File /var/atlassian/application-data/bamboo/xml-data/build-dir/HPPC-SOFTWARE-JDK18/hppc/target/surefire-reports/TEST-com.carrotsearch.hppc.IntFloatScatterMapTest.xml was ignored because it was modified (2020-06-23 17:03:15.000) before task started (2020-07-29 13:38:56.766)
29-Jul-2020 13:38:58 File /var/atlassian/application-data/bamboo/xml-data/build-dir/HPPC-SOFTWARE-JDK18/hppc/target/surefire-reports/TEST-com.carrotsearch.hppc.IntHashSetTest.xml was ignored because it was modified (2020-06-23 17:03:15.000) before task started (2020-07-29 13:38:56.766)
29-Jul-2020 13:38:58 File /var/atlassian/application-data/bamboo/xml-data/build-dir/HPPC-SOFTWARE-JDK18/hppc/target/surefire-reports/TEST-com.carrotsearch.hppc.IntIntHashMapTest.xml was ignored because it was modified (2020-06-23 17:03:15.000) before task started (2020-07-29 13:38:56.766)
29-Jul-2020 13:38:58 File /var/atlassian/application-data/bamboo/xml-data/build-dir/HPPC-SOFTWARE-JDK18/hppc/target/surefire-reports/TEST-com.carrotsearch.hppc.IntIntScatterMapTest.xml was ignored because it was modified (2020-06-23 17:03:13.000) before task started (2020-07-29 13:38:56.766)
29-Jul-2020 13:38:58 File /var/atlassian/application-data/bamboo/xml-data/build-dir/HPPC-SOFTWARE-JDK18/hppc/target/surefire-reports/TEST-com.carrotsearch.hppc.IntLongHashMapTest.xml was ignored because it was modified (2020-06-23 17:03:11.000) before task started (2020-07-29 13:38:56.766)
29-Jul-2020 13:38:58 File /var/atlassian/application-data/bamboo/xml-data/build-dir/HPPC-SOFTWARE-JDK18/hppc/target/surefire-reports/TEST-com.carrotsearch.hppc.IntLongScatterMapTest.xml was ignored because it was modified (2020-06-23 17:03:11.000) before task started (2020-07-29 13:38:56.766)
29-Jul-2020 13:38:58 File /var/atlassian/application-data/bamboo/xml-data/build-dir/HPPC-SOFTWARE-JDK18/hppc/target/surefire-reports/TEST-com.carrotsearch.hppc.IntObjectHashMapTest.xml was ignored because it was modified (2020-06-23 17:03:11.000) before task started (2020-07-29 13:38:56.766)
29-Jul-2020 13:38:58 File /var/atlassian/application-data/bamboo/xml-data/build-dir/HPPC-SOFTWARE-JDK18/hppc/target/surefire-reports/TEST-com.carrotsearch.hppc.IntObjectScatterMapTest.xml was ignored because it was modified (2020-06-23 17:03:15.000) before task started (2020-07-29 13:38:56.766)
29-Jul-2020 13:38:58 File /var/atlassian/application-data/bamboo/xml-data/build-dir/HPPC-SOFTWARE-JDK18/hppc/target/surefire-reports/TEST-com.carrotsearch.hppc.IntScatterSetTest.xml was ignored because it was modified (2020-06-23 17:03:13.000) before task started (2020-07-29 13:38:56.766)
29-Jul-2020 13:38:58 File /var/atlassian/application-data/bamboo/xml-data/build-dir/HPPC-SOFTWARE-JDK18/hppc/target/surefire-reports/TEST-com.carrotsearch.hppc.IntShortHashMapTest.xml was ignored because it was modified (2020-06-23 17:03:12.000) before task started (2020-07-29 13:38:56.766)
29-Jul-2020 13:38:58 File /var/atlassian/application-data/bamboo/xml-data/build-dir/HPPC-SOFTWARE-JDK18/hppc/target/surefire-reports/TEST-com.carrotsearch.hppc.IntShortScatterMapTest.xml was ignored because it was modified (2020-06-23 17:03:12.000) before task started (2020-07-29 13:38:56.766)
29-Jul-2020 13:38:58 File /var/atlassian/application-data/bamboo/xml-data/build-dir/HPPC-SOFTWARE-JDK18/hppc/target/surefire-reports/TEST-com.carrotsearch.hppc.IntStackTest.xml was ignored because it was modified (2020-06-23 17:03:15.000) before task started (2020-07-29 13:38:56.766)
29-Jul-2020 13:38:58 File /var/atlassian/application-data/bamboo/xml-data/build-dir/HPPC-SOFTWARE-JDK18/hppc/target/surefire-reports/TEST-com.carrotsearch.hppc.LongArrayDequeTest.xml was ignored because it was modified (2020-06-23 17:03:11.000) before task started (2020-07-29 13:38:56.766)
29-Jul-2020 13:38:58 File /var/atlassian/application-data/bamboo/xml-data/build-dir/HPPC-SOFTWARE-JDK18/hppc/target/surefire-reports/TEST-com.carrotsearch.hppc.LongArrayListTest.xml was ignored because it was modified (2020-06-23 17:03:11.000) before task started (2020-07-29 13:38:56.766)
29-Jul-2020 13:38:58 File /var/atlassian/application-data/bamboo/xml-data/build-dir/HPPC-SOFTWARE-JDK18/hppc/target/surefire-reports/TEST-com.carrotsearch.hppc.LongByteHashMapTest.xml was ignored because it was modified (2020-06-23 17:03:11.000) before task started (2020-07-29 13:38:56.766)
29-Jul-2020 13:38:58 File /var/atlassian/application-data/bamboo/xml-data/build-dir/HPPC-SOFTWARE-JDK18/hppc/target/surefire-reports/TEST-com.carrotsearch.hppc.LongByteScatterMapTest.xml was ignored because it was modified (2020-06-23 17:03:12.000) before task started (2020-07-29 13:38:56.766)
29-Jul-2020 13:38:58 File /var/atlassian/application-data/bamboo/xml-data/build-dir/HPPC-SOFTWARE-JDK18/hppc/target/surefire-reports/TEST-com.carrotsearch.hppc.LongCharHashMapTest.xml was ignored because it was modified (2020-06-23 17:03:15.000) before task started (2020-07-29 13:38:56.766)
29-Jul-2020 13:38:58 File /var/atlassian/application-data/bamboo/xml-data/build-dir/HPPC-SOFTWARE-JDK18/hppc/target/surefire-reports/TEST-com.carrotsearch.hppc.LongCharScatterMapTest.xml was ignored because it was modified (2020-06-23 17:03:15.000) before task started (2020-07-29 13:38:56.766)
29-Jul-2020 13:38:58 File /var/atlassian/application-data/bamboo/xml-data/build-dir/HPPC-SOFTWARE-JDK18/hppc/target/surefire-reports/TEST-com.carrotsearch.hppc.LongDoubleHashMapTest.xml was ignored because it was modified (2020-06-23 17:03:16.000) before task started (2020-07-29 13:38:56.766)
29-Jul-2020 13:38:58 File /var/atlassian/application-data/bamboo/xml-data/build-dir/HPPC-SOFTWARE-JDK18/hppc/target/surefire-reports/TEST-com.carrotsearch.hppc.LongDoubleScatterMapTest.xml was ignored because it was modified (2020-06-23 17:03:11.000) before task started (2020-07-29 13:38:56.766)
29-Jul-2020 13:38:58 File /var/atlassian/application-data/bamboo/xml-data/build-dir/HPPC-SOFTWARE-JDK18/hppc/target/surefire-reports/TEST-com.carrotsearch.hppc.LongFloatHashMapTest.xml was ignored because it was modified (2020-06-23 17:03:16.000) before task started (2020-07-29 13:38:56.766)
29-Jul-2020 13:38:58 File /var/atlassian/application-data/bamboo/xml-data/build-dir/HPPC-SOFTWARE-JDK18/hppc/target/surefire-reports/TEST-com.carrotsearch.hppc.LongFloatScatterMapTest.xml was ignored because it was modified (2020-06-23 17:03:16.000) before task started (2020-07-29 13:38:56.766)
29-Jul-2020 13:38:58 File /var/atlassian/application-data/bamboo/xml-data/build-dir/HPPC-SOFTWARE-JDK18/hppc/target/surefire-reports/TEST-com.carrotsearch.hppc.LongHashSetTest.xml was ignored because it was modified (2020-06-23 17:03:16.000) before task started (2020-07-29 13:38:56.766)
29-Jul-2020 13:38:58 File /var/atlassian/application-data/bamboo/xml-data/build-dir/HPPC-SOFTWARE-JDK18/hppc/target/surefire-reports/TEST-com.carrotsearch.hppc.LongIntHashMapTest.xml was ignored because it was modified (2020-06-23 17:03:16.000) before task started (2020-07-29 13:38:56.766)
29-Jul-2020 13:38:58 File /var/atlassian/application-data/bamboo/xml-data/build-dir/HPPC-SOFTWARE-JDK18/hppc/target/surefire-reports/TEST-com.carrotsearch.hppc.LongIntScatterMapTest.xml was ignored because it was modified (2020-06-23 17:03:16.000) before task started (2020-07-29 13:38:56.766)
29-Jul-2020 13:38:58 File /var/atlassian/application-data/bamboo/xml-data/build-dir/HPPC-SOFTWARE-JDK18/hppc/target/surefire-reports/TEST-com.carrotsearch.hppc.LongLongHashMapTest.xml was ignored because it was modified (2020-06-23 17:03:16.000) before task started (2020-07-29 13:38:56.766)
29-Jul-2020 13:38:58 File /var/atlassian/application-data/bamboo/xml-data/build-dir/HPPC-SOFTWARE-JDK18/hppc/target/surefire-reports/TEST-com.carrotsearch.hppc.LongLongScatterMapTest.xml was ignored because it was modified (2020-06-23 17:03:16.000) before task started (2020-07-29 13:38:56.766)
29-Jul-2020 13:38:58 File /var/atlassian/application-data/bamboo/xml-data/build-dir/HPPC-SOFTWARE-JDK18/hppc/target/surefire-reports/TEST-com.carrotsearch.hppc.LongObjectHashMapTest.xml was ignored because it was modified (2020-06-23 17:03:13.000) before task started (2020-07-29 13:38:56.766)
29-Jul-2020 13:38:58 File /var/atlassian/application-data/bamboo/xml-data/build-dir/HPPC-SOFTWARE-JDK18/hppc/target/surefire-reports/TEST-com.carrotsearch.hppc.LongObjectScatterMapTest.xml was ignored because it was modified (2020-06-23 17:03:13.000) before task started (2020-07-29 13:38:56.766)
29-Jul-2020 13:38:58 File /var/atlassian/application-data/bamboo/xml-data/build-dir/HPPC-SOFTWARE-JDK18/hppc/target/surefire-reports/TEST-com.carrotsearch.hppc.LongScatterSetTest.xml was ignored because it was modified (2020-06-23 17:03:13.000) before task started (2020-07-29 13:38:56.766)
29-Jul-2020 13:38:58 File /var/atlassian/application-data/bamboo/xml-data/build-dir/HPPC-SOFTWARE-JDK18/hppc/target/surefire-reports/TEST-com.carrotsearch.hppc.LongShortHashMapTest.xml was ignored because it was modified (2020-06-23 17:03:15.000) before task started (2020-07-29 13:38:56.766)
29-Jul-2020 13:38:58 File /var/atlassian/application-data/bamboo/xml-data/build-dir/HPPC-SOFTWARE-JDK18/hppc/target/surefire-reports/TEST-com.carrotsearch.hppc.LongShortScatterMapTest.xml was ignored because it was modified (2020-06-23 17:03:13.000) before task started (2020-07-29 13:38:56.766)
29-Jul-2020 13:38:58 File /var/atlassian/application-data/bamboo/xml-data/build-dir/HPPC-SOFTWARE-JDK18/hppc/target/surefire-reports/TEST-com.carrotsearch.hppc.LongStackTest.xml was ignored because it was modified (2020-06-23 17:03:13.000) before task started (2020-07-29 13:38:56.766)
29-Jul-2020 13:38:58 File /var/atlassian/application-data/bamboo/xml-data/build-dir/HPPC-SOFTWARE-JDK18/hppc/target/surefire-reports/TEST-com.carrotsearch.hppc.NaNCornerCaseTest.xml was ignored because it was modified (2020-06-23 17:03:12.000) before task started (2020-07-29 13:38:56.766)
29-Jul-2020 13:38:58 File /var/atlassian/application-data/bamboo/xml-data/build-dir/HPPC-SOFTWARE-JDK18/hppc/target/surefire-reports/TEST-com.carrotsearch.hppc.ObjectArrayDequeTest.xml was ignored because it was modified (2020-06-23 17:03:13.000) before task started (2020-07-29 13:38:56.766)
29-Jul-2020 13:38:58 File /var/atlassian/application-data/bamboo/xml-data/build-dir/HPPC-SOFTWARE-JDK18/hppc/target/surefire-reports/TEST-com.carrotsearch.hppc.ObjectArrayListTest.xml was ignored because it was modified (2020-06-23 17:03:11.000) before task started (2020-07-29 13:38:56.766)
29-Jul-2020 13:38:58 File /var/atlassian/application-data/bamboo/xml-data/build-dir/HPPC-SOFTWARE-JDK18/hppc/target/surefire-reports/TEST-com.carrotsearch.hppc.ObjectByteHashMapTest.xml was ignored because it was modified (2020-06-23 17:03:11.000) before task started (2020-07-29 13:38:56.766)
29-Jul-2020 13:38:58 File /var/atlassian/application-data/bamboo/xml-data/build-dir/HPPC-SOFTWARE-JDK18/hppc/target/surefire-reports/TEST-com.carrotsearch.hppc.ObjectByteIdentityHashMapTest.xml was ignored because it was modified (2020-06-23 17:03:11.000) before task started (2020-07-29 13:38:56.766)
29-Jul-2020 13:38:58 File /var/atlassian/application-data/bamboo/xml-data/build-dir/HPPC-SOFTWARE-JDK18/hppc/target/surefire-reports/TEST-com.carrotsearch.hppc.ObjectByteScatterMapTest.xml was ignored because it was modified (2020-06-23 17:03:11.000) before task started (2020-07-29 13:38:56.766)
29-Jul-2020 13:38:58 File /var/atlassian/application-data/bamboo/xml-data/build-dir/HPPC-SOFTWARE-JDK18/hppc/target/surefire-reports/TEST-com.carrotsearch.hppc.ObjectCharHashMapTest.xml was ignored because it was modified (2020-06-23 17:03:11.000) before task started (2020-07-29 13:38:56.766)
29-Jul-2020 13:38:58 File /var/atlassian/application-data/bamboo/xml-data/build-dir/HPPC-SOFTWARE-JDK18/hppc/target/surefire-reports/TEST-com.carrotsearch.hppc.ObjectCharIdentityHashMapTest.xml was ignored because it was modified (2020-06-23 17:03:13.000) before task started (2020-07-29 13:38:56.766)
29-Jul-2020 13:38:58 File /var/atlassian/application-data/bamboo/xml-data/build-dir/HPPC-SOFTWARE-JDK18/hppc/target/surefire-reports/TEST-com.carrotsearch.hppc.ObjectCharScatterMapTest.xml was ignored because it was modified (2020-06-23 17:03:13.000) before task started (2020-07-29 13:38:56.766)
29-Jul-2020 13:38:58 File /var/atlassian/application-data/bamboo/xml-data/build-dir/HPPC-SOFTWARE-JDK18/hppc/target/surefire-reports/TEST-com.carrotsearch.hppc.ObjectDoubleHashMapTest.xml was ignored because it was modified (2020-06-23 17:03:13.000) before task started (2020-07-29 13:38:56.766)
29-Jul-2020 13:38:58 File /var/atlassian/application-data/bamboo/xml-data/build-dir/HPPC-SOFTWARE-JDK18/hppc/target/surefire-reports/TEST-com.carrotsearch.hppc.ObjectDoubleIdentityHashMapTest.xml was ignored because it was modified (2020-06-23 17:03:13.000) before task started (2020-07-29 13:38:56.766)
29-Jul-2020 13:38:58 File /var/atlassian/application-data/bamboo/xml-data/build-dir/HPPC-SOFTWARE-JDK18/hppc/target/surefire-reports/TEST-com.carrotsearch.hppc.ObjectDoubleScatterMapTest.xml was ignored because it was modified (2020-06-23 17:03:13.000) before task started (2020-07-29 13:38:56.766)
29-Jul-2020 13:38:58 File /var/atlassian/application-data/bamboo/xml-data/build-dir/HPPC-SOFTWARE-JDK18/hppc/target/surefire-reports/TEST-com.carrotsearch.hppc.ObjectFloatHashMapTest.xml was ignored because it was modified (2020-06-23 17:03:13.000) before task started (2020-07-29 13:38:56.766)
29-Jul-2020 13:38:58 File /var/atlassian/application-data/bamboo/xml-data/build-dir/HPPC-SOFTWARE-JDK18/hppc/target/surefire-reports/TEST-com.carrotsearch.hppc.ObjectFloatIdentityHashMapTest.xml was ignored because it was modified (2020-06-23 17:03:13.000) before task started (2020-07-29 13:38:56.766)
29-Jul-2020 13:38:58 File /var/atlassian/application-data/bamboo/xml-data/build-dir/HPPC-SOFTWARE-JDK18/hppc/target/surefire-reports/TEST-com.carrotsearch.hppc.ObjectFloatScatterMapTest.xml was ignored because it was modified (2020-06-23 17:03:11.000) before task started (2020-07-29 13:38:56.766)
29-Jul-2020 13:38:58 File /var/atlassian/application-data/bamboo/xml-data/build-dir/HPPC-SOFTWARE-JDK18/hppc/target/surefire-reports/TEST-com.carrotsearch.hppc.ObjectHashSetTest.xml was ignored because it was modified (2020-06-23 17:03:14.000) before task started (2020-07-29 13:38:56.766)
29-Jul-2020 13:38:58 File /var/atlassian/application-data/bamboo/xml-data/build-dir/HPPC-SOFTWARE-JDK18/hppc/target/surefire-reports/TEST-com.carrotsearch.hppc.ObjectIntHashMapRegressionTest.xml was ignored because it was modified (2020-06-23 17:03:13.000) before task started (2020-07-29 13:38:56.766)
29-Jul-2020 13:38:58 File /var/atlassian/application-data/bamboo/xml-data/build-dir/HPPC-SOFTWARE-JDK18/hppc/target/surefire-reports/TEST-com.carrotsearch.hppc.ObjectIntHashMapTest.xml was ignored because it was modified (2020-06-23 17:03:15.000) before task started (2020-07-29 13:38:56.766)
29-Jul-2020 13:38:58 File /var/atlassian/application-data/bamboo/xml-data/build-dir/HPPC-SOFTWARE-JDK18/hppc/target/surefire-reports/TEST-com.carrotsearch.hppc.ObjectIntIdentityHashMapTest.xml was ignored because it was modified (2020-06-23 17:03:13.000) before task started (2020-07-29 13:38:56.766)
29-Jul-2020 13:38:58 File /var/atlassian/application-data/bamboo/xml-data/build-dir/HPPC-SOFTWARE-JDK18/hppc/target/surefire-reports/TEST-com.carrotsearch.hppc.ObjectIntScatterMapTest.xml was ignored because it was modified (2020-06-23 17:03:12.000) before task started (2020-07-29 13:38:56.766)
29-Jul-2020 13:38:58 File /var/atlassian/application-data/bamboo/xml-data/build-dir/HPPC-SOFTWARE-JDK18/hppc/target/surefire-reports/TEST-com.carrotsearch.hppc.ObjectLongHashMapTest.xml was ignored because it was modified (2020-06-23 17:03:12.000) before task started (2020-07-29 13:38:56.766)
29-Jul-2020 13:38:58 File /var/atlassian/application-data/bamboo/xml-data/build-dir/HPPC-SOFTWARE-JDK18/hppc/target/surefire-reports/TEST-com.carrotsearch.hppc.ObjectLongIdentityHashMapTest.xml was ignored because it was modified (2020-06-23 17:03:12.000) before task started (2020-07-29 13:38:56.766)
29-Jul-2020 13:38:58 File /var/atlassian/application-data/bamboo/xml-data/build-dir/HPPC-SOFTWARE-JDK18/hppc/target/surefire-reports/TEST-com.carrotsearch.hppc.ObjectLongScatterMapTest.xml was ignored because it was modified (2020-06-23 17:03:13.000) before task started (2020-07-29 13:38:56.766)
29-Jul-2020 13:38:58 File /var/atlassian/application-data/bamboo/xml-data/build-dir/HPPC-SOFTWARE-JDK18/hppc/target/surefire-reports/TEST-com.carrotsearch.hppc.ObjectObjectHashMapTest.xml was ignored because it was modified (2020-06-23 17:03:13.000) before task started (2020-07-29 13:38:56.766)
29-Jul-2020 13:38:58 File /var/atlassian/application-data/bamboo/xml-data/build-dir/HPPC-SOFTWARE-JDK18/hppc/target/surefire-reports/TEST-com.carrotsearch.hppc.ObjectObjectIdentityHashMapTest.xml was ignored because it was modified (2020-06-23 17:03:12.000) before task started (2020-07-29 13:38:56.766)
29-Jul-2020 13:38:58 File /var/atlassian/application-data/bamboo/xml-data/build-dir/HPPC-SOFTWARE-JDK18/hppc/target/surefire-reports/TEST-com.carrotsearch.hppc.ObjectObjectScatterMapTest.xml was ignored because it was modified (2020-06-23 17:03:12.000) before task started (2020-07-29 13:38:56.766)
29-Jul-2020 13:38:58 File /var/atlassian/application-data/bamboo/xml-data/build-dir/HPPC-SOFTWARE-JDK18/hppc/target/surefire-reports/TEST-com.carrotsearch.hppc.ObjectScatterSetTest.xml was ignored because it was modified (2020-06-23 17:03:16.000) before task started (2020-07-29 13:38:56.766)
29-Jul-2020 13:38:58 File /var/atlassian/application-data/bamboo/xml-data/build-dir/HPPC-SOFTWARE-JDK18/hppc/target/surefire-reports/TEST-com.carrotsearch.hppc.ObjectShortHashMapTest.xml was ignored because it was modified (2020-06-23 17:03:16.000) before task started (2020-07-29 13:38:56.766)
29-Jul-2020 13:38:58 File /var/atlassian/application-data/bamboo/xml-data/build-dir/HPPC-SOFTWARE-JDK18/hppc/target/surefire-reports/TEST-com.carrotsearch.hppc.ObjectShortIdentityHashMapTest.xml was ignored because it was modified (2020-06-23 17:03:16.000) before task started (2020-07-29 13:38:56.766)
29-Jul-2020 13:38:58 File /var/atlassian/application-data/bamboo/xml-data/build-dir/HPPC-SOFTWARE-JDK18/hppc/target/surefire-reports/TEST-com.carrotsearch.hppc.ObjectShortScatterMapTest.xml was ignored because it was modified (2020-06-23 17:03:17.000) before task started (2020-07-29 13:38:56.766)
29-Jul-2020 13:38:58 File /var/atlassian/application-data/bamboo/xml-data/build-dir/HPPC-SOFTWARE-JDK18/hppc/target/surefire-reports/TEST-com.carrotsearch.hppc.ObjectStackTest.xml was ignored because it was modified (2020-06-23 17:03:17.000) before task started (2020-07-29 13:38:56.766)
29-Jul-2020 13:38:58 File /var/atlassian/application-data/bamboo/xml-data/build-dir/HPPC-SOFTWARE-JDK18/hppc/target/surefire-reports/TEST-com.carrotsearch.hppc.ShortArrayDequeTest.xml was ignored because it was modified (2020-06-23 17:03:13.000) before task started (2020-07-29 13:38:56.766)
29-Jul-2020 13:38:58 File /var/atlassian/application-data/bamboo/xml-data/build-dir/HPPC-SOFTWARE-JDK18/hppc/target/surefire-reports/TEST-com.carrotsearch.hppc.ShortArrayListTest.xml was ignored because it was modified (2020-06-23 17:03:12.000) before task started (2020-07-29 13:38:56.766)
29-Jul-2020 13:38:58 File /var/atlassian/application-data/bamboo/xml-data/build-dir/HPPC-SOFTWARE-JDK18/hppc/target/surefire-reports/TEST-com.carrotsearch.hppc.ShortByteHashMapTest.xml was ignored because it was modified (2020-06-23 17:03:13.000) before task started (2020-07-29 13:38:56.766)
29-Jul-2020 13:38:58 File /var/atlassian/application-data/bamboo/xml-data/build-dir/HPPC-SOFTWARE-JDK18/hppc/target/surefire-reports/TEST-com.carrotsearch.hppc.ShortByteScatterMapTest.xml was ignored because it was modified (2020-06-23 17:03:13.000) before task started (2020-07-29 13:38:56.766)
29-Jul-2020 13:38:58 File /var/atlassian/application-data/bamboo/xml-data/build-dir/HPPC-SOFTWARE-JDK18/hppc/target/surefire-reports/TEST-com.carrotsearch.hppc.ShortCharHashMapTest.xml was ignored because it was modified (2020-06-23 17:03:12.000) before task started (2020-07-29 13:38:56.766)
29-Jul-2020 13:38:58 File /var/atlassian/application-data/bamboo/xml-data/build-dir/HPPC-SOFTWARE-JDK18/hppc/target/surefire-reports/TEST-com.carrotsearch.hppc.ShortCharScatterMapTest.xml was ignored because it was modified (2020-06-23 17:03:11.000) before task started (2020-07-29 13:38:56.766)
29-Jul-2020 13:38:58 File /var/atlassian/application-data/bamboo/xml-data/build-dir/HPPC-SOFTWARE-JDK18/hppc/target/surefire-reports/TEST-com.carrotsearch.hppc.ShortDoubleHashMapTest.xml was ignored because it was modified (2020-06-23 17:03:12.000) before task started (2020-07-29 13:38:56.766)
29-Jul-2020 13:38:58 File /var/atlassian/application-data/bamboo/xml-data/build-dir/HPPC-SOFTWARE-JDK18/hppc/target/surefire-reports/TEST-com.carrotsearch.hppc.ShortDoubleScatterMapTest.xml was ignored because it was modified (2020-06-23 17:03:12.000) before task started (2020-07-29 13:38:56.766)
29-Jul-2020 13:38:58 File /var/atlassian/application-data/bamboo/xml-data/build-dir/HPPC-SOFTWARE-JDK18/hppc/target/surefire-reports/TEST-com.carrotsearch.hppc.ShortFloatHashMapTest.xml was ignored because it was modified (2020-06-23 17:03:13.000) before task started (2020-07-29 13:38:56.766)
29-Jul-2020 13:38:58 File /var/atlassian/application-data/bamboo/xml-data/build-dir/HPPC-SOFTWARE-JDK18/hppc/target/surefire-reports/TEST-com.carrotsearch.hppc.ShortFloatScatterMapTest.xml was ignored because it was modified (2020-06-23 17:03:13.000) before task started (2020-07-29 13:38:56.766)
29-Jul-2020 13:38:58 File /var/atlassian/application-data/bamboo/xml-data/build-dir/HPPC-SOFTWARE-JDK18/hppc/target/surefire-reports/TEST-com.carrotsearch.hppc.ShortHashSetTest.xml was ignored because it was modified (2020-06-23 17:03:13.000) before task started (2020-07-29 13:38:56.766)
29-Jul-2020 13:38:58 File /var/atlassian/application-data/bamboo/xml-data/build-dir/HPPC-SOFTWARE-JDK18/hppc/target/surefire-reports/TEST-com.carrotsearch.hppc.ShortIntHashMapTest.xml was ignored because it was modified (2020-06-23 17:03:12.000) before task started (2020-07-29 13:38:56.766)
29-Jul-2020 13:38:58 File /var/atlassian/application-data/bamboo/xml-data/build-dir/HPPC-SOFTWARE-JDK18/hppc/target/surefire-reports/TEST-com.carrotsearch.hppc.ShortIntScatterMapTest.xml was ignored because it was modified (2020-06-23 17:03:11.000) before task started (2020-07-29 13:38:56.766)
29-Jul-2020 13:38:58 File /var/atlassian/application-data/bamboo/xml-data/build-dir/HPPC-SOFTWARE-JDK18/hppc/target/surefire-reports/TEST-com.carrotsearch.hppc.ShortLongHashMapTest.xml was ignored because it was modified (2020-06-23 17:03:11.000) before task started (2020-07-29 13:38:56.766)
29-Jul-2020 13:38:58 File /var/atlassian/application-data/bamboo/xml-data/build-dir/HPPC-SOFTWARE-JDK18/hppc/target/surefire-reports/TEST-com.carrotsearch.hppc.ShortLongScatterMapTest.xml was ignored because it was modified (2020-06-23 17:03:11.000) before task started (2020-07-29 13:38:56.766)
29-Jul-2020 13:38:58 File /var/atlassian/application-data/bamboo/xml-data/build-dir/HPPC-SOFTWARE-JDK18/hppc/target/surefire-reports/TEST-com.carrotsearch.hppc.ShortObjectHashMapTest.xml was ignored because it was modified (2020-06-23 17:03:12.000) before task started (2020-07-29 13:38:56.766)
29-Jul-2020 13:38:58 File /var/atlassian/application-data/bamboo/xml-data/build-dir/HPPC-SOFTWARE-JDK18/hppc/target/surefire-reports/TEST-com.carrotsearch.hppc.ShortObjectScatterMapTest.xml was ignored because it was modified (2020-06-23 17:03:14.000) before task started (2020-07-29 13:38:56.766)
29-Jul-2020 13:38:58 File /var/atlassian/application-data/bamboo/xml-data/build-dir/HPPC-SOFTWARE-JDK18/hppc/target/surefire-reports/TEST-com.carrotsearch.hppc.ShortScatterSetTest.xml was ignored because it was modified (2020-06-23 17:03:13.000) before task started (2020-07-29 13:38:56.766)
29-Jul-2020 13:38:58 File /var/atlassian/application-data/bamboo/xml-data/build-dir/HPPC-SOFTWARE-JDK18/hppc/target/surefire-reports/TEST-com.carrotsearch.hppc.ShortShortHashMapTest.xml was ignored because it was modified (2020-06-23 17:03:15.000) before task started (2020-07-29 13:38:56.766)
29-Jul-2020 13:38:58 File /var/atlassian/application-data/bamboo/xml-data/build-dir/HPPC-SOFTWARE-JDK18/hppc/target/surefire-reports/TEST-com.carrotsearch.hppc.ShortShortScatterMapTest.xml was ignored because it was modified (2020-06-23 17:03:11.000) before task started (2020-07-29 13:38:56.766)
29-Jul-2020 13:38:58 File /var/atlassian/application-data/bamboo/xml-data/build-dir/HPPC-SOFTWARE-JDK18/hppc/target/surefire-reports/TEST-com.carrotsearch.hppc.ShortStackTest.xml was ignored because it was modified (2020-06-23 17:03:13.000) before task started (2020-07-29 13:38:56.766)
29-Jul-2020 13:38:58 File /var/atlassian/application-data/bamboo/xml-data/build-dir/HPPC-SOFTWARE-JDK18/hppc/target/surefire-reports/TEST-com.carrotsearch.hppc.StringConversionsTest.xml was ignored because it was modified (2020-06-23 17:03:13.000) before task started (2020-07-29 13:38:56.766)
29-Jul-2020 13:38:58 File /var/atlassian/application-data/bamboo/xml-data/build-dir/HPPC-SOFTWARE-JDK18/hppc/target/surefire-reports/TEST-com.carrotsearch.hppc.sorting.IndirectSortTest.xml was ignored because it was modified (2020-06-23 17:03:15.000) before task started (2020-07-29 13:38:56.766)
29-Jul-2020 13:38:58 Finished task 'Maven 3.x' with result: Failed
29-Jul-2020 13:38:58 Running post build plugin 'NCover Results Collector'
29-Jul-2020 13:38:58 Running post build plugin 'Artifact Copier'
29-Jul-2020 13:38:58 Running post build plugin 'npm Cache Cleanup'
29-Jul-2020 13:38:58 Running post build plugin 'Clover Results Collector'
29-Jul-2020 13:38:58 Running post build plugin 'Docker Container Cleanup'
29-Jul-2020 13:38:58 Finalising the build...
29-Jul-2020 13:38:58 Stopping timer.
29-Jul-2020 13:38:58 Build HPPC-SOFTWARE-JDK18-135 completed.
29-Jul-2020 13:38:58 Running on server: post build plugin 'NCover Results Collector'
29-Jul-2020 13:38:58 Running on server: post build plugin 'Build Hanging Detection Configuration'
29-Jul-2020 13:38:58 Running on server: post build plugin 'Clover Delta Calculator'
29-Jul-2020 13:38:58 Running on server: post build plugin 'Maven Dependencies Postprocessor'
29-Jul-2020 13:38:58 All post build plugins have finished
29-Jul-2020 13:38:58 Generating build results summary...
29-Jul-2020 13:38:58 Saving build results to disk...
29-Jul-2020 13:38:58 Logging substituted variables...
29-Jul-2020 13:38:58 Indexing build results...
29-Jul-2020 13:38:58 Finished building HPPC-SOFTWARE-JDK18-135.