Build #28

Build: #28 failed

Job: JDK 1.7 failed

Stages & jobs

  1. Compile and test

  2. Package

Job result summary

Completed
Duration
32 seconds
Revision
e3c14612eebbd382fb809cd62c30f71bab52a5b3 e3c14612eebbd382fb809cd62c30f71bab52a5b3
Total tests
3382
Failing since
#27 (Code changes detected – )
Fixed in
#29 (Manual run by Dawid Weiss)

Tests

  • 3,382 tests in total
  • 6 tests failed
  • 1 failure is new
  • 36 seconds taken in total.
New test failures 1
Status Test Duration
Collapse Failed ObjectLongOpenIdentityHashMapTest testClear History
< 1 sec
java.lang.AssertionError: expected:<true> but was:<false>
	at org.junit.Assert.fail(Assert.java:88)
	at org.junit.Assert.failNotEquals(Assert.java:743)
	at org.junit.Assert.assertEquals(Assert.java:118)
	at org.junit.Assert.assertEquals(Assert.java:144)
	at com.carrotsearch.hppc.ObjectLongOpenIdentityHashMapTest.testPutWithExpansions(ObjectLongOpenIdentityHashMapTest.java:179)
	at com.carrotsearch.hppc.ObjectLongOpenIdentityHashMapTest.testClear(ObjectLongOpenIdentityHashMapTest.java:363)
	at sun.reflect.NativeMethodAccessorImpl.invoke0(Native Method)
(20 more lines...)
Existing test failures 5
Status Test Failing since Duration
java.lang.AssertionError: expected:<348196966> but was:<1869675869>
	at org.junit.Assert.fail(Assert.java:88)
	at org.junit.Assert.failNotEquals(Assert.java:743)
	at org.junit.Assert.assertEquals(Assert.java:118)
	at org.junit.Assert.assertEquals(Assert.java:555)
	at org.junit.Assert.assertEquals(Assert.java:542)
	at com.carrotsearch.hppc.ObjectDoubleOpenIdentityHashMapTest.testHashCodeEquals(ObjectDoubleOpenIdentityHashMapTest.java:514)
	at sun.reflect.NativeMethodAccessorImpl.invoke0(Native Method)
(20 more lines...)
java.lang.AssertionError: expected:<2132564146> but was:<1280318645>
	at org.junit.Assert.fail(Assert.java:88)
	at org.junit.Assert.failNotEquals(Assert.java:743)
	at org.junit.Assert.assertEquals(Assert.java:118)
	at org.junit.Assert.assertEquals(Assert.java:555)
	at org.junit.Assert.assertEquals(Assert.java:542)
	at com.carrotsearch.hppc.ObjectDoubleOpenIdentityHashMapTest.testHashCodeEqualsDifferentPerturbance(ObjectDoubleOpenIdentityHashMapTest.java:555)
	at sun.reflect.NativeMethodAccessorImpl.invoke0(Native Method)
(20 more lines...)
java.lang.AssertionError: expected:<true> but was:<false>
	at org.junit.Assert.fail(Assert.java:88)
	at org.junit.Assert.failNotEquals(Assert.java:743)
	at org.junit.Assert.assertEquals(Assert.java:118)
	at org.junit.Assert.assertEquals(Assert.java:144)
	at com.carrotsearch.hppc.ObjectFloatOpenIdentityHashMapTest.testPutWithExpansions(ObjectFloatOpenIdentityHashMapTest.java:179)
	at com.carrotsearch.hppc.ObjectFloatOpenIdentityHashMapTest.testClear(ObjectFloatOpenIdentityHashMapTest.java:363)
	at sun.reflect.NativeMethodAccessorImpl.invoke0(Native Method)
(20 more lines...)
java.lang.AssertionError: expected:<1177033590> but was:<472987853>
	at org.junit.Assert.fail(Assert.java:88)
	at org.junit.Assert.failNotEquals(Assert.java:743)
	at org.junit.Assert.assertEquals(Assert.java:118)
	at org.junit.Assert.assertEquals(Assert.java:555)
	at org.junit.Assert.assertEquals(Assert.java:542)
	at com.carrotsearch.hppc.ObjectFloatOpenIdentityHashMapTest.testHashCodeEquals(ObjectFloatOpenIdentityHashMapTest.java:514)
	at sun.reflect.NativeMethodAccessorImpl.invoke0(Native Method)
(20 more lines...)
java.lang.AssertionError: expected:<786674033> but was:<1971622109>
	at org.junit.Assert.fail(Assert.java:88)
	at org.junit.Assert.failNotEquals(Assert.java:743)
	at org.junit.Assert.assertEquals(Assert.java:118)
	at org.junit.Assert.assertEquals(Assert.java:555)
	at org.junit.Assert.assertEquals(Assert.java:542)
	at com.carrotsearch.hppc.ObjectFloatOpenIdentityHashMapTest.testHashCodeEqualsDifferentPerturbance(ObjectFloatOpenIdentityHashMapTest.java:555)
	at sun.reflect.NativeMethodAccessorImpl.invoke0(Native Method)
(20 more lines...)