Build #28

Build: #28 failed

Job: JDK 1.6 failed

Stages & jobs

  1. Compile and test

  2. Package

Job result summary

Completed
Duration
30 seconds
Revision
e3c14612eebbd382fb809cd62c30f71bab52a5b3 e3c14612eebbd382fb809cd62c30f71bab52a5b3
Total tests
3382
Failing since
#27 (Code changes detected – )
Fixed in
#29 (Manual run by Dawid Weiss)

Tests

  • 3,382 tests in total
  • 5 tests failed
  • 1 failure is new
  • 31 seconds taken in total.
New test failures 1
Status Test Duration
Collapse Failed ObjectShortOpenIdentityHashMapTest testPutWithExpansions History
< 1 sec
java.lang.AssertionError: expected:<true> but was:<false>
	at org.junit.Assert.fail(Assert.java:88)
	at org.junit.Assert.failNotEquals(Assert.java:743)
	at org.junit.Assert.assertEquals(Assert.java:118)
	at org.junit.Assert.assertEquals(Assert.java:144)
	at com.carrotsearch.hppc.ObjectShortOpenIdentityHashMapTest.testPutWithExpansions(ObjectShortOpenIdentityHashMapTest.java:179)
	at sun.reflect.NativeMethodAccessorImpl.invoke0(Native Method)
	at sun.reflect.NativeMethodAccessorImpl.invoke(NativeMethodAccessorImpl.java:57)
(19 more lines...)
Existing test failures 4
Status Test Failing since Duration
java.lang.AssertionError: expected:<800458591> but was:<1271153891>
	at org.junit.Assert.fail(Assert.java:88)
	at org.junit.Assert.failNotEquals(Assert.java:743)
	at org.junit.Assert.assertEquals(Assert.java:118)
	at org.junit.Assert.assertEquals(Assert.java:555)
	at org.junit.Assert.assertEquals(Assert.java:542)
	at com.carrotsearch.hppc.ObjectDoubleOpenIdentityHashMapTest.testHashCodeEquals(ObjectDoubleOpenIdentityHashMapTest.java:514)
	at sun.reflect.NativeMethodAccessorImpl.invoke0(Native Method)
(20 more lines...)
java.lang.AssertionError: expected:<-1444533387> but was:<-347025437>
	at org.junit.Assert.fail(Assert.java:88)
	at org.junit.Assert.failNotEquals(Assert.java:743)
	at org.junit.Assert.assertEquals(Assert.java:118)
	at org.junit.Assert.assertEquals(Assert.java:555)
	at org.junit.Assert.assertEquals(Assert.java:542)
	at com.carrotsearch.hppc.ObjectDoubleOpenIdentityHashMapTest.testHashCodeEqualsDifferentPerturbance(ObjectDoubleOpenIdentityHashMapTest.java:555)
	at sun.reflect.NativeMethodAccessorImpl.invoke0(Native Method)
(20 more lines...)
java.lang.AssertionError: expected:<-236706839> but was:<2096217956>
	at org.junit.Assert.fail(Assert.java:88)
	at org.junit.Assert.failNotEquals(Assert.java:743)
	at org.junit.Assert.assertEquals(Assert.java:118)
	at org.junit.Assert.assertEquals(Assert.java:555)
	at org.junit.Assert.assertEquals(Assert.java:542)
	at com.carrotsearch.hppc.ObjectFloatOpenIdentityHashMapTest.testHashCodeEquals(ObjectFloatOpenIdentityHashMapTest.java:514)
	at sun.reflect.NativeMethodAccessorImpl.invoke0(Native Method)
(20 more lines...)
java.lang.AssertionError: expected:<329017827> but was:<1984919570>
	at org.junit.Assert.fail(Assert.java:88)
	at org.junit.Assert.failNotEquals(Assert.java:743)
	at org.junit.Assert.assertEquals(Assert.java:118)
	at org.junit.Assert.assertEquals(Assert.java:555)
	at org.junit.Assert.assertEquals(Assert.java:542)
	at com.carrotsearch.hppc.ObjectFloatOpenIdentityHashMapTest.testHashCodeEqualsDifferentPerturbance(ObjectFloatOpenIdentityHashMapTest.java:555)
	at sun.reflect.NativeMethodAccessorImpl.invoke0(Native Method)
(20 more lines...)