Build #59

Build: #59 failed Changes by Dawid Weiss

Stages & jobs

  1. Compile and test

  2. Package

Build result summary

Details

Completed
Duration
34 seconds
Labels
None
Revision
aa83c52aab3a877000199b128d1cc1b1e4a9ef39 aa83c52aab3a877000199b128d1cc1b1e4a9ef39
Total tests
5506
Failing since
#58 (Changes by Dawid Weiss)
Fixed in
#60 (Changes by Dawid Weiss)

Tests

Responsible

Code commits

Author Commit Message Commit date
Dawid Weiss Dawid Weiss aa83c52aab3a877000199b128d1cc1b1e4a9ef39 aa83c52aab3a877000199b128d1cc1b1e4a9ef39 HPPC-120: Rework entry shifting routine to be less hairy.
Dawid Weiss Dawid Weiss 0a6c657a8777e8da8c5d9799d503c87dfcd72753 0a6c657a8777e8da8c5d9799d503c87dfcd72753 Fix compilation error.
Dawid Weiss Dawid Weiss 61d4289f6d6edb59fc532bde0afcb3cf39b758c1 61d4289f6d6edb59fc532bde0afcb3cf39b758c1 HPPC-112: add a placeholder test to enable after maps are polished (sets go first).
Dawid Weiss Dawid Weiss b34b4c98291dbb129a8981900abffc02b8c3e7c1 b34b4c98291dbb129a8981900abffc02b8c3e7c1 HPPC-112: added ensureCapacity and tests to all containers.

Tests

New test failures 16
Status Test View job Duration
Collapse Failed ByteArrayDequeTest testRelease History
JDK 1.7 < 1 sec
java.lang.ArrayIndexOutOfBoundsException: 0
	at __randomizedtesting.SeedInfo.seed([A6D2AB6501C2130D:44B40D264C97CFDC]:0)
	at com.carrotsearch.hppc.ByteArrayDeque.addLast(ByteArrayDeque.java:171)
	at com.carrotsearch.hppc.ByteArrayDequeTest.testRelease(ByteArrayDequeTest.java:437)
	at sun.reflect.NativeMethodAccessorImpl.invoke0(Native Method)
	at sun.reflect.NativeMethodAccessorImpl.invoke(NativeMethodAccessorImpl.java:57)
	at sun.reflect.DelegatingMethodAccessorImpl.invoke(DelegatingMethodAccessorImpl.java:43)
	at java.lang.reflect.Method.invoke(Method.java:606)
(19 more lines...)
Collapse Failed ByteArrayDequeTest testRelease History
JDK 1.8 < 1 sec
java.lang.ArrayIndexOutOfBoundsException: 0
	at __randomizedtesting.SeedInfo.seed([3B8BD9EE241DEFD1:D9ED7FAD69483300]:0)
	at com.carrotsearch.hppc.ByteArrayDeque.addLast(ByteArrayDeque.java:171)
	at com.carrotsearch.hppc.ByteArrayDequeTest.testRelease(ByteArrayDequeTest.java:437)
	at sun.reflect.NativeMethodAccessorImpl.invoke0(Native Method)
	at sun.reflect.NativeMethodAccessorImpl.invoke(NativeMethodAccessorImpl.java:62)
	at sun.reflect.DelegatingMethodAccessorImpl.invoke(DelegatingMethodAccessorImpl.java:43)
	at java.lang.reflect.Method.invoke(Method.java:483)
(19 more lines...)
Collapse Failed CharArrayDequeTest testRelease History
JDK 1.7 < 1 sec
java.lang.ArrayIndexOutOfBoundsException: 0
	at __randomizedtesting.SeedInfo.seed([A6D2AB6501C2130D:44B40D264C97CFDC]:0)
	at com.carrotsearch.hppc.CharArrayDeque.addLast(CharArrayDeque.java:171)
	at com.carrotsearch.hppc.CharArrayDequeTest.testRelease(CharArrayDequeTest.java:437)
	at sun.reflect.NativeMethodAccessorImpl.invoke0(Native Method)
	at sun.reflect.NativeMethodAccessorImpl.invoke(NativeMethodAccessorImpl.java:57)
	at sun.reflect.DelegatingMethodAccessorImpl.invoke(DelegatingMethodAccessorImpl.java:43)
	at java.lang.reflect.Method.invoke(Method.java:606)
(19 more lines...)
Collapse Failed CharArrayDequeTest testRelease History
JDK 1.8 < 1 sec
java.lang.ArrayIndexOutOfBoundsException: 0
	at __randomizedtesting.SeedInfo.seed([3B8BD9EE241DEFD1:D9ED7FAD69483300]:0)
	at com.carrotsearch.hppc.CharArrayDeque.addLast(CharArrayDeque.java:171)
	at com.carrotsearch.hppc.CharArrayDequeTest.testRelease(CharArrayDequeTest.java:437)
	at sun.reflect.NativeMethodAccessorImpl.invoke0(Native Method)
	at sun.reflect.NativeMethodAccessorImpl.invoke(NativeMethodAccessorImpl.java:62)
	at sun.reflect.DelegatingMethodAccessorImpl.invoke(DelegatingMethodAccessorImpl.java:43)
	at java.lang.reflect.Method.invoke(Method.java:483)
(19 more lines...)
Collapse Failed DoubleArrayDequeTest testRelease History
JDK 1.7 < 1 sec
java.lang.ArrayIndexOutOfBoundsException: 0
	at __randomizedtesting.SeedInfo.seed([A6D2AB6501C2130D:44B40D264C97CFDC]:0)
	at com.carrotsearch.hppc.DoubleArrayDeque.addLast(DoubleArrayDeque.java:171)
	at com.carrotsearch.hppc.DoubleArrayDequeTest.testRelease(DoubleArrayDequeTest.java:437)
	at sun.reflect.NativeMethodAccessorImpl.invoke0(Native Method)
	at sun.reflect.NativeMethodAccessorImpl.invoke(NativeMethodAccessorImpl.java:57)
	at sun.reflect.DelegatingMethodAccessorImpl.invoke(DelegatingMethodAccessorImpl.java:43)
	at java.lang.reflect.Method.invoke(Method.java:606)
(19 more lines...)
Collapse Failed DoubleArrayDequeTest testRelease History
JDK 1.8 < 1 sec
java.lang.ArrayIndexOutOfBoundsException: 0
	at __randomizedtesting.SeedInfo.seed([3B8BD9EE241DEFD1:D9ED7FAD69483300]:0)
	at com.carrotsearch.hppc.DoubleArrayDeque.addLast(DoubleArrayDeque.java:171)
	at com.carrotsearch.hppc.DoubleArrayDequeTest.testRelease(DoubleArrayDequeTest.java:437)
	at sun.reflect.NativeMethodAccessorImpl.invoke0(Native Method)
	at sun.reflect.NativeMethodAccessorImpl.invoke(NativeMethodAccessorImpl.java:62)
	at sun.reflect.DelegatingMethodAccessorImpl.invoke(DelegatingMethodAccessorImpl.java:43)
	at java.lang.reflect.Method.invoke(Method.java:483)
(19 more lines...)
Collapse Failed FloatArrayDequeTest testRelease History
JDK 1.7 < 1 sec
java.lang.ArrayIndexOutOfBoundsException: 0
	at __randomizedtesting.SeedInfo.seed([A6D2AB6501C2130D:44B40D264C97CFDC]:0)
	at com.carrotsearch.hppc.FloatArrayDeque.addLast(FloatArrayDeque.java:171)
	at com.carrotsearch.hppc.FloatArrayDequeTest.testRelease(FloatArrayDequeTest.java:437)
	at sun.reflect.NativeMethodAccessorImpl.invoke0(Native Method)
	at sun.reflect.NativeMethodAccessorImpl.invoke(NativeMethodAccessorImpl.java:57)
	at sun.reflect.DelegatingMethodAccessorImpl.invoke(DelegatingMethodAccessorImpl.java:43)
	at java.lang.reflect.Method.invoke(Method.java:606)
(19 more lines...)
Collapse Failed FloatArrayDequeTest testRelease History
JDK 1.8 < 1 sec
java.lang.ArrayIndexOutOfBoundsException: 0
	at __randomizedtesting.SeedInfo.seed([3B8BD9EE241DEFD1:D9ED7FAD69483300]:0)
	at com.carrotsearch.hppc.FloatArrayDeque.addLast(FloatArrayDeque.java:171)
	at com.carrotsearch.hppc.FloatArrayDequeTest.testRelease(FloatArrayDequeTest.java:437)
	at sun.reflect.NativeMethodAccessorImpl.invoke0(Native Method)
	at sun.reflect.NativeMethodAccessorImpl.invoke(NativeMethodAccessorImpl.java:62)
	at sun.reflect.DelegatingMethodAccessorImpl.invoke(DelegatingMethodAccessorImpl.java:43)
	at java.lang.reflect.Method.invoke(Method.java:483)
(19 more lines...)
Collapse Failed IntArrayDequeTest testRelease History
JDK 1.7 < 1 sec
java.lang.ArrayIndexOutOfBoundsException: 0
	at __randomizedtesting.SeedInfo.seed([A6D2AB6501C2130D:44B40D264C97CFDC]:0)
	at com.carrotsearch.hppc.IntArrayDeque.addLast(IntArrayDeque.java:171)
	at com.carrotsearch.hppc.IntArrayDequeTest.testRelease(IntArrayDequeTest.java:437)
	at sun.reflect.NativeMethodAccessorImpl.invoke0(Native Method)
	at sun.reflect.NativeMethodAccessorImpl.invoke(NativeMethodAccessorImpl.java:57)
	at sun.reflect.DelegatingMethodAccessorImpl.invoke(DelegatingMethodAccessorImpl.java:43)
	at java.lang.reflect.Method.invoke(Method.java:606)
(19 more lines...)
Collapse Failed IntArrayDequeTest testRelease History
JDK 1.8 < 1 sec
java.lang.ArrayIndexOutOfBoundsException: 0
	at __randomizedtesting.SeedInfo.seed([3B8BD9EE241DEFD1:D9ED7FAD69483300]:0)
	at com.carrotsearch.hppc.IntArrayDeque.addLast(IntArrayDeque.java:171)
	at com.carrotsearch.hppc.IntArrayDequeTest.testRelease(IntArrayDequeTest.java:437)
	at sun.reflect.NativeMethodAccessorImpl.invoke0(Native Method)
	at sun.reflect.NativeMethodAccessorImpl.invoke(NativeMethodAccessorImpl.java:62)
	at sun.reflect.DelegatingMethodAccessorImpl.invoke(DelegatingMethodAccessorImpl.java:43)
	at java.lang.reflect.Method.invoke(Method.java:483)
(19 more lines...)
Collapse Failed LongArrayDequeTest testRelease History
JDK 1.7 < 1 sec
java.lang.ArrayIndexOutOfBoundsException: 0
	at __randomizedtesting.SeedInfo.seed([A6D2AB6501C2130D:44B40D264C97CFDC]:0)
	at com.carrotsearch.hppc.LongArrayDeque.addLast(LongArrayDeque.java:171)
	at com.carrotsearch.hppc.LongArrayDequeTest.testRelease(LongArrayDequeTest.java:437)
	at sun.reflect.NativeMethodAccessorImpl.invoke0(Native Method)
	at sun.reflect.NativeMethodAccessorImpl.invoke(NativeMethodAccessorImpl.java:57)
	at sun.reflect.DelegatingMethodAccessorImpl.invoke(DelegatingMethodAccessorImpl.java:43)
	at java.lang.reflect.Method.invoke(Method.java:606)
(19 more lines...)
Collapse Failed LongArrayDequeTest testRelease History
JDK 1.8 < 1 sec
java.lang.ArrayIndexOutOfBoundsException: 0
	at __randomizedtesting.SeedInfo.seed([3B8BD9EE241DEFD1:D9ED7FAD69483300]:0)
	at com.carrotsearch.hppc.LongArrayDeque.addLast(LongArrayDeque.java:171)
	at com.carrotsearch.hppc.LongArrayDequeTest.testRelease(LongArrayDequeTest.java:437)
	at sun.reflect.NativeMethodAccessorImpl.invoke0(Native Method)
	at sun.reflect.NativeMethodAccessorImpl.invoke(NativeMethodAccessorImpl.java:62)
	at sun.reflect.DelegatingMethodAccessorImpl.invoke(DelegatingMethodAccessorImpl.java:43)
	at java.lang.reflect.Method.invoke(Method.java:483)
(19 more lines...)
Collapse Failed ObjectArrayDequeTest testRelease History
JDK 1.7 < 1 sec
java.lang.ArrayIndexOutOfBoundsException: 0
	at __randomizedtesting.SeedInfo.seed([A6D2AB6501C2130D:44B40D264C97CFDC]:0)
	at com.carrotsearch.hppc.ObjectArrayDeque.addLast(ObjectArrayDeque.java:198)
	at com.carrotsearch.hppc.ObjectArrayDequeTest.testRelease(ObjectArrayDequeTest.java:439)
	at sun.reflect.NativeMethodAccessorImpl.invoke0(Native Method)
	at sun.reflect.NativeMethodAccessorImpl.invoke(NativeMethodAccessorImpl.java:57)
	at sun.reflect.DelegatingMethodAccessorImpl.invoke(DelegatingMethodAccessorImpl.java:43)
	at java.lang.reflect.Method.invoke(Method.java:606)
(19 more lines...)
Collapse Failed ObjectArrayDequeTest testRelease History
JDK 1.8 < 1 sec
java.lang.ArrayIndexOutOfBoundsException: 0
	at __randomizedtesting.SeedInfo.seed([3B8BD9EE241DEFD1:D9ED7FAD69483300]:0)
	at com.carrotsearch.hppc.ObjectArrayDeque.addLast(ObjectArrayDeque.java:198)
	at com.carrotsearch.hppc.ObjectArrayDequeTest.testRelease(ObjectArrayDequeTest.java:439)
	at sun.reflect.NativeMethodAccessorImpl.invoke0(Native Method)
	at sun.reflect.NativeMethodAccessorImpl.invoke(NativeMethodAccessorImpl.java:62)
	at sun.reflect.DelegatingMethodAccessorImpl.invoke(DelegatingMethodAccessorImpl.java:43)
	at java.lang.reflect.Method.invoke(Method.java:483)
(19 more lines...)
Collapse Failed ShortArrayDequeTest testRelease History
JDK 1.7 < 1 sec
java.lang.ArrayIndexOutOfBoundsException: 0
	at __randomizedtesting.SeedInfo.seed([A6D2AB6501C2130D:44B40D264C97CFDC]:0)
	at com.carrotsearch.hppc.ShortArrayDeque.addLast(ShortArrayDeque.java:171)
	at com.carrotsearch.hppc.ShortArrayDequeTest.testRelease(ShortArrayDequeTest.java:437)
	at sun.reflect.NativeMethodAccessorImpl.invoke0(Native Method)
	at sun.reflect.NativeMethodAccessorImpl.invoke(NativeMethodAccessorImpl.java:57)
	at sun.reflect.DelegatingMethodAccessorImpl.invoke(DelegatingMethodAccessorImpl.java:43)
	at java.lang.reflect.Method.invoke(Method.java:606)
(19 more lines...)
Collapse Failed ShortArrayDequeTest testRelease History
JDK 1.8 < 1 sec
java.lang.ArrayIndexOutOfBoundsException: 0
	at __randomizedtesting.SeedInfo.seed([3B8BD9EE241DEFD1:D9ED7FAD69483300]:0)
	at com.carrotsearch.hppc.ShortArrayDeque.addLast(ShortArrayDeque.java:171)
	at com.carrotsearch.hppc.ShortArrayDequeTest.testRelease(ShortArrayDequeTest.java:437)
	at sun.reflect.NativeMethodAccessorImpl.invoke0(Native Method)
	at sun.reflect.NativeMethodAccessorImpl.invoke(NativeMethodAccessorImpl.java:62)
	at sun.reflect.DelegatingMethodAccessorImpl.invoke(DelegatingMethodAccessorImpl.java:43)
	at java.lang.reflect.Method.invoke(Method.java:483)
(19 more lines...)

Jira issues

IssueDescriptionStatus
Unknown Issue TypeHPPC-112Could not obtain issue details from Jira
Unknown Issue TypeHPPC-120Could not obtain issue details from Jira