Build #38

Build: #38 failed Changes by Dawid Weiss

Stages & jobs

  1. Compile and test

  2. Package

Logs

The following logs have been generated by the jobs in this plan.
  • Expand all
  • Collapse all
Job Logs
Collapse JDK 1.6 Compile and test Download or View
05-Mar-2015 13:51:47 [INFO] Scanning for projects...
05-Mar-2015 13:51:47 [ERROR] The build could not read 1 project -> [Help 1]
05-Mar-2015 13:51:47 [ERROR]   
05-Mar-2015 13:51:47 [ERROR]   The project com.carrotsearch:hppc-parent:0.7.0-SNAPSHOT (E:\xml-data\build-dir\HPPC-SOFTWARE-JDK16\pom.xml) has 1 error
05-Mar-2015 13:51:47 [ERROR]     Child module E:\xml-data\build-dir\HPPC-SOFTWARE-JDK16\hppc-core of E:\xml-data\build-dir\HPPC-SOFTWARE-JDK16\pom.xml does not exist
05-Mar-2015 13:51:47 [ERROR]
05-Mar-2015 13:51:47 [ERROR] To see the full stack trace of the errors, re-run Maven with the -e switch.
05-Mar-2015 13:51:47 [ERROR] Re-run Maven using the -X switch to enable full debug logging.
05-Mar-2015 13:51:47 [ERROR]
05-Mar-2015 13:51:47 [ERROR] For more information about the errors and possible solutions, please read the following articles:
05-Mar-2015 13:51:47 [ERROR] [Help 1] http://cwiki.apache.org/confluence/display/MAVEN/ProjectBuildingException
Collapse JDK 1.7 Compile and test Download or View
05-Mar-2015 13:51:47 [INFO] Scanning for projects...
05-Mar-2015 13:51:48 [ERROR] The build could not read 1 project -> [Help 1]
05-Mar-2015 13:51:48 [ERROR]   
05-Mar-2015 13:51:48 [ERROR]   The project com.carrotsearch:hppc-parent:0.7.0-SNAPSHOT (E:\xml-data\build-dir\HPPC-SOFTWARE-JDK17\pom.xml) has 1 error
05-Mar-2015 13:51:48 [ERROR]     Child module E:\xml-data\build-dir\HPPC-SOFTWARE-JDK17\hppc-core\pom.xml of E:\xml-data\build-dir\HPPC-SOFTWARE-JDK17\pom.xml does not exist
05-Mar-2015 13:51:48 [ERROR]
05-Mar-2015 13:51:48 [ERROR] To see the full stack trace of the errors, re-run Maven with the -e switch.
05-Mar-2015 13:51:48 [ERROR] Re-run Maven using the -X switch to enable full debug logging.
05-Mar-2015 13:51:48 [ERROR]
05-Mar-2015 13:51:48 [ERROR] For more information about the errors and possible solutions, please read the following articles:
05-Mar-2015 13:51:48 [ERROR] [Help 1] http://cwiki.apache.org/confluence/display/MAVEN/ProjectBuildingException
Collapse JDK 1.8 Compile and test Download or View
05-Mar-2015 13:51:47 [INFO] Scanning for projects...
05-Mar-2015 13:51:47 [ERROR] The build could not read 1 project -> [Help 1]
05-Mar-2015 13:51:47 [ERROR]   
05-Mar-2015 13:51:47 [ERROR]   The project com.carrotsearch:hppc-parent:0.7.0-SNAPSHOT (E:\xml-data\build-dir\HPPC-SOFTWARE-JDK18\pom.xml) has 1 error
05-Mar-2015 13:51:47 [ERROR]     Child module E:\xml-data\build-dir\HPPC-SOFTWARE-JDK18\hppc-core\pom.xml of E:\xml-data\build-dir\HPPC-SOFTWARE-JDK18\pom.xml does not exist
05-Mar-2015 13:51:47 [ERROR]
05-Mar-2015 13:51:47 [ERROR] To see the full stack trace of the errors, re-run Maven with the -e switch.
05-Mar-2015 13:51:47 [ERROR] Re-run Maven using the -X switch to enable full debug logging.
05-Mar-2015 13:51:47 [ERROR]
05-Mar-2015 13:51:47 [ERROR] For more information about the errors and possible solutions, please read the following articles:
05-Mar-2015 13:51:47 [ERROR] [Help 1] http://cwiki.apache.org/confluence/display/MAVEN/ProjectBuildingException