Build #28

Build: #28 failed Changes by Dawid Weiss

Stages & jobs

  1. Compile and test

  2. Package

Logs

The following logs have been generated by the jobs in this plan.
  • Expand all
  • Collapse all
Job Logs
Collapse JDK 1.6 Compile and test Download or View
06-Sep-2014 23:48:39 [INFO] ------------------------------------------------------------------------
06-Sep-2014 23:48:39 [INFO] Reactor Summary:
06-Sep-2014 23:48:39 [INFO]
06-Sep-2014 23:48:39 [INFO] HPPC (parent POM) ................................. SUCCESS [0.486s]
06-Sep-2014 23:48:39 [INFO] HPPC Template Processor ........................... SUCCESS [1.387s]
06-Sep-2014 23:48:39 [INFO] HPPC Collections .................................. FAILURE [27.003s]
06-Sep-2014 23:48:39 [INFO] HPPC Examples ..................................... SKIPPED
06-Sep-2014 23:48:39 [INFO] HPPC Benchmarks ................................... SKIPPED
06-Sep-2014 23:48:39 [INFO] ------------------------------------------------------------------------
06-Sep-2014 23:48:39 [INFO] BUILD FAILURE
06-Sep-2014 23:48:39 [INFO] ------------------------------------------------------------------------
06-Sep-2014 23:48:39 [INFO] Total time: 29.180s
06-Sep-2014 23:48:39 [INFO] Finished at: Sat Sep 06 23:48:39 CEST 2014
06-Sep-2014 23:48:39 [INFO] Final Memory: 34M/1351M
06-Sep-2014 23:48:39 [INFO] ------------------------------------------------------------------------
06-Sep-2014 23:48:39 [ERROR] Failed to execute goal com.carrotsearch.randomizedtesting:junit4-maven-plugin:2.1.3:junit4 (junit4-tests) on project hppc: Execution junit4-tests of goal com.carrotsearch.randomizedtesting:junit4-maven-plugin:2.1.3:junit4 failed: /mnt/work/bamboo-home/xml-data/build-dir/HPPC-SOFTWARE-JDK16/hppc-core/target/junit4-ant-5673194772202591765.xml:16: There were test failures: 121 suites, 3474 tests, 5 failures, 92 ignored (92 assumptions) -> [Help 1]
06-Sep-2014 23:48:39 [ERROR]
06-Sep-2014 23:48:39 [ERROR] To see the full stack trace of the errors, re-run Maven with the -e switch.
06-Sep-2014 23:48:39 [ERROR] Re-run Maven using the -X switch to enable full debug logging.
06-Sep-2014 23:48:39 [ERROR]
06-Sep-2014 23:48:39 [ERROR] For more information about the errors and possible solutions, please read the following articles:
06-Sep-2014 23:48:39 [ERROR] [Help 1] http://cwiki.apache.org/confluence/display/MAVEN/PluginExecutionException
06-Sep-2014 23:48:39 [ERROR]
06-Sep-2014 23:48:39 [ERROR] After correcting the problems, you can resume the build with the command
06-Sep-2014 23:48:39 [ERROR]   mvn <goals> -rf :hppc
Collapse JDK 1.7 Compile and test Download or View
06-Sep-2014 23:48:38 [INFO] ------------------------------------------------------------------------
06-Sep-2014 23:48:38 [INFO] Reactor Summary:
06-Sep-2014 23:48:38 [INFO]
06-Sep-2014 23:48:38 [INFO] HPPC (parent POM) ................................. SUCCESS [0.401s]
06-Sep-2014 23:48:38 [INFO] HPPC Template Processor ........................... SUCCESS [1.160s]
06-Sep-2014 23:48:38 [INFO] HPPC Collections .................................. FAILURE [29.114s]
06-Sep-2014 23:48:38 [INFO] HPPC Examples ..................................... SKIPPED
06-Sep-2014 23:48:38 [INFO] HPPC Benchmarks ................................... SKIPPED
06-Sep-2014 23:48:38 [INFO] ------------------------------------------------------------------------
06-Sep-2014 23:48:38 [INFO] BUILD FAILURE
06-Sep-2014 23:48:38 [INFO] ------------------------------------------------------------------------
06-Sep-2014 23:48:38 [INFO] Total time: 30.886s
06-Sep-2014 23:48:38 [INFO] Finished at: Sat Sep 06 23:48:38 CEST 2014
06-Sep-2014 23:48:38 [INFO] Final Memory: 31M/1378M
06-Sep-2014 23:48:38 [INFO] ------------------------------------------------------------------------
06-Sep-2014 23:48:38 [ERROR] Failed to execute goal com.carrotsearch.randomizedtesting:junit4-maven-plugin:2.1.3:junit4 (junit4-tests) on project hppc: Execution junit4-tests of goal com.carrotsearch.randomizedtesting:junit4-maven-plugin:2.1.3:junit4 failed: /mnt/work/bamboo-home/xml-data/build-dir/HPPC-SOFTWARE-JDK17/hppc-core/target/junit4-ant-3173172025178172967.xml:16: There were test failures: 121 suites, 3474 tests, 6 failures, 92 ignored (92 assumptions) -> [Help 1]
06-Sep-2014 23:48:38 [ERROR]
06-Sep-2014 23:48:38 [ERROR] To see the full stack trace of the errors, re-run Maven with the -e switch.
06-Sep-2014 23:48:38 [ERROR] Re-run Maven using the -X switch to enable full debug logging.
06-Sep-2014 23:48:38 [ERROR]
06-Sep-2014 23:48:38 [ERROR] For more information about the errors and possible solutions, please read the following articles:
06-Sep-2014 23:48:38 [ERROR] [Help 1] http://cwiki.apache.org/confluence/display/MAVEN/PluginExecutionException
06-Sep-2014 23:48:38 [ERROR]
06-Sep-2014 23:48:38 [ERROR] After correcting the problems, you can resume the build with the command
06-Sep-2014 23:48:38 [ERROR]   mvn <goals> -rf :hppc
Collapse JDK 1.8 Compile and test Download or View
06-Sep-2014 23:48:38 [INFO] ------------------------------------------------------------------------
06-Sep-2014 23:48:38 [INFO] Reactor Summary:
06-Sep-2014 23:48:38 [INFO]
06-Sep-2014 23:48:38 [INFO] HPPC (parent POM) ................................. SUCCESS [0.317s]
06-Sep-2014 23:48:38 [INFO] HPPC Template Processor ........................... SUCCESS [1.236s]
06-Sep-2014 23:48:38 [INFO] HPPC Collections .................................. FAILURE [27.618s]
06-Sep-2014 23:48:38 [INFO] HPPC Examples ..................................... SKIPPED
06-Sep-2014 23:48:38 [INFO] HPPC Benchmarks ................................... SKIPPED
06-Sep-2014 23:48:38 [INFO] ------------------------------------------------------------------------
06-Sep-2014 23:48:38 [INFO] BUILD FAILURE
06-Sep-2014 23:48:38 [INFO] ------------------------------------------------------------------------
06-Sep-2014 23:48:38 [INFO] Total time: 29.325s
06-Sep-2014 23:48:38 [INFO] Finished at: Sat Sep 06 23:48:38 CEST 2014
06-Sep-2014 23:48:38 [INFO] Final Memory: 22M/687M
06-Sep-2014 23:48:38 [INFO] ------------------------------------------------------------------------
06-Sep-2014 23:48:38 [ERROR] Failed to execute goal com.carrotsearch.randomizedtesting:junit4-maven-plugin:2.1.3:junit4 (junit4-tests) on project hppc: Execution junit4-tests of goal com.carrotsearch.randomizedtesting:junit4-maven-plugin:2.1.3:junit4 failed: /mnt/work/bamboo-home/xml-data/build-dir/HPPC-SOFTWARE-JDK18/hppc-core/target/junit4-ant-1954323887723051520.xml:16: There were test failures: 121 suites, 3474 tests, 4 failures, 92 ignored (92 assumptions) -> [Help 1]
06-Sep-2014 23:48:38 [ERROR]
06-Sep-2014 23:48:38 [ERROR] To see the full stack trace of the errors, re-run Maven with the -e switch.
06-Sep-2014 23:48:38 [ERROR] Re-run Maven using the -X switch to enable full debug logging.
06-Sep-2014 23:48:38 [ERROR]
06-Sep-2014 23:48:38 [ERROR] For more information about the errors and possible solutions, please read the following articles:
06-Sep-2014 23:48:38 [ERROR] [Help 1] http://cwiki.apache.org/confluence/display/MAVEN/PluginExecutionException
06-Sep-2014 23:48:38 [ERROR]
06-Sep-2014 23:48:38 [ERROR] After correcting the problems, you can resume the build with the command
06-Sep-2014 23:48:38 [ERROR]   mvn <goals> -rf :hppc